{"text_format":"1","workbook":"xlsx","n_sheets":5,"sheets":["Instructions","Input","Parameters","Inflation","Publish"],"not_rendered":{"charts":0,"images":0,"macros":1,"external_links":0,"defined_names":28,"comments":0,"pivot_tables":0},"unopened":[],"bounds":{"document_bytes":16777216,"sheet_cells":100000,"rows_first":2000,"rows_last":500,"rows_between":2000,"halvings":0,"cell_chars":16384,"cell_head_chars":4096},"cells_cut":0,"cells_raw":0,"read":"whole","date_system":"1900"}

{"sheet":"Instructions","index":0,"n_rows":23,"n_cols":4,"rows_kept":23,"cut":false,"hidden":false,"merged":[]}
[]
[null,"TERM-Lite Inventory Publisher"]
[null,"for the Transit Economic Requirements Model"]
[]
[null,"Add Data"]
[null,null,"Complete all white cells. Non-white cells are protected and cannot be selected. "]
[null,null,null,"Tip: If pasting from another workbook, use the \"Paste Special as Values\" option to avoid losing the data validation features."]
[null,null,null,"Tip: If more rows are needed, type in the number of cells (1 to 1,000) and click on \"Add\""]
[]
[null,"Review Costs (Optional)"]
[null,null,"Adjust the \"Base Year\" field above the \"Cost\" columns to see how costs are normalized"]
[null,null,null,"Tip: This is for informational purposes only. You will again be asked to specify the Base Year once using the TERM model."]
[]
[null,"Removing unwanted Record/Data Rows"]
[null,null,"Before publishing, remove all unused or undesired rows"]
[null,null,null,"Tip: Click \"Delete Records with no Description\" to remove excess or unused rows. Make sure all valid records have descriptions first."]
[null,null,null,"Tip: To delete specific records or continuous ranges of records, select the rows in any editable column and click \"Delete Selected Records\""]
[]
[null,"Publish"]
[null,null,"Method #1: Click the \"Publish Inventory\" button in the top left corner of the screen"]
{"$rows_left_out":4}
{"sheet":"Input","index":1,"n_rows":431,"n_cols":54,"rows_kept":431,"cut":false,"hidden":false,"merged":[[2,9,2,10]]}
[]
[null,null,"TERM-Lite Inventory Publisher",null,null,null,null,null,null,{"$f":"\"Currently, there are \"&TEXT(ROWS(rows.input),\"#,##0\")&\" record\"&IF(ROWS(rows.input)=1,\"\",\"s\")","v":"Currently, there are 422 records"}]
[null,null,"for the Transit Economic Requirements Model",null,null,null,null,null,null,1,null,null,null,null,null,"«",null,null,null,null,null,"Base Year"]
[null,null,null,null,null,null,null,null,null,null,null,null,null,"«",null,"Replacement Cost (original)",null,null,null,null,"«",2015,null,null,null,null,"Delayed"]
[null,null,null,"« (mandatory)",null,"«",null,"«",null,"«",null,null,"Expan-","Year",null,"Unit","Acquisition","Repl.","Soft",null,"Cost","Repl.",null,"Useful",null,"«","Replacement",null,null,null,"Additional Asset Information",null,null,null,null,null,null,null,null,null,null,null,null,null,null,null,null,null,null,null,null,null,"Data Information"]
[null,null,"Record","Mode",null,"Description",null,"Asset Classification",null,"Quantity","Unit",null,"sion?","Built",null,"Cost ($)","Cost ($)","Cost ($)","Cost",null,"Year","Cost ($)",null,"Life",null,"Priority","Age",null,"Additional Notes",null,"Department/Owner","Project #","Project Cat.","Project Description","Asset Type","Make/Model","Asset ID","Parent ID","Area","Sub-Area","Line/Route","Start","End","Latitude","Longitude","Address","Agency Cond. Rating","User Defined 1","User Defined 2","User Defined 3","User Defined 4",null,"Year","Source"]
[null,{"$f":"SUM(rows.input B:B)","v":0},null,"Range copied when records are added"]
[null,{"$f":"1-NOT(ISBLANK(D8))*NOT(ISBLANK(F8))*NOT(ISBLANK(H8))*NOT(ISBLANK(J8))*NOT(ISBLANK(N8))*NOT(ISBLANK(U8))*NOT(ISBLANK(M8))*NOT(AND(ISBLANK(P8),ISBLANK(Q8)))*NOT(ISBLANK(Z8))","v":1},{"$f":"OFFSET(C8,-1,0)+1","v":1},null,null,null," ",null," ",null,null," ","No",null,null,null,null,{"$f":"IF(P8=\"\",Q8,J8*P8)","v":0},null,null,null,{"$f":"IFERROR(R8*INDEX(rng.CostIndexMeans,MATCH(rng.ConstantYear,rng.CostIndexYear,0))/INDEX(rng.CostIndexMeans,MATCH(U8,rng.CostIndexYear,0))*(1+S8),\"\")","v":""},null,null,{"$f":"IFERROR(TEXT(INDEX(rng.ClassEDL,MATCH(H8,rng.ClassChoice,0)),\"0\")&\" Yrs    \",\"\")","v":""},"Normal",null,null,null," ",null,null,null,null,null,null,null,null,null,null,null,null,null,null,null,null,null,null,null,null,null," ",null,"TERM Data Publisher"]
[]
[null,{"$f":"1-NOT(ISBLANK(D10))*NOT(ISBLANK(F10))*NOT(ISBLANK(H10))*NOT(ISBLANK(J10))*NOT(ISBLANK(N10))*NOT(ISBLANK(U10))*NOT(ISBLANK(M10))*NOT(AND(ISBLANK(P10),ISBLANK(Q10)))*NOT(ISBLANK(Z10))","v":0},{"$f":"OFFSET(C10,-1,0)+1","v":1},"CR - Commuter Rail",null,"Rail Commuter Rail"," ","21221 - Facilities, Buildings, Maintenance, Rail Commuter Rail"," ",1,"Each"," ","No",1966,null,30000000,null,{"$f":"IF(P10=\"\",Q10,J10*P10)","v":30000000},0.1,null,2001,{"$f":"IFERROR(R10*INDEX(rng.CostIndexMeans,MATCH(rng.ConstantYear,rng.CostIndexYear,0))/INDEX(rng.CostIndexMeans,MATCH(U10,rng.CostIndexYear,0))*(1+S10),\"\")","v":43187573.96449703},null,60,{"$f":"IFERROR(TEXT(INDEX(rng.ClassEDL,MATCH(H10,rng.ClassChoice,0)),\"0\")&\" Yrs    \",\"\")","v":"80 Yrs    "},"Normal",null,null,null," ",null,"MJW-GW-BT-TT-3.5-K",null,null,null,null,"30-675-865",null,"Systemwide","","",null,null,null,null,null,null,null,null,null,null," "]
[null,0,2,"CR - Commuter Rail",null,"Rail Commuter Rail"," ","21221 - Facilities, Buildings, Maintenance, Rail Commuter Rail"," ",1,"Each"," ","No",1966,null,30000000,null,30000000,0.1,null,2001,43187573.96449703,null,60,"80 Yrs    ","Normal",null,null,null," ",null,"MJW-GW-BT-TT-3.5-K",null,null,null,null,"30-675-865",null,"Systemwide","","",null,null,null,null,null,null,null,null,null,null," "]
[null,0,3,"CR - Commuter Rail",null,"Rail Commuter Rail"," ","23311 - Facilities, Equipment, Maintenance, Rail Commuter Rail"," ",1,"Each"," ","No",2011,null,6254086.7659999998,null,6254086.7659999998,0.1,null,2000,9206085.8954932671,null,15,"15 Yrs    ","Normal",null,null,null," ",null,"WVE-ES-OCS0195-FD-JA-2.2-Y",null,null,null,null,"06-599-166",null,"South","","",null,null,null,null,null,null,null,null,null,null," "]
[null,0,4,"CR - Commuter Rail",null,"Rail Commuter Rail"," ","23311 - Facilities, Equipment, Maintenance, Rail Commuter Rail"," ",5,"Each"," ","No",1966,null,1006537.4689,null,5032687.3444999997,0.1,null,1955,39036091.716476873,null,15,"15 Yrs    ","Normal",null,null,null," ",null,"CRS1-GW-BT-TT-10.1-K",null,null,null,null,"27-650-648",null,"North","","",null,null,null,null,null,null,null,null,null,null," "]
[null,0,5,"CR - Commuter Rail",null,"Grade Crossing Commuter Rail"," ","10211 - Guideway Elements, Guideway, At Grade-In-Street, Grade Crossing Commuter Rail"," ",41,"Ea"," ","No",2023,null,353722.0404,null,14502603.656400001,0,null,2013,14892059.569132145,null,18,"20 Yrs    ","Normal",null,null,null," ",null,"WVE-ES-OCS0195-FD-JA-2.2-Y",null,null,null,null,"48-450-217",null,"North Line","North","",null,null,null,null,null,null,null,null,null,null," "]
[null,0,6,"CR - Commuter Rail",null,"Grade Crossing Commuter Rail"," ","10211 - Guideway Elements, Guideway, At Grade-In-Street, Grade Crossing Commuter Rail"," ",1750,"LF"," ","No",2019,null,187.8432,null,328725.59999999998,0,null,2013,337553.26512962824,null,18,"20 Yrs    ","Normal",null,null,null," ",null,"WVE-ES-OCS0195-FD-JA-2.2-Y",null,null,null,null,"93-280-382",null,"South Line","North","",null,null,null,null,null,null,null,null,null,null," "]
[null,0,7,"CR - Commuter Rail",null,"Grade Crossing Commuter Rail"," ","10211 - Guideway Elements, Guideway, At Grade-In-Street, Grade Crossing Commuter Rail"," ",4,"Ea"," ","No",2019,null,188.53380000000001,null,754.13520000000005,0,null,2013,774.38690235620618,null,18,"20 Yrs    ","Normal",null,null,null," ",null,"CRN1-GW-BT-TT-32.7-K",null,null,null,null,"90-187-567",null,"North Line","Central","",null,null,null,null,null,null,null,null,null,null," "]
[null,0,8,"CR - Commuter Rail",null,"Grade Crossing Commuter Rail"," ","10211 - Guideway Elements, Guideway, At Grade-In-Street, Grade Crossing Commuter Rail"," ",1,"LF"," ","No",2022,null,493088.52429999999,null,493088.52429999999,0,null,2013,506330.02533242025,null,18,"20 Yrs    ","Normal",null,null,null," ",null,"CRS2-GW-BT-TT-30.1-K",null,null,null,null,"50-638-241",null,"North Line","","",null,null,null,null,null,null,null,null,null,null," "]
[null,0,9,"CR - Commuter Rail",null,"Grade Crossing Commuter Rail"," ","10211 - Guideway Elements, Guideway, At Grade-In-Street, Grade Crossing Commuter Rail"," ",72,"LF"," ","No",2010,null,187.9967,null,13535.7624,0,null,2013,13899.254558023023,null,18,"20 Yrs    ","Normal",null,null,null," ",null,"CRN1-GW-BT-TT-32.7-K",null,null,null,null,"02-717-323",null,"South Line","","",null,null,null,null,null,null,null,null,null,null," "]
[null,0,10,"CR - Commuter Rail",null,"Bridge Commuter Rail"," ","10331 - Guideway Elements, Guideway, Elevated Structure, Bridge Commuter Rail"," ",500,"LF"," ","No",2019,null,34992.4084,null,17496204.199999999,0,null,2013,17966050.879775461,null,null,"100 Yrs    ","Normal",null,null,null," ",null,"CRN1-GW-BT-TT-19.1-K",null,null,null,null,"15-381-940",null,"South Line","Central","",null,null,null,null,null,null,null,null,null,null," "]
[null,0,11,"CR - Commuter Rail",null,"Bridge Commuter Rail"," ","10331 - Guideway Elements, Guideway, Elevated Structure, Bridge Commuter Rail"," ",700,"LF"," ","No",2019,null,34992.4084,null,24494685.879999999,0,null,2013,25152471.231685638,null,null,"100 Yrs    ","Normal",null,null,null," ",null,"CRS2-GW-BT-TT-0.1-K",null,null,null,null,"15-381-940",null,"North Line","South","",null,null,null,null,null,null,null,null,null,null," "]
{"$rows_left_out":412}
{"sheet":"Parameters","index":2,"n_rows":634,"n_cols":9,"rows_kept":634,"cut":false,"hidden":true,"merged":[]}
[null,"Paramaters"]
[]
[null,"= list.priority"]
[null,"Funded"]
[null,"Deficient"]
[null,"Normal"]
[null,"Exclude"]
[]
[null,"= rows.mode"]
[null,"= rng.modecode","= rng.modedesc","= rng.modeChoice"]
[null,"ModeCode","Name","Choice List"]
[null,"BRT","Bus Rapid Transit",{"$f":"B12&\" - \"&C12","v":"BRT - Bus Rapid Transit"}]
[null,"CC","Cable Car",{"$f":"B13&\" - \"&C13","v":"CC - Cable Car"}]
[null,"CR","Commuter Rail","CR - Commuter Rail"]
[null,"DR","Demand Response","DR - Demand Response"]
[null,"FB","Ferry Boat","FB - Ferry Boat"]
[null,"HR","Heavy Rail","HR - Heavy Rail"]
[null,"JT","Jitney","JT - Jitney"]
[null,"LR","Light Rail","LR - Light Rail"]
[null,"MB","Motor Bus","MB - Motor Bus"]
{"$rows_left_out":615}
{"sheet":"Inflation","index":3,"n_rows":205,"n_cols":13,"rows_kept":205,"cut":false,"hidden":true,"merged":[]}
[]
[null,"= rows.CostIndex"]
[null,"= rng.CostIndexYear",null,null,"= rng.CostIndexCPI","= rng.CostIndexMeans"]
[null,"Inf_Year","GDP","GDP_Structures","CPI","Means_Augmented"]
[null,1850,null,null,null,0.53172689661195605]
[null,1851,null,null,null,0.55039544223881809,null,null,null,null,null,17.9037882357079,17.9038]
[null,1852,null,null,null,0.56971942696053135,null,null,null,null,null,153.34507670377701,153.3451]
[null,1853,null,null,null,0.58972186276825878]
[null,1854,null,null,null,0.6104265695874862,null,null,null,null,null,{"$f":"L7/L6","v":8.5649514329006973},{"$f":"M7/M6","v":8.5649471062009184}]
[null,1855,null,null,null,0.6318582036440008]
[null,1856,null,null,null,0.65404228682579246]
[null,1857,null,null,null,0.67700523707582627]
[null,1858,null,null,null,0.70077439985187939]
[null,1859,null,null,null,0.7253780806909168]
[null,1860,null,null,null,0.75084557891677206]
[null,1861,null,null,null,0.7772072225312876]
[null,1862,null,null,null,0.80449440433044561]
[null,1863,null,null,null,0.83273961928852924]
[null,1864,null,null,null,0.86197650325479136]
[null,1865,null,null,null,0.89223987300875529]
{"$rows_left_out":186}
{"sheet":"Publish","index":4,"n_rows":424,"n_cols":46,"rows_kept":424,"cut":false,"hidden":true,"merged":[]}
[null,"9999","Metroville Transportation Authority",{"$f":"INDEX(rng.modecode,MATCH(INDEX(rows.input Input!D:D,ROW(D1)-2),rng.modeChoice,0))","v":{"$error":"#VALUE!"}},{"$f":"INDEX(rows.input Input!F:F,ROW(E1)-2)","v":{"$error":"#VALUE!"}},{"$f":"INDEX(rng.ClassType,MATCH(INDEX(rows.input Input!H:H,ROW(F1)-2),rng.ClassChoice,0))","v":{"$error":"#VALUE!"}},{"$f":"INDEX(rng.ClassCat,MATCH(INDEX(rows.input Input!H:H,ROW(G1)-2),rng.ClassChoice,0))","v":{"$error":"#VALUE!"}},{"$f":"INDEX(rng.ClassSubCat,MATCH(INDEX(rows.input Input!H:H,ROW(H1)-2),rng.ClassChoice,0))","v":{"$error":"#VALUE!"}},{"$f":"INDEX(rng.ClassElement,MATCH(INDEX(rows.input Input!H:H,ROW(I1)-2),rng.ClassChoice,0))","v":{"$error":"#VALUE!"}},{"$f":"INDEX(rng.ClassSubElement,MATCH(INDEX(rows.input Input!H:H,ROW(J1)-2),rng.ClassChoice,0))","v":{"$error":"#VALUE!"}},{"$f":"INDEX(rows.input Input!J:J,ROW(K1)-2)","v":{"$error":"#VALUE!"}},{"$f":"INDEX(rows.input Input!K:K,ROW(L1)-2)","v":{"$error":"#VALUE!"}},{"$f":"INDEX(rows.input Input!N:N,ROW(M1)-2)","v":{"$error":"#VALUE!"}},false,{"$f":"INDEX(rows.input Input!U:U,ROW(O1)-2)","v":{"$error":"#VALUE!"}},{"$f":"INDEX(rows.input Input!S:S,ROW(P1)-2)","v":{"$error":"#VALUE!"}},{"$f":"IF(ISBLANK(INDEX(rows.input Input!P:P,ROW(Q1)-2)),\"\",INDEX(rows.input Input!P:P,ROW(Q1)-2))","v":{"$error":"#VALUE!"}},{"$f":"IF(ISBLANK(INDEX(rows.input Input!Q:Q,ROW(R1)-2)),\"\",INDEX(rows.input Input!Q:Q,ROW(R1)-2))","v":{"$error":"#VALUE!"}},{"$f":"IF(ISBLANK((INDEX(rows.input Input!Z:Z,ROW(S1)-2))),\"\",INDEX(rows.input Input!Z:Z,ROW(S1)-2))","v":{"$error":"#VALUE!"}},{"$f":"IF(ISBLANK((INDEX(rows.input Input!AU:AU,ROW(T1)-2))),\"\",INDEX(rows.input Input!AU:AU,ROW(T1)-2))","v":{"$error":"#VALUE!"}},{"$f":"INDEX(rows.input Input!BA:BA,ROW(U1)-2)","v":{"$error":"#VALUE!"}},{"$f":"INDEX(rows.input Input!BB:BB,ROW(V1)-2)","v":{"$error":"#VALUE!"}},{"$f":"IF(ISBLANK((INDEX(rows.input Input!X:X,ROW(W1)-2))),INDEX(rng.ClassEDL,MATCH(F1,rng.ClassType,0)),INDEX(rows.input Input!X:X,ROW(W1)-2))","v":{"$error":"#VALUE!"}},{"$f":"IF(ISBLANK((INDEX(rows.input Input!AA:AA,ROW(X1)-2))),\"\",INDEX(rows.input Input!AA:AA,ROW(X1)-2))","v":{"$error":"#VALUE!"}},{"$f":"IF(INDEX(rows.input Input!M:M,ROW(Y1)-2)=\"Yes\",\"Expansion\",\"Existing\")","v":{"$error":"#VALUE!"}},{"$f":"IF(ISBLANK((INDEX(rows.input Input!AI:AI,ROW(Z1)-2))),\"\",INDEX(rows.input Input!AI:AI,ROW(Z1)-2))","v":{"$error":"#VALUE!"}},{"$f":"IF(ISBLANK((INDEX(rows.input Input!AJ:AJ,ROW(AA1)-2))),\"\",INDEX(rows.input Input!AJ:AJ,ROW(AA1)-2))","v":{"$error":"#VALUE!"}},{"$f":"IF(ISBLANK((INDEX(rows.input Input!AK:AK,ROW(AB1)-2))),\"\",INDEX(rows.input Input!AK:AK,ROW(AB1)-2))","v":{"$error":"#VALUE!"}},{"$f":"IF(ISBLANK((INDEX(rows.input Input!AL:AL,ROW(AC1)-2))),\"\",INDEX(rows.input Input!AL:AL,ROW(AC1)-2))","v":{"$error":"#VALUE!"}},{"$f":"IF(ISBLANK((INDEX(rows.input Input!AM:AM,ROW(AD1)-2))),\"\",INDEX(rows.input Input!AM:AM,ROW(AD1)-2))","v":{"$error":"#VALUE!"}},{"$f":"IF(ISBLANK((INDEX(rows.input Input!AN:AN,ROW(AE1)-2))),\"\",INDEX(rows.input Input!AN:AN,ROW(AE1)-2))","v":{"$error":"#VALUE!"}},{"$f":"IF(ISBLANK((INDEX(rows.input Input!AO:AO,ROW(AF1)-2))),\"\",INDEX(rows.input Input!AO:AO,ROW(AF1)-2))","v":{"$error":"#VALUE!"}},{"$f":"IF(ISBLANK((INDEX(rows.input Input!AP:AP,ROW(AG1)-2))),\"\",INDEX(rows.input Input!AP:AP,ROW(AG1)-2))","v":{"$error":"#VALUE!"}},{"$f":"IF(ISBLANK((INDEX(rows.input Input!AQ:AQ,ROW(AH1)-2))),\"\",INDEX(rows.input Input!AQ:AQ,ROW(AH1)-2))","v":{"$error":"#VALUE!"}},{"$f":"IF(ISBLANK((INDEX(rows.input Input!AR:AR,ROW(AI1)-2))),\"\",INDEX(rows.input Input!AR:AR,ROW(AI1)-2))","v":{"$error":"#VALUE!"}},{"$f":"IF(ISBLANK((INDEX(rows.input Input!AS:AS,ROW(AJ1)-2))),\"\",INDEX(rows.input Input!AS:AS,ROW(AJ1)-2))","v":{"$error":"#VALUE!"}},{"$f":"IF(ISBLANK((INDEX(rows.input Input!AT:AT,ROW(AK1)-2))),\"\",INDEX(rows.input Input!AT:AT,ROW(AK1)-2))","v":{"$error":"#VALUE!"}},{"$f":"IF(ISBLANK((INDEX(rows.input Input!AV:AV,ROW(AL1)-2))),\"\",INDEX(rows.input Input!AV:AV,ROW(AL1)-2))","v":{"$error":"#VALUE!"}},{"$f":"IF(ISBLANK((INDEX(rows.input Input!AW:AW,ROW(AM1)-2))),\"\",INDEX(rows.input Input!AW:AW,ROW(AM1)-2))","v":{"$error":"#VALUE!"}},{"$f":"IF(ISBLANK((INDEX(rows.input Input!AX:AX,ROW(AN1)-2))),\"\",INDEX(rows.input Input!AX:AX,ROW(AN1)-2))","v":{"$error":"#VALUE!"}},{"$f":"IF(ISBLANK((INDEX(rows.input Input!AY:AY,ROW(AO1)-2))),\"\",INDEX(rows.input Input!AY:AY,ROW(AO1)-2))","v":{"$error":"#VALUE!"}},{"$f":"IF(ISBLANK((INDEX(rows.input Input!AE:AE,ROW(AP1)-2))),\"\",INDEX(rows.input Input!AE:AE,ROW(AP1)-2))","v":{"$error":"#VALUE!"}},{"$f":"IF(ISBLANK((INDEX(rows.input Input!AF:AF,ROW(AQ1)-2))),\"\",INDEX(rows.input Input!AF:AF,ROW(AQ1)-2))","v":{"$error":"#VALUE!"}},{"$f":"IF(ISBLANK((INDEX(rows.input Input!AG:AG,ROW(AR1)-2))),\"\",INDEX(rows.input Input!AG:AG,ROW(AR1)-2))","v":{"$error":"#VALUE!"}},{"$f":"IF(ISBLANK((INDEX(rows.input Input!AH:AH,ROW(AS1)-2))),\"\",INDEX(rows.input Input!AH:AH,ROW(AS1)-2))","v":{"$error":"#VALUE!"}},{"$f":"IF(ISBLANK((INDEX(rows.input Input!AI:AI,ROW(AT1)-2))),\"\",INDEX(rows.input Input!AI:AI,ROW(AT1)-2))","v":{"$error":"#VALUE!"}}]
[null,"Agency ID Code","Transit System","Mode Code","Description","Asset Type Code","Category","Sub-Category","Element","Sub-Element","Quantity","Units","Date Built","Rehabed","CostYr","Agency SoftCost","Unit Replacement Cost","Current Dollars Total Cost","Priority Status","Agency Condition Rating","Data Date","Data Source","Agency UsefulLife","Delayed Replacement Age","Existing Expansion","Agency Asset Type","Make Model","Agency Asset ID","Agency_Asset_Parent_ID","Line/Division","Branch/Garage","Segment/Route","Start","End","Latitude","Longitude","Address","User Defined Field 1","User Defined Field 2","User Defined Field 3","User Defined Field 4","Dept Asset Owner","Agency Project Number","Agency Project Category","Agency Project Desc","Notes"]
[null,"9999","Metroville Transportation Authority","CR","Rail Commuter Rail",21221,"Facilities","Buildings","Maintenance","Rail Commuter Rail",1,"Each",1966,false,2001,0.1,30000000,"","Normal","",0,0,60,"","Existing","","","30-675-865","","Systemwide","","","","","","","","","","","","","MJW-GW-BT-TT-3.5-K","","",""]
[null,"9999","Metroville Transportation Authority","CR","Rail Commuter Rail",21221,"Facilities","Buildings","Maintenance","Rail Commuter Rail",1,"Each",1966,false,2001,0.1,30000000,"","Normal","",0,0,60,"","Existing","","","30-675-865","","Systemwide","","","","","","","","","","","","","MJW-GW-BT-TT-3.5-K","","",""]
[null,"9999","Metroville Transportation Authority","CR","Rail Commuter Rail",23311,"Facilities","Equipment","Maintenance","Rail Commuter Rail",1,"Each",2011,false,2000,0.1,6254086.7659999998,"","Normal","",0,0,15,"","Existing","","","06-599-166","","South","","","","","","","","","","","","","WVE-ES-OCS0195-FD-JA-2.2-Y","","",""]
[null,"9999","Metroville Transportation Authority","CR","Rail Commuter Rail",23311,"Facilities","Equipment","Maintenance","Rail Commuter Rail",5,"Each",1966,false,1955,0.1,1006537.4689,"","Normal","",0,0,15,"","Existing","","","27-650-648","","North","","","","","","","","","","","","","CRS1-GW-BT-TT-10.1-K","","",""]
[null,"9999","Metroville Transportation Authority","CR","Grade Crossing Commuter Rail",10211,"Guideway Elements","Guideway","At Grade-In-Street","Grade Crossing Commuter Rail",41,"Ea",2023,false,2013,0,353722.0404,"","Normal","",0,0,18,"","Existing","","","48-450-217","","North Line","North","","","","","","","","","","","","WVE-ES-OCS0195-FD-JA-2.2-Y","","",""]
[null,"9999","Metroville Transportation Authority","CR","Grade Crossing Commuter Rail",10211,"Guideway Elements","Guideway","At Grade-In-Street","Grade Crossing Commuter Rail",1750,"LF",2019,false,2013,0,187.8432,"","Normal","",0,0,18,"","Existing","","","93-280-382","","South Line","North","","","","","","","","","","","","WVE-ES-OCS0195-FD-JA-2.2-Y","","",""]
[null,"9999","Metroville Transportation Authority","CR","Grade Crossing Commuter Rail",10211,"Guideway Elements","Guideway","At Grade-In-Street","Grade Crossing Commuter Rail",4,"Ea",2019,false,2013,0,188.53380000000001,"","Normal","",0,0,18,"","Existing","","","90-187-567","","North Line","Central","","","","","","","","","","","","CRN1-GW-BT-TT-32.7-K","","",""]
[null,"9999","Metroville Transportation Authority","CR","Grade Crossing Commuter Rail",10211,"Guideway Elements","Guideway","At Grade-In-Street","Grade Crossing Commuter Rail",1,"LF",2022,false,2013,0,493088.52429999999,"","Normal","",0,0,18,"","Existing","","","50-638-241","","North Line","","","","","","","","","","","","","CRS2-GW-BT-TT-30.1-K","","",""]
[null,"9999","Metroville Transportation Authority","CR","Grade Crossing Commuter Rail",10211,"Guideway Elements","Guideway","At Grade-In-Street","Grade Crossing Commuter Rail",72,"LF",2010,false,2013,0,187.9967,"","Normal","",0,0,18,"","Existing","","","02-717-323","","South Line","","","","","","","","","","","","","CRN1-GW-BT-TT-32.7-K","","",""]
[null,"9999","Metroville Transportation Authority","CR","Bridge Commuter Rail",10331,"Guideway Elements","Guideway","Elevated Structure","Bridge Commuter Rail",500,"LF",2019,false,2013,0,34992.4084,"","Normal","",0,0,100,"","Existing","","","15-381-940","","South Line","Central","","","","","","","","","","","","CRN1-GW-BT-TT-19.1-K","","",""]
[null,"9999","Metroville Transportation Authority","CR","Bridge Commuter Rail",10331,"Guideway Elements","Guideway","Elevated Structure","Bridge Commuter Rail",700,"LF",2019,false,2013,0,34992.4084,"","Normal","",0,0,100,"","Existing","","","15-381-940","","North Line","South","","","","","","","","","","","","CRS2-GW-BT-TT-0.1-K","","",""]
[null,"9999","Metroville Transportation Authority","CR","Bridge Commuter Rail",10331,"Guideway Elements","Guideway","Elevated Structure","Bridge Commuter Rail",850,"LF",2019,false,2013,0,34992.4084,"","Normal","",0,0,100,"","Existing","","","15-381-940","","South Line","South","","","","","","","","","","","","WVE-ES-OCS0195-FD-JA-2.2-Y","","",""]
[null,"9999","Metroville Transportation Authority","CR","Fencing",12100,"Guideway Elements","Special Structures","Fencing","-",132165,"LF",2019,false,2013,0,109.73099999999999,"","Normal","",0,0,25,"","Existing","","","33-329-903","","North Line","North","","","","","","","","","","","","CRN2-GW-BT-TT-1.6-K","","",""]
[null,"9999","Metroville Transportation Authority","CR","Retaining Walls",12200,"Guideway Elements","Special Structures","Retaining Walls","-",4799.22,"LF",2019,false,2013,0,34.247799999999998,"","Normal","",0,0,40,"","Existing","","","80-967-750","","South Line","North","","","","","","","","","","","","MJW-GW-BT-TT-6.2-K","","",""]
[null,"9999","Metroville Transportation Authority","CR","Curve",11202,"Guideway Elements","Trackwork","Ballasted","Curve",67930.2,"LF",2023,false,2013,0,469.68400000000003,"","Normal","",0,0,20,"","Existing","","","88-518-568","","North Line","Central","A-00978","","","","","","","","","","","CRN1-GW-BT-CT-2.8-K","","",""]
[null,"9999","Metroville Transportation Authority","CR","Curve",11202,"Guideway Elements","Trackwork","Ballasted","Curve",90490.43,"LF",2019,false,2013,0,309.84899999999999,"","Normal","",0,0,20,"","Existing","","","74-059-854","","South Line","Central","C-09874","","","","","","","","","","","WVE-ES-OCS0195-FD-JA-2.2-Y","","",""]
[null,"9999","Metroville Transportation Authority","CR","Curve",11202,"Guideway Elements","Trackwork","Ballasted","Curve",128.08000000000001,"LF",1911,false,2013,0,468.02069999999998,"","Normal","",0,0,20,"","Existing","","","25-681-400","","North Line","South","C-05198","","","","","","","","","","","CRS1-GW-BT-CT-10.1-K","","",""]
[null,"9999","Metroville Transportation Authority","CR","Curve",11202,"Guideway Elements","Trackwork","Ballasted","Curve",1,"Ea",2019,false,2013,0,45441.491499999996,"","Normal","",0,0,20,"","Existing","","","84-389-334","","South Line","South","B-02890","","","","","","","","","","","CRS2-GW-BT-CT-44.0-K","","",""]
{"$rows_left_out":404}