{"text_format":"1","workbook":"xlsx","n_sheets":17,"sheets":["Cover Page","Instructions","Getting Started","Chp 1 - Introduction","Chp 2 - Asset Portfolio","Chp 3 - Condition Assessment","Chp 4 - Management Approach","Chp 5 - Work Plans & Schedules","TAM Plan - 1","TAM Plan - 2","TAM Plan - 3","TAM Plan - 4","Appendix A - Asset Register","Appendix B - Asset Condition","Appendix C - Project List","Reference Sheet","Inventory Ref Sheet"],"not_rendered":{"charts":0,"images":1,"macros":1,"external_links":0,"defined_names":87,"comments":0,"pivot_tables":0},"unopened":[],"bounds":{"document_bytes":16777216,"sheet_cells":100000,"rows_first":2000,"rows_last":500,"rows_between":2000,"halvings":0,"cell_chars":16384,"cell_head_chars":4096},"cells_cut":0,"cells_raw":0,"read":"whole","date_system":"1900"}

{"sheet":"Cover Page","index":0,"n_rows":0,"n_cols":0,"rows_kept":0,"cut":false,"hidden":false,"merged":[]}

{"sheet":"Instructions","index":1,"n_rows":45,"n_cols":2,"rows_kept":45,"cut":false,"hidden":false,"merged":[[35,0,42,0],[44,0,45,1],[33,0,33,1],[0,0,0,1],[1,0,1,1],[3,0,3,1],[17,0,17,1],[13,0,13,1],[9,0,9,1],[23,0,23,1],[24,0,24,1],[25,0,25,1],[26,0,26,1],[27,0,27,1],[28,0,28,1],[29,0,29,1]]}
["FTA Transit Asset Management Guide for Small Providers "]
["Part II – Transit Asset Management (TAM) Plan Template"]
[]
["This Transit Asset Management Plan (TAM plan) template has been provided as a tool to assist small transit providers and their state Departments of Transportation (DOTs) in developing their TAM Plans according to best practice and in alignment with MAP-21 requirements. This template is not a tool to meet MAP-21 compliance; it is simply a technical assistance guide."]
[]
[]
{"$rows_left_out":40}
{"sheet":"Getting Started","index":2,"n_rows":32,"n_cols":3,"rows_kept":32,"cut":false,"hidden":false,"merged":[[33,0,33,1],[26,0,26,1],[27,0,27,1],[23,0,23,1],[24,0,24,1],[25,0,25,1],[2,0,2,2],[28,0,28,1],[29,0,29,1],[30,0,30,1],[31,0,31,1],[16,0,16,2],[20,0,20,1],[21,0,21,1],[22,0,22,1],[4,1,4,2],[6,1,6,2],[8,1,8,2]]}
["Getting Started"]
[]
["The following information is for reference purposes and document control. Please be sure to complete these fields before proceeding with the tool."]
[]
["Agency Name:"]
[]
{"$rows_left_out":27}
{"sheet":"Chp 1 - Introduction","index":3,"n_rows":76,"n_cols":3,"rows_kept":76,"cut":false,"hidden":false,"merged":[[79,2,79,3],[52,0,52,4],[78,2,78,3],[76,2,76,3],[75,2,75,3],[74,2,74,3],[77,2,77,3],[72,0,72,1],[61,0,62,0],[25,0,25,1],[40,0,40,1],[48,0,48,1],[44,0,44,4],[69,0,69,1],[67,0,67,4],[65,0,65,1],[55,0,56,0],[57,0,58,0],[59,0,60,0],[2,0,2,4],[5,0,5,4],[38,0,38,4],[46,0,46,4],[7,0,7,4],[20,0,20,4],[22,0,22,4],[30,0,30,4],[36,0,36,4],[13,1,14,1],[13,2,14,2],[15,1,16,1],[15,2,16,2],[17,1,18,1],[17,2,18,2],[10,0,10,4]]}
["Introduction"]
[]
["**COMPLIANT**"]
[]
[]
["Provide a brief overview of/introduction to your agency. You may include general information including state geography, demographics, interdependencies between asset classes, etc.:"]
{"$rows_left_out":71}
{"sheet":"Chp 2 - Asset Portfolio","index":4,"n_rows":22,"n_cols":18,"rows_kept":22,"cut":false,"hidden":false,"merged":[[4,0,15,7],[2,0,2,7],[0,8,2,10]]}
["Asset Portfolio",null,null,null,null,null,null,null,"Inventory Table"]
[]
["**COMPLIANT**"]
[]
["Asset Inventory Listing: To complete the inventory list, use the following steps:  \n\n1. On the table to the right, list all the capital assets that you own, operate, or manage that support the delivery of public transportation services. This should include leased assets, assets operated under contract, and all assets that would be included in a program of projects. You may include assets acquired without FTA funds. Complete the table and use the drop down menus where provided. An example is shown for guidance. \n\n2. Click the \"Add More\" button only after some yellow cells are filled.\n\n3. Be sure to click \"Finish\" when complete.\n\n4. Click the \"Summarize\" button to populate the summary table.\n\n5. Click \"Continue\" to proceed to the next sheet.",null,null,null,null,null,null,null,"Asset Category","Asset Class","Asset Name","Make","Model","ID/Serial No.","Asset Owner","Age (Yrs)","TERM Scale Condition","Replacement Cost/Value"]
[null,null,null,null,null,null,null,null,"Facilities*","Maintenance Facility","York Street Maintenance Building","N/A","N/A","MAINT0010","Example Agency",15,3,50000]
{"$rows_left_out":17}
{"sheet":"Chp 3 - Condition Assessment","index":5,"n_rows":100,"n_cols":33,"rows_kept":100,"cut":false,"hidden":false,"merged":[[2,0,2,7],[4,0,9,7],[12,0,13,7]]}
["Condition Assessment",null,null,null,null,null,null,null,"Equipment Condition Table",null,null,null,null,null,null,null,"Facilities Condition Table",null,null,null,null,null,null,null,null,"Rolling Stock Condition Table"]
[null,null,null,null,null,null,null,null,"**Age is the surrogate performance measure for condition as determined by the FTA.",null,null,null,null,null,null,null,null,null,null,null,null,null,null,null,null,"**Age is the surrogate performance measure for condition as determined by the FTA."]
["**COMPLIANT**"]
[null,null,null,null,null,null,null,null,"Asset Category","Asset Class","Asset Name","ID/Serial No.","Age (Yrs)","Replacement Cost/Value","Useful Life Benchmark (Yrs)","Past Useful Life Benchmark","Asset Category","Asset Class","Asset Name","ID/Serial No.","Age (Yrs)","TERM Scale Condition","Replacement Cost/Value","Useful Life Benchmark (Yrs)","Past Useful Life Benchmark","Asset Category","Asset Class","Asset Name","ID/Serial No.","Age (Yrs)","Replacement Cost/Value","Useful Life Benchmark (Yrs)","Past Useful Life Benchmark"]
["Asset Condition: What condition are your assets in to run the services required? How does the actual condition compare to the target set for the assets? The tables to the right are automatically populated based on your inventory on the previous sheet. There is one table for each asset category (three total). Scroll to the right to view all tables.\n\nComplete the tables by filling in the input cells with the Useful Life Benchmark for each asset. Refer to Section 3.1.1 of Part I for an explanation of the Useful Life Benchmark.",null,null,null,null,null,null,null,{"$f":"'Inventory Ref Sheet'!K5","v":0},{"$f":"'Inventory Ref Sheet'!L5","v":0},{"$f":"'Inventory Ref Sheet'!M5","v":0},{"$f":"'Inventory Ref Sheet'!P5","v":0},{"$f":"'Inventory Ref Sheet'!R5","v":0},{"$f":"'Inventory Ref Sheet'!T5","v":0},null,{"$f":"IF(ISTEXT(I5),IF(M5>=O5,\"Yes\",\"No\"),\"\")","v":""},{"$f":"'Inventory Ref Sheet'!U5","v":0},{"$f":"'Inventory Ref Sheet'!V5","v":0},{"$f":"'Inventory Ref Sheet'!W5","v":0},{"$f":"'Inventory Ref Sheet'!Z5","v":0},{"$f":"'Inventory Ref Sheet'!AB5","v":0},null,{"$f":"'Inventory Ref Sheet'!AD5","v":0},null,{"$f":"IF(ISTEXT(Q5),IF(U5>=X5,\"Yes\",\"No\"),\"\")","v":""},{"$f":"'Inventory Ref Sheet'!AE5","v":0},{"$f":"'Inventory Ref Sheet'!AF5","v":0},{"$f":"'Inventory Ref Sheet'!AG5","v":0},{"$f":"'Inventory Ref Sheet'!AJ5","v":0},{"$f":"'Inventory Ref Sheet'!AL5","v":0},{"$f":"'Inventory Ref Sheet'!AN5","v":0},null,{"$f":"IF(ISTEXT(Z5),IF(AD5>=AF5,\"Yes\",\"No\"),\"\")","v":""}]
[null,null,null,null,null,null,null,null,{"$f":"'Inventory Ref Sheet'!K6","v":0},{"$f":"'Inventory Ref Sheet'!L6","v":0},{"$f":"'Inventory Ref Sheet'!M6","v":0},{"$f":"'Inventory Ref Sheet'!P6","v":0},{"$f":"'Inventory Ref Sheet'!R6","v":0},{"$f":"'Inventory Ref Sheet'!T6","v":0},null,{"$f":"IF(ISTEXT(I6),IF(M6>=O6,\"Yes\",\"No\"),\"\")","v":""},{"$f":"'Inventory Ref Sheet'!U6","v":0},{"$f":"'Inventory Ref Sheet'!V6","v":0},{"$f":"'Inventory Ref Sheet'!W6","v":0},{"$f":"'Inventory Ref Sheet'!Z6","v":0},{"$f":"'Inventory Ref Sheet'!AB6","v":0},null,{"$f":"'Inventory Ref Sheet'!AD6","v":0},null,{"$f":"IF(ISTEXT(Q6),IF(U6>=X6,\"Yes\",\"No\"),\"\")","v":""},{"$f":"'Inventory Ref Sheet'!AE6","v":0},{"$f":"'Inventory Ref Sheet'!AF6","v":0},{"$f":"'Inventory Ref Sheet'!AG6","v":0},{"$f":"'Inventory Ref Sheet'!AJ6","v":0},{"$f":"'Inventory Ref Sheet'!AL6","v":0},{"$f":"'Inventory Ref Sheet'!AN6","v":0},null,{"$f":"IF(ISTEXT(Z6),IF(AD6>=AF6,\"Yes\",\"No\"),\"\")","v":""}]
{"$rows_left_out":95}
{"sheet":"Chp 4 - Management Approach","index":6,"n_rows":83,"n_cols":5,"rows_kept":83,"cut":false,"hidden":false,"merged":[[84,1,84,4],[0,2,1,4],[2,0,2,4],[24,0,24,4],[51,0,51,4],[7,2,7,4],[38,0,38,4],[28,2,28,4],[29,2,29,4],[30,2,30,4],[8,2,8,4],[9,2,9,4],[28,0,28,1],[29,0,29,1],[30,0,30,1],[8,0,8,1],[83,1,83,4],[70,1,70,4],[71,1,71,4],[79,0,79,4],[72,1,72,4],[81,1,81,4],[26,0,26,4],[10,0,10,1],[60,1,60,4],[73,1,73,4],[82,1,82,4],[59,1,59,4],[32,0,32,1],[32,2,32,4],[11,0,11,1],[11,2,11,4],[61,1,61,4],[85,1,85,4],[5,0,5,4],[17,0,17,4],[19,0,19,4],[67,0,67,4],[69,1,69,4],[56,1,56,4],[57,1,57,4],[58,1,58,4],[54,0,54,4],[49,0,49,4],[10,2,10,4],[31,0,31,1],[31,2,31,4],[9,0,9,1],[7,0,7,1]]}
["Management Approach",null,"NOTE: Complete some yellow cells before clicking \"Add More\" under each question."]
[]
["**COMPLIANT**"]
[]
[]
["Decision Support: List and briefly describe the processes and/or tools in place to support investment decision-making, including project selection and prioritization. Enter this information in the table below. Click the button to add more rows."]
{"$rows_left_out":78}
{"sheet":"Chp 5 - Work Plans & Schedules","index":7,"n_rows":30,"n_cols":5,"rows_kept":30,"cut":false,"hidden":false,"merged":[[5,0,5,4],[19,0,19,4],[0,2,1,4],[2,0,2,4],[17,0,17,4]]}
["Work Plans & Schedules",null,"NOTE: Complete some yellow cells before clicking \"Add More\" under each question."]
[]
["**COMPLIANT**"]
[]
[]
["Proposed Investments: Provide a list of the selected projects and programs prioritized based on your agency's criteria. Rank the projects and order them by year of planned implementation. Enter this information in the table below. Click the button to add more rows."]
{"$rows_left_out":25}
{"sheet":"TAM Plan - 1","index":8,"n_rows":60,"n_cols":6,"rows_kept":60,"cut":false,"hidden":false,"merged":[[0,0,0,4],[1,0,1,4],[4,0,4,4],[28,0,28,4],[30,0,33,4],[14,2,15,2],[16,2,17,2],[11,0,11,4],[6,0,9,4],[18,2,19,2],[14,1,15,1],[16,1,17,1],[18,1,19,1],[21,0,21,4],[42,0,42,4],[35,0,35,4],[37,0,40,4],[48,0,48,4],[23,0,26,4],[45,0,46,0],[46,1,46,3],[45,1,45,3],[44,1,44,3],[59,2,59,3],[55,0,55,4],[50,0,53,4],[57,2,57,3],[58,2,58,3]]}
[{"$f":"CONCATENATE('Getting Started'!B5, \" \", \"Transit Asset Management Plan\")","v":" Transit Asset Management Plan"}]
[{"$f":"CONCATENATE(\"Last modified by \", 'Getting Started'!B7,\" on \") & TEXT(NOW(),\"dd mmm yy at hh:mm\")","v":"Last modified by  on 28 Sep 16 at 12:15"}]
[]
[]
[{"$f":"'Chp 1 - Introduction'!A1","v":"Introduction"}]
[]
{"$rows_left_out":55}
{"sheet":"TAM Plan - 2","index":9,"n_rows":30,"n_cols":6,"rows_kept":30,"cut":false,"hidden":false,"merged":[[24,0,24,4],[16,0,19,6],[14,0,14,4],[4,0,4,4],[0,0,0,4]]}
[{"$f":"'Chp 2 - Asset Portfolio'!A1","v":"Asset Portfolio"}]
["Please see Appendix A (Asset Register) for the asset inventory listing."]
[]
[]
["Asset Inventory Summary"]
[]
{"$rows_left_out":25}
{"sheet":"TAM Plan - 3","index":10,"n_rows":42,"n_cols":6,"rows_kept":42,"cut":false,"hidden":false,"merged":[[20,0,20,4],[15,0,15,4],[17,0,17,1],[41,1,41,4],[32,1,32,4],[25,0,25,4],[27,0,27,4],[29,0,29,4],[31,1,31,4],[36,1,36,4],[40,1,40,4],[34,0,34,4],[39,0,39,4],[37,1,37,4],[17,2,17,4],[18,0,18,1],[18,2,18,4],[13,0,13,1],[13,2,13,4],[0,0,0,4],[2,0,2,4],[4,0,7,4],[9,0,9,4],[12,0,12,1],[12,2,12,4]]}
[{"$f":"'Chp 4 - Management Approach'!A1","v":"Management Approach"}]
[]
["Investment Prioritization"]
[]
[{"$f":"IF('Chp 4 - Management Approach'!A20 = 0, \"Investment prioritization methodology goes here.\", 'Chp 4 - Management Approach'!A20)","v":"Investment prioritization methodology goes here."},null,null,null,null,{"$f":"A5","v":"Investment prioritization methodology goes here."}]
[]
{"$rows_left_out":37}
{"sheet":"TAM Plan - 4","index":11,"n_rows":14,"n_cols":3,"rows_kept":14,"cut":false,"hidden":false,"merged":[[0,0,0,4],[9,0,9,4],[4,0,4,4],[6,0,6,1],[6,2,6,4],[7,0,7,1],[7,2,7,4]]}
[{"$f":"'Chp 5 - Work Plans & Schedules'!A1","v":"Work Plans & Schedules"}]
[]
["The list of prioritized investment projects is provided in Appendix C."]
[]
["Capital Investment Activity Schedules"]
[]
{"$rows_left_out":9}
{"sheet":"Appendix A - Asset Register","index":12,"n_rows":4,"n_cols":9,"rows_kept":4,"cut":false,"hidden":false,"merged":[[0,0,0,5]]}
["Appendix A: Asset Register"]
[]
[{"$f":"'Chp 2 - Asset Portfolio'!I5","v":"Asset Category"},{"$f":"'Chp 2 - Asset Portfolio'!J5","v":"Asset Class"},{"$f":"'Chp 2 - Asset Portfolio'!K5","v":"Asset Name"},{"$f":"'Chp 2 - Asset Portfolio'!L5","v":"Make"},{"$f":"'Chp 2 - Asset Portfolio'!M5","v":"Model"},{"$f":"'Chp 2 - Asset Portfolio'!N5","v":"ID/Serial No."},{"$f":"'Chp 2 - Asset Portfolio'!O5","v":"Asset Owner"},{"$f":"'Chp 2 - Asset Portfolio'!P5","v":"Age (Yrs)"},{"$f":"'Chp 2 - Asset Portfolio'!R5","v":"Replacement Cost/Value"}]
[{"$f":"IF('Chp 2 - Asset Portfolio'!I7=0, \" \", 'Chp 2 - Asset Portfolio'!I7)","v":" "},{"$f":"IF('Chp 2 - Asset Portfolio'!J7=0, \" \", 'Chp 2 - Asset Portfolio'!J7)","v":" "},{"$f":"IF('Chp 2 - Asset Portfolio'!K7=0, \" \", 'Chp 2 - Asset Portfolio'!K7)","v":" "},{"$f":"IF('Chp 2 - Asset Portfolio'!L7=0, \" \", 'Chp 2 - Asset Portfolio'!L7)","v":" "},{"$f":"IF('Chp 2 - Asset Portfolio'!M7=0, \" \", 'Chp 2 - Asset Portfolio'!M7)","v":" "},{"$f":"IF('Chp 2 - Asset Portfolio'!N7=0, \" \", 'Chp 2 - Asset Portfolio'!N7)","v":" "},{"$f":"IF('Chp 2 - Asset Portfolio'!O7=0, \" \", 'Chp 2 - Asset Portfolio'!O7)","v":" "},{"$f":"IF('Chp 2 - Asset Portfolio'!P7=0, \" \", 'Chp 2 - Asset Portfolio'!P7)","v":" "},{"$f":"IF('Chp 2 - Asset Portfolio'!R7=0, \" \", 'Chp 2 - Asset Portfolio'!R7)","v":" "}]

{"sheet":"Appendix B - Asset Condition","index":13,"n_rows":6,"n_cols":25,"rows_kept":6,"cut":false,"hidden":false,"merged":[[0,0,0,5]]}
["Appendix B: Asset Condition Data"]
[]
["Equipment Assets",null,null,null,null,null,null,null,"Facilities Assets",null,null,null,null,null,null,null,null,"Rolling Stock Assets"]
[]
[{"$f":"'Chp 3 - Condition Assessment'!I4","v":"Asset Category"},{"$f":"'Chp 3 - Condition Assessment'!J4","v":"Asset Class"},{"$f":"'Chp 3 - Condition Assessment'!K4","v":"Asset Name"},{"$f":"'Chp 3 - Condition Assessment'!L4","v":"ID/Serial No."},{"$f":"'Chp 3 - Condition Assessment'!M4","v":"Age (Yrs)"},{"$f":"'Chp 3 - Condition Assessment'!N4","v":"Replacement Cost/Value"},{"$f":"'Chp 3 - Condition Assessment'!O4","v":"Useful Life Benchmark (Yrs)"},{"$f":"'Chp 3 - Condition Assessment'!P4","v":"Past Useful Life Benchmark"},{"$f":"'Chp 3 - Condition Assessment'!Q4","v":"Asset Category"},{"$f":"'Chp 3 - Condition Assessment'!R4","v":"Asset Class"},{"$f":"'Chp 3 - Condition Assessment'!S4","v":"Asset Name"},{"$f":"'Chp 3 - Condition Assessment'!T4","v":"ID/Serial No."},{"$f":"'Chp 3 - Condition Assessment'!U4","v":"Age (Yrs)"},{"$f":"'Chp 3 - Condition Assessment'!V4","v":"TERM Scale Condition"},{"$f":"'Chp 3 - Condition Assessment'!W4","v":"Replacement Cost/Value"},{"$f":"'Chp 3 - Condition Assessment'!X4","v":"Useful Life Benchmark (Yrs)"},{"$f":"'Chp 3 - Condition Assessment'!Y4","v":"Past Useful Life Benchmark"},{"$f":"'Chp 3 - Condition Assessment'!Z4","v":"Asset Category"},{"$f":"'Chp 3 - Condition Assessment'!AA4","v":"Asset Class"},{"$f":"'Chp 3 - Condition Assessment'!AB4","v":"Asset Name"},{"$f":"'Chp 3 - Condition Assessment'!AC4","v":"ID/Serial No."},{"$f":"'Chp 3 - Condition Assessment'!AD4","v":"Age (Yrs)"},{"$f":"'Chp 3 - Condition Assessment'!AE4","v":"Replacement Cost/Value"},{"$f":"'Chp 3 - Condition Assessment'!AF4","v":"Useful Life Benchmark (Yrs)"},{"$f":"'Chp 3 - Condition Assessment'!AG4","v":"Past Useful Life Benchmark"}]
[{"$f":"IF('Chp 3 - Condition Assessment'!I5=0, \" \", 'Chp 3 - Condition Assessment'!I5)","v":" "},{"$f":"IF('Chp 3 - Condition Assessment'!J5=0, \" \", 'Chp 3 - Condition Assessment'!J5)","v":" "},{"$f":"IF('Chp 3 - Condition Assessment'!K5=0, \" \", 'Chp 3 - Condition Assessment'!K5)","v":" "},{"$f":"IF('Chp 3 - Condition Assessment'!L5=0, \" \", 'Chp 3 - Condition Assessment'!L5)","v":" "},{"$f":"IF('Chp 3 - Condition Assessment'!M5=0, \" \", 'Chp 3 - Condition Assessment'!M5)","v":" "},{"$f":"IF('Chp 3 - Condition Assessment'!N5=0, \" \", 'Chp 3 - Condition Assessment'!N5)","v":" "},{"$f":"IF('Chp 3 - Condition Assessment'!O5=0, \" \", 'Chp 3 - Condition Assessment'!O5)","v":" "},{"$f":"IF('Chp 3 - Condition Assessment'!P5=0, \" \", 'Chp 3 - Condition Assessment'!P5)","v":""},{"$f":"IF('Chp 3 - Condition Assessment'!Q5=0, \" \", 'Chp 3 - Condition Assessment'!Q5)","v":" "},{"$f":"IF('Chp 3 - Condition Assessment'!R5=0, \" \", 'Chp 3 - Condition Assessment'!R5)","v":" "},{"$f":"IF('Chp 3 - Condition Assessment'!S5=0, \" \", 'Chp 3 - Condition Assessment'!S5)","v":" "},{"$f":"IF('Chp 3 - Condition Assessment'!T5=0, \" \", 'Chp 3 - Condition Assessment'!T5)","v":" "},{"$f":"IF('Chp 3 - Condition Assessment'!U5=0, \" \", 'Chp 3 - Condition Assessment'!U5)","v":" "},{"$f":"IF('Chp 3 - Condition Assessment'!V5=0, \" \", 'Chp 3 - Condition Assessment'!V5)","v":" "},{"$f":"IF('Chp 3 - Condition Assessment'!W5=0, \" \", 'Chp 3 - Condition Assessment'!W5)","v":" "},{"$f":"IF('Chp 3 - Condition Assessment'!X5=0, \" \", 'Chp 3 - Condition Assessment'!X5)","v":" "},{"$f":"IF('Chp 3 - Condition Assessment'!Y5=0, \" \", 'Chp 3 - Condition Assessment'!Y5)","v":""},{"$f":"IF('Chp 3 - Condition Assessment'!Z5=0, \" \", 'Chp 3 - Condition Assessment'!Z5)","v":" "},{"$f":"IF('Chp 3 - Condition Assessment'!AA5=0, \" \", 'Chp 3 - Condition Assessment'!AA5)","v":" "},{"$f":"IF('Chp 3 - Condition Assessment'!AB5=0, \" \", 'Chp 3 - Condition Assessment'!AB5)","v":" "},{"$f":"IF('Chp 3 - Condition Assessment'!AC5=0, \" \", 'Chp 3 - Condition Assessment'!AC5)","v":" "},{"$f":"IF('Chp 3 - Condition Assessment'!AD5=0, \" \", 'Chp 3 - Condition Assessment'!AD5)","v":" "},{"$f":"IF('Chp 3 - Condition Assessment'!AE5=0, \" \", 'Chp 3 - Condition Assessment'!AE5)","v":" "},{"$f":"IF('Chp 3 - Condition Assessment'!AF5=0, \" \", 'Chp 3 - Condition Assessment'!AF5)","v":" "},{"$f":"IF('Chp 3 - Condition Assessment'!AG5=0, \" \", 'Chp 3 - Condition Assessment'!AG5)","v":""}]
{"$rows_left_out":1}
{"sheet":"Appendix C - Project List","index":14,"n_rows":4,"n_cols":5,"rows_kept":4,"cut":false,"hidden":false,"merged":[[0,0,0,4]]}
["Appendix C: Proposed Investment Project List"]
[]
["Project Year","Project Name","Asset/Asset Class","Cost","Priority"]
[{"$f":"IF('Chp 5 - Work Plans & Schedules'!A10 = 0, \" \", 'Chp 5 - Work Plans & Schedules'!A10)","v":" "},{"$f":"IF('Chp 5 - Work Plans & Schedules'!B10 = 0, \" \", 'Chp 5 - Work Plans & Schedules'!B10)","v":" "},{"$f":"IF('Chp 5 - Work Plans & Schedules'!C10 = 0, \" \", 'Chp 5 - Work Plans & Schedules'!C10)","v":" "},{"$f":"IF('Chp 5 - Work Plans & Schedules'!D10 = 0, \" \", 'Chp 5 - Work Plans & Schedules'!D10)","v":" "},{"$f":"IF('Chp 5 - Work Plans & Schedules'!E10 = 0, \" \", 'Chp 5 - Work Plans & Schedules'!E10)","v":" "}]

{"sheet":"Reference Sheet","index":15,"n_rows":19,"n_cols":13,"rows_kept":19,"cut":false,"hidden":true,"merged":[[3,12,3,13],[1,0,1,10],[3,3,3,4],[3,0,3,1],[3,6,3,7],[3,9,3,10]]}
[]
["This sheet will be hidden in the final tool. It contains references for the fields in the tools that require references (e.g drop down menus)"]
[]
["Getting Started",null,null,"Chp 1 - Introduction",null,null,"Chp 2 - Asset Portfolio",null,null,"Chp 3 - Condition Assessment",null,null,"Chp 5 - Work Plans & Schedules"]
[]
["Reference List Status",null,null,null,null,null,"Asset Class",null,null,"Past ULB?",null,null,"Priority"]
{"$rows_left_out":14}
{"sheet":"Inventory Ref Sheet","index":16,"n_rows":100,"n_cols":40,"rows_kept":100,"cut":false,"hidden":true,"merged":[]}
["Original Table",null,null,null,null,null,null,null,null,null,"Criteria","Asset Category",null,null,null,null,null,null,null,null,"Criteria","Asset Category",null,null,null,null,null,null,null,null,"Criteria","Asset Category"]
[null,null,null,null,null,null,null,null,null,null,null,"Equipment",null,null,null,null,null,null,null,null,null,"Facilities",null,null,null,null,null,null,null,null,null,"Rolling Stock"]
[]
["Asset Category","Asset Class","Asset Name","Make","Model","ID/Serial No.","Asset Owner","Age (Yrs)","TERM Scale Condition","Replacement Cost/Value","Asset Category","Asset Class","Asset Name","Make","Model","ID/Serial No.","Asset Owner","Age (Yrs)","TERM Scale Condition","Replacement Cost/Value","Asset Category","Asset Class","Asset Name","Make","Model","ID/Serial No.","Asset Owner","Age (Yrs)","TERM Scale Condition","Replacement Cost/Value","Asset Category","Asset Class","Asset Name","Make","Model","ID/Serial No.","Asset Owner","Age (Yrs)","TERM Scale Condition","Replacement Cost/Value"]
[{"$f":"IF(LEN('Chp 2 - Asset Portfolio'!I7)=0,\"\",'Chp 2 - Asset Portfolio'!I7)","v":""},{"$f":"IF(LEN('Chp 2 - Asset Portfolio'!J7)=0,\"\",'Chp 2 - Asset Portfolio'!J7)","v":""},{"$f":"IF(LEN('Chp 2 - Asset Portfolio'!K7)=0,\"\",'Chp 2 - Asset Portfolio'!K7)","v":""},{"$f":"IF(LEN('Chp 2 - Asset Portfolio'!L7)=0,\"\",'Chp 2 - Asset Portfolio'!L7)","v":""},{"$f":"IF(LEN('Chp 2 - Asset Portfolio'!M7)=0,\"\",'Chp 2 - Asset Portfolio'!M7)","v":""},{"$f":"IF(LEN('Chp 2 - Asset Portfolio'!N7)=0,\"\",'Chp 2 - Asset Portfolio'!N7)","v":""},{"$f":"IF(LEN('Chp 2 - Asset Portfolio'!O7)=0,\"\",'Chp 2 - Asset Portfolio'!O7)","v":""},{"$f":"IF(LEN('Chp 2 - Asset Portfolio'!P7)=0,\"\",'Chp 2 - Asset Portfolio'!P7)","v":""},{"$f":"IF(LEN('Chp 2 - Asset Portfolio'!Q7)=0,\"\",'Chp 2 - Asset Portfolio'!Q7)","v":""},{"$f":"IF(LEN('Chp 2 - Asset Portfolio'!R7)=0,\"\",'Chp 2 - Asset Portfolio'!R7)","v":""}]
[{"$f":"IF(LEN('Chp 2 - Asset Portfolio'!I8)=0,\"\",'Chp 2 - Asset Portfolio'!I8)","v":""},{"$f":"IF(LEN('Chp 2 - Asset Portfolio'!J8)=0,\"\",'Chp 2 - Asset Portfolio'!J8)","v":""},{"$f":"IF(LEN('Chp 2 - Asset Portfolio'!K8)=0,\"\",'Chp 2 - Asset Portfolio'!K8)","v":""},{"$f":"IF(LEN('Chp 2 - Asset Portfolio'!L8)=0,\"\",'Chp 2 - Asset Portfolio'!L8)","v":""},{"$f":"IF(LEN('Chp 2 - Asset Portfolio'!M8)=0,\"\",'Chp 2 - Asset Portfolio'!M8)","v":""},{"$f":"IF(LEN('Chp 2 - Asset Portfolio'!N8)=0,\"\",'Chp 2 - Asset Portfolio'!N8)","v":""},{"$f":"IF(LEN('Chp 2 - Asset Portfolio'!O8)=0,\"\",'Chp 2 - Asset Portfolio'!O8)","v":""},{"$f":"IF(LEN('Chp 2 - Asset Portfolio'!P8)=0,\"\",'Chp 2 - Asset Portfolio'!P8)","v":""},{"$f":"IF(LEN('Chp 2 - Asset Portfolio'!Q8)=0,\"\",'Chp 2 - Asset Portfolio'!Q8)","v":""},{"$f":"IF(LEN('Chp 2 - Asset Portfolio'!R8)=0,\"\",'Chp 2 - Asset Portfolio'!R8)","v":""}]
{"$rows_left_out":94}