{"text_format":"1","workbook":"xlsx","n_sheets":13,"sheets":["Cover","Menu","Instructions","Enterprise-Level Questions","Asset Class-Level Questions","Asset Class Descriptions","MaturityScores","Enterprise-LevelFrameworkScores","BackgroundMetrics","AssetClass-LevelFrameworkScores","Text for Graphics","Survey_Responses","Signature page"],"not_rendered":{"charts":5,"images":5,"macros":1,"external_links":0,"defined_names":11,"comments":0,"pivot_tables":0},"unopened":[],"bounds":{"document_bytes":16777216,"sheet_cells":100000,"rows_first":2000,"rows_last":500,"rows_between":2000,"halvings":0,"cell_chars":16384,"cell_head_chars":4096},"cells_cut":0,"cells_raw":0,"read":"whole","date_system":"1900"}

{"sheet":"Cover","index":0,"n_rows":34,"n_cols":7,"rows_kept":34,"cut":false,"hidden":true,"merged":[[33,1,34,9],[25,1,25,4],[27,1,27,9],[29,1,29,9],[2,1,2,9],[3,1,3,9],[31,1,31,9],[23,1,23,9]]}
[]
[]
[]
[null,"Transit Agency Asset Management Maturity Self-Assessment"]
[]
[]
[]
[]
[null,null,"Prepared by:"]
[]
[]
[]
[]
[]
[null,null,null,null,null,null,"UPDATED BY"]
[null,null,null,null,null,null,"U.S. DOT Volpe National Transportation Systems Center"]
[null,null,null,null,null,null,"Brian DeChambeau"]
[null,null,null,null,null,null,"Anna Biton"]
[]
[]
{"$rows_left_out":15}
{"sheet":"Menu","index":1,"n_rows":2,"n_cols":2,"rows_kept":2,"cut":false,"hidden":true,"merged":[[1,1,1,4]]}
[]
[null,"Menu"]

{"sheet":"Instructions","index":2,"n_rows":26,"n_cols":4,"rows_kept":26,"cut":false,"hidden":true,"merged":[[3,2,3,3]]}
[]
[]
[]
[null,null,"Transit Agency Asset Management Maturity Self-Assessment"]
[]
[null,null,"Background:","As described in Chapter 5 of the FTA Asset Management Guide, asset management maturity refers to the quality and sophistication of an agency’s asset management practices. As your agency moves forward with the development of an asset management approach, it is helpful to establish a basic understanding of your agency's current asset management awareness and maturity (referred to as the \"asset management baseline\"). The asset management baseline can then be incorporated into an Asset Management Plan and used to identify priorities and establish a path forward. \n\nThis self-assessment tool is organized around the asset management framework introduced in Chapter 2 of the FTA Asset Management Guide and assumes a level of background based on reading at least Chapters 2 and 3 of the Guide. Throughout the self-assessment, there are references to specific sections of the Asset Management Guide for those interested in additional background information.  \n"]
[]
[null,null,"Benefits of Using This Tool:","\nThis tool will help your agency:\n\n• Develop a common language and definition regarding asset management \n• Reach consensus on the agency’s asset management baseline, which refers to the agency’s current state of asset management awareness and maturity\n• Provide a basis for discussing the agency’s asset management policy, goals, and vision\n• Encourage communication and consensus building across transitionally isolated parts of an agency\n• Assess the agency’s progress over time\n• Apply the information and practices described in the FTA Asset Management Guide to your agency\n"]
[]
[null,null,"Suggested Approach:","\nThe following outlines suggested participants and an approach. You may wish to customize the approach to better fit your agency’s specific needs.\n"]
[null,null,null,"Suggested Participants"]
[null,null,null,"Asset Management Program Manager: Leader of the agency’s asset management initiative."]
[null,null,null,"Asset Management Improvement Team: Cross-functional group of asset management stakeholders representing functions including maintenance, operations, engineering, finance, capital planning, information technology, and other related departments.  This group should be the asset management knowledge and practice leadership for the organization.\n"]
[null,null,null,"Suggested Steps"]
[null,null,null,"The figure below outlines suggested steps for using the self-assessment tool.  These steps are described in more detail below."]
[]
[null,null,null,"Step 1 - Members of the Asset Management Improvement Team fill out this self-assessment individually. Depending on their asset management role, they may fill it out from their individual standpoint, focusing on their own team or department, or they may take an agency-wide perspective. Each team member should note the perspective from which he or she completed the self-assessment. \n\nFor each statement, the team member should select the most appropriate response from the drop-down menu of choices. Each response corresponds to a score of 1 to 5. Further explanation of each of the five response choices is provided below. \n"]
[null,null,null,"1 - Totally Disagree: This statement does not at all describe your agency. This is the equivalent of 0% progress."]
[null,null,null,"2 - Mostly Disagree: This statement mostly does not describe your agency, but there exist areas of progress or exceptions (around 25% progress). "]
[null,null,null,"3 - Neutral: This statement describes some areas of your agency but not others, or progress is significant (around 50% progress) but not at all complete. "]
{"$rows_left_out":7}
{"sheet":"Enterprise-Level Questions","index":3,"n_rows":97,"n_cols":5,"rows_kept":97,"cut":false,"hidden":false,"merged":[]}
[]
[]
[]
[]
["AM Framework","Maturity Level",null,"Enterprise-Level Questions"]
[null,null,null,"Note: You must provide a response for each question, unless it is automatically populated. Select your response from the drop-down menus.","Score"]
[]
[null,null,null,"1. Policy - For more information about the role of asset management policy, review Section 3.1.1 of the Asset Management Guide."]
["Policy",1,null,"1.1. An agency-wide asset management policy is in place to support the establishment of asset management vision and goals and implementation of an asset management strategy. "]
["Policy",1,null,"1.2. The agency-wide asset management policy is reviewed and adopted by the executive team or senior management.  The asset management policy is regularly evaluated, evolved, and communicated. "]
["Policy",1,null,"1.3. The asset management policy is clearly linked to / explicitly supported by the agency’s overall strategy and planning and to key business processes. "]
[]
[null,null,null,"2. Strategy - For more detail on the role of asset management strategy, see Section 3.1.2 of the Asset Management Guide."]
["Strategy",1,null,"2.1. An asset management strategy is in place and provides sufficient information, direction, and accountabilities to support the implementation of the asset management policy. "]
["Strategy",1,null,"2.2 .The asset management strategy is in place and outlines asset-specific outcomes and provides high-level direction and expectations for asset management by asset class and functional managers. "]
["Strategy",1,null,"2.3. The asset management strategy is clearly linked to / explicitly supported by the organization’s business processes.  "]
["Strategy",1,null,"2.4. Agency-wide asset management strategy and goals are reviewed and adopted by the executive team or senior management. "]
[]
[null,null,null,"3. Business Plan - For more on the role of Asset Management Planning, see Sections 3.1.3 and 5.4 of the Asset Management Guide."]
["Business Plan",1,null,"3.1. Detailed asset management activities, roles and responsibilities, resources, and timelines are clearly outlined in an Asset Management Plan. "]
{"$rows_left_out":78}
{"sheet":"Asset Class-Level Questions","index":4,"n_rows":91,"n_cols":22,"rows_kept":91,"cut":false,"hidden":true,"merged":[[4,4,6,4],[3,6,4,9],[3,14,4,17]]}
[]
[]
[]
[null,null,null,null,"Asset Class-Level Questions",null,"1 - Totally Disagree: This statement does not at all describe your agency. This is the equivalent of 0% progress.\n2 - Mostly Disagree: This statement mostly does not describe your agency, but there exist areas of progress or exceptions (around 25% progress). \n3 - Neutral: This statement describes some areas of your agency but not others, or progress is significant (around 50% progress) but not at all complete. \n4 - Somewhat Agree: This statement mostly describes your agency, but progress is incomplete (around 75% progress), or certain areas are exceptions.\n5 - Totally Agree: This statement accurately describes your agency and its progress. This is 100% complete with few if any areas of exception.",null,null,null,null,null,null,null,"1 - Totally Disagree: This statement does not at all describe your agency. This is the equivalent of 0% progress.\n2 - Mostly Disagree: This statement mostly does not describe your agency, but there exist areas of progress or exceptions (around 25% progress). \n3 - Neutral: This statement describes some areas of your agency but not others, or progress is significant (around 50% progress) but not at all complete. \n4 - Somewhat Agree: This statement mostly describes your agency, but progress is incomplete (around 75% progress), or certain areas are exceptions.\n5 - Totally Agree: This statement accurately describes your agency and its progress. This is 100% complete with few if any areas of exception."]
[null,null,null,null,"The Asset Class-Level Questions are intended to be answered for each of your agency’s asset classes. The asset class breakdown is a suggested hierarchy of 15 classes more fully described in the Asset Class Supplement to the Asset Management Guide. Brief descriptions are available through the link below.\n\nBefore answering these questions, the people filling out the tool should reach agreement on which of your agency’s assets fall into each of the asset classes provided. \n\nAdditionally, for any asset class that your agency does not manage, please select \"Not Applicable\" from the menu highlighted in yellow below the asset title. For all applicable categories, you must select a response for each question."]
[null,null,null,null,null,"\n1. Rail Vehicles (Revenue)","\n2. Buses (Revenue)","\n3. Rail Vehicles (Non-Revenue)","\n4. Other Vehicles (Non-Revenue)","\n5. Rail Vehicle Maintenance Facilities","\n6. Rubber Tire Vehicle Maintenance Facilities","\n7. Service Facilities","\n8. Revenue Collection","\n9. Stations","\n10. Track","\n11. Bridges","\n12. Tunnels","\n13. Ancillary Structures","\n14. Security","\n15. Traction Power Electrification","\n16. Signals/ Automatic Train Control","\n17. Communications/ Monitoring/SCADA"]
[null,null,null,null,null,2,2,2,2,2,2,2,2,2,2,2,2,2,2,2,2,2]
[null,null,null,null,"A.1. A condition inspection/monitoring program is in place for this asset class. \n"]
["AM Framework","Maturity Level",null,null,"A.2. The level of resources expended to gather condition data is commensurate with the level of risk and uncertainty associated with this asset class.   \n"]
[null,null,null,null,"A.3. Condition and performance targets are established, monitored, and revised to ensure level of service requirements are met and to support continuous performance improvement.\n"]
["Policy",1,0,null,"A.4. A lifecycle management plan for this asset class is updated regularly to document the lifecycle costs, performance, and risks associated with each asset class and ensure they reflect input from staff throughout the agency."]
["Policy",1,0,null,"A5. This asset class's lifecycle management plan exists and outlines the investment approach to minimize the total cost of ownership throughout assets' lifecycles, including considerations for design/procurement, development of the preventive maintenance and capital rehabilitation strategy, and disposal.\n"]
[null,null,null,null,"A6. Data collected from information systems are used to support performance modeling to determine optimal capital and operations budgeting and investment timing within this asset class.\n"]
[null,null,null,null,"A7. Data collected from maintenance information systems are used for reliability modeling to support maintenance scheduling, effectiveness, and performance improvement."]
[]
["Policy",1,0]
[]
[]
[]
["Business Plan",1,0]
{"$rows_left_out":72}
{"sheet":"Asset Class Descriptions","index":5,"n_rows":30,"n_cols":3,"rows_kept":30,"cut":false,"hidden":true,"merged":[[5,1,6,2],[4,1,4,2],[8,1,8,2],[11,1,11,2],[9,1,9,2]]}
[]
[]
[]
[]
[null,"Instructions for Asset Class-Level Questions"]
[null,"The Asset Class-Level Questions are intended to be answered for each of your agency’s asset classes. The asset class breakdown is a suggested hierarchy of 15 classes more fully described in the Asset Class Supplement to the Asset Management Guide. Brief descriptions are available through the link below.\n\nBefore answering these questions, the people filling out the tool should reach agreement on which of your agency’s assets fall into each of the asset classes provided. \n\nAdditionally, for any asset class that your agency does not manage, please select \"Not Applicable\" from the menu highlighted in yellow below the asset title. For all applicable categories, you must select a response for each question."]
[]
[]
[null,"Transit Asset Categories and Classes"]
[]
[]
[null,"Asset Class Descriptions"]
[]
[null,"1. Rail & Fixed Guideway Revenue Vehicles","Revenue rail vehicles include passenger intercity and regional rail, heavy rail/subway, light rail, streetcar and heritage trolleys, automated people movers, and other fixed guideway vehicles. "]
[null,"2. Buses and Paratransit Vehciles","Bus and paratransit vehicles include transit (inner-city), suburban (over-the-road coaches), and specialty vehicles (for example, trolleys and vans). Additionally dedicated guideway vehicles include bus rapid transit (BRT) vehicles."]
[null,"3. Rail & Fixed Guideway Non-Revenue Vehicles","Rail and Fixed Guideway Non-Revenue Vehicles refers to any fixed guideway vehicle supporting revenue or non-revenue service. Non-revenue rail vehicles include track service equipment, tampers, rail grinders, work cars/trucks, hi-rail vehicles, snow removal equipment, and re-railing equipment. "]
[null,"4. Other Non-Revenue Vehicles","Other Non-Revenue Vehicles refers to any rubber-tired vehicle supporting revenue or non-revenue service.  Non-revenue vehicles include service vehicles, street supervisor vehicles, management vehicles, wreckers, and yard tugs."]
[null,"5. Rail Vehicle Maintenance Facilities","Rail Vehicle Maintenance Facilities refers to the structures used for maintaining steel-wheeled fixed guideway revenue vehicles (for example, commuter railcars, locomotives, electric and diesel multiple units, and streetcars) and supporting shops."]
[null,"6. Rubber Tire Vehicle Maintenance Facilities","Rubber Tire Vehicle Maintenance Facilities refers to the structures used for maintaining rubber-tired revenue vehicles (for example, over-the-road coaches, articulated buses, municipal buses, paratransit buses, and vans) and supporting shops."]
[null,"7. Other Maintenance and Administrative Facilities","Service Facilities refers to all structures not covered in the previous two bullets. These include, for example, facilities addressing the following functions: non-revenue maintenance support, maintenance of way and buildings and grounds field crew, operations offices, administrative facilities, operations central control, and central warehouses."]
{"$rows_left_out":11}
{"sheet":"MaturityScores","index":6,"n_rows":44,"n_cols":10,"rows_kept":44,"cut":false,"hidden":true,"merged":[[13,7,13,8],[14,7,14,8],[8,1,10,13]]}
[]
[]
[]
[]
[]
[]
[null,"Maturity Scoring"]
[]
[null,"Figure 1 below depicts a simplified approach to characterizing an agency’s asset management maturity progress with five levels. A complete asset management program will have all levels functioning well; however, it is not unusual for an agency to conduct asset management activities that span all of these maturity levels at one time or to have skipped some levels while performing activities at another level. For example, many agencies have one or more asset inventories in place without any asset management policies or strategies. The figures below show your agency’s progress toward achieving a mature asset management approach. A score of at least 80% for any level indicates substantial progress with respect to that level. A score of less than 80% implies an area of improvement.  Figure 2 compares the maturity scores at each maturity level. More information about the asset management maturity levels can be found in Section 5.3 of the Asset Management Guide."]
[]
[]
[]
[]
[null,null,null,null,"Level 1","Level 2","Level 3","Level 4",null,"Level 5"]
[null,null,"Figure 1",null,{"$f":"BackgroundMetrics!$F$8","v":0},{"$f":"BackgroundMetrics!$F$9","v":0},{"$f":"BackgroundMetrics!$F$10","v":0},{"$f":"BackgroundMetrics!$F$11","v":0},null,{"$f":"BackgroundMetrics!$F$12","v":0}]
[]
[]
[]
[]
[]
{"$rows_left_out":25}
{"sheet":"Enterprise-LevelFrameworkScores","index":7,"n_rows":36,"n_cols":2,"rows_kept":36,"cut":false,"hidden":true,"merged":[[9,0,31,0],[8,1,8,10]]}
[]
[]
[]
[]
[]
[]
[null,"Enterprise-Level Framework Scores"]
[]
[null,"Figures 3 and 4 below show the progress and maturity of your agency’s adoption of specific asset management processes. Approaches for improving each of these processes can be found in Chapters 3 and 4 of the asset management guide."]
[]
[]
[null,"Figure 3"]
[]
[]
[]
[]
[]
[]
[]
[]
{"$rows_left_out":17}
{"sheet":"BackgroundMetrics","index":8,"n_rows":44,"n_cols":19,"rows_kept":44,"cut":false,"hidden":true,"merged":[[4,1,4,2]]}
[]
[]
[]
[]
[null,"Enterprise-Level Questions"]
[]
[null,"Maturity Level","# of Maturity Level Questions","Total Potential Points","Total Actual Points","Score"]
[null,1,{"$f":"COUNTIF('Enterprise-Level Questions'!$B$9:$B$99, B8)","v":13},{"$f":"C8 * 5","v":65},{"$f":"SUMIF('Enterprise-Level Questions'!$B$9:$B$99, BackgroundMetrics!B8, 'Enterprise-Level Questions'!$E$9:$E$97)","v":0},{"$f":"E8 / D8","v":0}]
[null,2,{"$f":"COUNTIF('Enterprise-Level Questions'!$B$9:$B$99, B9)","v":5},{"$f":"C9 * 5","v":25},{"$f":"SUMIF('Enterprise-Level Questions'!$B$9:$B$99, BackgroundMetrics!B9, 'Enterprise-Level Questions'!$E$9:$E$97)","v":0},0]
[null,3,{"$f":"COUNTIF('Enterprise-Level Questions'!$B$9:$B$99, B10)","v":8},40,{"$f":"SUMIF('Enterprise-Level Questions'!$B$9:$B$99, BackgroundMetrics!B10, 'Enterprise-Level Questions'!$E$9:$E$97)","v":0},0]
[null,4,{"$f":"COUNTIF('Enterprise-Level Questions'!$B$9:$B$99, B11)","v":9},45,{"$f":"SUMIF('Enterprise-Level Questions'!$B$9:$B$99, BackgroundMetrics!B11, 'Enterprise-Level Questions'!$E$9:$E$97)","v":0},{"$f":"E11 / D11","v":0}]
[null,5,{"$f":"COUNTIF('Enterprise-Level Questions'!$B$9:$B$99, B12)","v":9},45,{"$f":"SUMIF('Enterprise-Level Questions'!$B$9:$B$99, BackgroundMetrics!B12, 'Enterprise-Level Questions'!$E$9:$E$97)","v":0},{"$f":"E12 / D12","v":0}]
[]
[null,"Framework Level","# of Framework Area Questions","Total Potential Points","Total Actual Points","Score"]
[null,"Policy",{"$f":"COUNTIF('Enterprise-Level Questions'!$A$9:$A$99, B15)","v":3},{"$f":"C15 * 5","v":15},{"$f":"SUMIF('Enterprise-Level Questions'!$A$9:$A$99, BackgroundMetrics!B15, 'Enterprise-Level Questions'!$E$9:$E$97)","v":0},{"$f":"E15 / D15","v":0}]
[null,"Strategy",{"$f":"COUNTIF('Enterprise-Level Questions'!$A$9:$A$99, B16)","v":4},20,{"$f":"SUMIF('Enterprise-Level Questions'!$A$9:$A$99, BackgroundMetrics!B16, 'Enterprise-Level Questions'!$E$9:$E$97)","v":0},0]
[null,"Business Plan",{"$f":"COUNTIF('Enterprise-Level Questions'!$A$9:$A$99, B17)","v":6},30,{"$f":"SUMIF('Enterprise-Level Questions'!$A$9:$A$99, BackgroundMetrics!B17, 'Enterprise-Level Questions'!$E$9:$E$97)","v":0},0]
[null,"Inventory",{"$f":"COUNTIF('Enterprise-Level Questions'!$A$9:$A$99, B18)","v":4},20,{"$f":"SUMIF('Enterprise-Level Questions'!$A$9:$A$99, BackgroundMetrics!B18, 'Enterprise-Level Questions'!$E$9:$E$97)","v":0},0]
[null,"Condition Assessment & Performance Monitoring",{"$f":"COUNTIF('Enterprise-Level Questions'!$A$9:$A$99, B19)","v":4},20,{"$f":"SUMIF('Enterprise-Level Questions'!$A$9:$A$99, BackgroundMetrics!B19, 'Enterprise-Level Questions'!$E$9:$E$97)","v":0},0]
[null,"Lifecycle Management Planning",{"$f":"COUNTIF('Enterprise-Level Questions'!$A$9:$A$99, B20)","v":4},20,{"$f":"SUMIF('Enterprise-Level Questions'!$A$9:$A$99, BackgroundMetrics!B20, 'Enterprise-Level Questions'!$E$9:$E$97)","v":0},0]
{"$rows_left_out":25}
{"sheet":"AssetClass-LevelFrameworkScores","index":9,"n_rows":40,"n_cols":2,"rows_kept":40,"cut":false,"hidden":true,"merged":[[6,1,6,9]]}
[]
[]
[]
[]
[null,"Asset Class-Level Framework Scores"]
[]
[null,"Figures 5 and 6 below show the progress and maturity of your agency’s asset management approach for specific asset classes. Approaches for improving the maturity of each asset class can be found in the Asset Class Supplement to the Asset Management Guide."]
[]
[null,"Figure 5"]
[]
[]
[]
[]
[]
[]
[]
[]
[]
[]
[]
{"$rows_left_out":21}
{"sheet":"Text for Graphics","index":10,"n_rows":18,"n_cols":5,"rows_kept":18,"cut":false,"hidden":true,"merged":[]}
[1]
[null,"Remaining","For Graphic"]
[null,{"$f":"1-BackgroundMetrics!F8","v":1},"\"I know where I want to be\" (Level 1)","\"I know where I want to be\""]
[null,{"$f":"1-BackgroundMetrics!F9","v":1},"\"I know what I have\" (Level 2)","\"I know what I have\""]
[null,{"$f":"1-BackgroundMetrics!F10","v":1},"\"I know where I am against my objectives\" (Level 3)","\"I know where I am against my objectives\""]
[null,{"$f":"1-BackgroundMetrics!F11","v":1},"\"I use lifecycle information in my budgeting process\" (Level 4)","\"I use lifecycle information in my budgeting process\""]
[null,{"$f":"1-BackgroundMetrics!F12","v":1},"\"I know how to optimally manage across the lifecycle\" (Level 5)","\"I know how to optimally manage across the lifecycle\""]
[]
[]
[null,null,"Threshold",0.8]
[]
[null,null,"Logic Tests",{"$f":"IF(BackgroundMetrics!$F8>=$D$10,1,0)","v":0},{"$f":"D12","v":0}]
[null,null,null,{"$f":"IF(BackgroundMetrics!$F9>=$D$10,1,0)","v":0},{"$f":"IF(AND(D13=1, E12=1),1,0)","v":0}]
[null,null,null,{"$f":"IF(BackgroundMetrics!$F10>=$D$10,1,0)","v":0},{"$f":"IF(AND(D13=1, D12=1, D14=1),1,0)","v":0}]
[null,null,null,{"$f":"IF(BackgroundMetrics!$F11>=$D$10,1,0)","v":0},{"$f":"IF(AND(D13=1, D12=1, D14=1, D15=1),1,0)","v":0}]
[null,null,null,{"$f":"IF(BackgroundMetrics!$F12>=$D$10,1,0)","v":0},{"$f":"IF(AND(D13=1, D12=1, D14=1, D15=1, D16=1),1,0)","v":0}]
[]
[null,null,null,null,{"$f":"SUM(E12:E16)","v":0}]

{"sheet":"Survey_Responses","index":11,"n_rows":10,"n_cols":3,"rows_kept":10,"cut":false,"hidden":true,"merged":[]}
[1]
["Score","Response","Long Response"]
[1,"1 - Totally Disagree","This statement does not at all describe your agency. This is the equivalent of 0% progress."]
[2,"2 - Mostly Disagree","This statement mostly does not describe your agency, but there exist areas of progress or exceptions (25% progress). "]
[3,"3 - Neutral","This statement describes some areas of your agency, but not others or progress is significant (around 50%) but not at all complete. "]
[4,"4 - Somewhat Agree","This statement mostly describes your agency, but progress is incomplete (around 75%) or certain areas are exceptions."]
[5,"5 - Totally Agree","This statement accurately describes your agency and its progress. This is 100% complete."]
[]
[1,"Not Applicable","This asset class is not applicable to your agency."]
[2,"Applicable","Blank: your agency holds these assets."]

{"sheet":"Signature page","index":12,"n_rows":0,"n_cols":0,"rows_kept":0,"cut":false,"hidden":false,"merged":[]}