{"text_format":"1","workbook":"xlsx","n_sheets":6,"sheets":["Read Me","Data Dictionary","Track by Mode","Roadway by Mode","Track and Roadway by Agency","Summary Tables"],"not_rendered":{"charts":4,"images":0,"macros":1,"external_links":0,"defined_names":18,"comments":0,"pivot_tables":0},"unopened":[],"bounds":{"document_bytes":16777216,"sheet_cells":100000,"rows_first":2000,"rows_last":500,"rows_between":2000,"halvings":0,"cell_chars":16384,"cell_head_chars":4096},"cells_cut":0,"cells_raw":0,"read":"whole","date_system":"1900"}

{"sheet":"Read Me","index":0,"n_rows":0,"n_cols":0,"rows_kept":0,"cut":false,"hidden":false,"merged":[]}

{"sheet":"Data Dictionary","index":1,"n_rows":56,"n_cols":3,"rows_kept":56,"cut":false,"hidden":false,"merged":[]}
["Term","Who reports it?","Definition"]
["Agency","All","The transit agency's name."]
["City","All","The city in which the agency is headquartered."]
["State","All","The state in which the agency is headquartered."]
["Legacy NTD ID","All","A four-digit identifying number for each agency used in the legacy NTD system."]
["NTD ID","All","A five-digit identifying number for each agency used in the current NTD system."]
["Organization Type","All","Description of the agency's legal entity."]
["Reporter Type","All","The type of NTD report that the agency completed this year."]
{"$rows_left_out":49}
{"sheet":"Track by Mode","index":2,"n_rows":98,"n_cols":39,"rows_kept":98,"cut":false,"hidden":false,"merged":[]}
["Name","City","State","Legacy NTD ID","NTD ID","Organization Type","Reporter Type","Primary UZA Population","Agency VOMS","Mode","TOS","Mode VOMS","Miles of Track:","At Grade: Restricted Right-of-Way","At Grade: Restricted Right-of-Way Questionable","Street Running","Street Running Questionable","Elevated on Structure","Elevated on Structure Questionable","Elevated on Fill","Elevated on Fill Questionable","Open Cut","Open Cut Questionable","Subway","Subway Questionable","Total Miles","Total Miles Questionable","Number of Crossings:","At Grade: Restricted Right-of-Way Crossings","At Grade: Restricted Right-of-Way Questionable","Street Running Crossings","Street Running Questionable","Total Crossings","Total Crossings Questionable","Any data questionable?",null,null,null,{"$f":"IF(AM4=1,1,0)","v":1}]
["MTA New York City Transit","New York","NY",2008,20008,"Subsidiary Unit of a Transit Agency, Reporting Separately","Full Reporter",18351295,11004,"HR","DO",5324,null,137.30000000000001,null,0,null,196.3,null,29,null,29.5,null,440.4,null,832.5,null,null,0,null,0,null,0,null,{"$f":"IF(AH2&AF2&AD2&AA2&Y2&W2&U2&S2&Q2&O2<>\"\",\"Yes\",\"No\")","v":"No"},null,null,null,"Hide questionable data tags"]
["New Jersey Transit Corporation","Newark","NJ",2080,20080,"Other Publicly-Owned or Privately Chartered Corporation","Full Reporter",18351295,4056,"CR","DO",1267,null,812.6,null,0,null,10.4,null,28.4,null,8.6,null,8,null,868,null,null,328,null,0,null,328,null,"No",null,null,null,"Show questionable data tags"]
["New Jersey Transit Corporation","Newark","NJ",2080,20080,"Other Publicly-Owned or Privately Chartered Corporation","Full Reporter",18351295,4056,"LR","PT",42,null,31.3,null,1.6,null,2.7,null,0.9,null,0,null,0,null,36.5,null,null,24,null,9,null,33,null,"No",null,null,null,1]
["New Jersey Transit Corporation","Newark","NJ",2080,20080,"Other Publicly-Owned or Privately Chartered Corporation","Full Reporter",18351295,4056,"YR","PT",16,null,52.9,null,3.8,null,0,null,0,null,0,null,0,null,56.7,null,null,59,null,13,null,72,null,"No"]
["New Jersey Transit Corporation","Newark","NJ",2080,20080,"Other Publicly-Owned or Privately Chartered Corporation","Full Reporter",18351295,4056,"LR","DO",14,null,9.1,null,1.5,null,0,null,0,null,0,null,3.3,null,13.9,null,null,5,null,10,null,15,null,"No"]
["Los Angeles County Metropolitan Transportation Authority dba: Metro","Los Angeles","CA",9154,90154,"Independent Public Agency or Authority of Transit Service","Full Reporter",12150996,3544,"LR","DO",161,null,104.4,null,0,null,18,null,34.799999999999997,null,17.8,null,5.6,null,180.6,null,null,181,null,0,null,181,null,"No"]
["Los Angeles County Metropolitan Transportation Authority dba: Metro","Los Angeles","CA",9154,90154,"Independent Public Agency or Authority of Transit Service","Full Reporter",12150996,3544,"HR","DO",70,null,1.3,null,0,null,0,null,0,null,0.2,null,32.6,null,34.1,null,null,0,null,0,null,0,null,"No"]
{"$rows_left_out":91}
{"sheet":"Roadway by Mode","index":3,"n_rows":594,"n_cols":26,"rows_kept":594,"cut":false,"hidden":false,"merged":[]}
["Name","City","State","Legacy NTD ID","NTD ID","Organization Type","Reporter Type","Primary UZA Population","Agency VOMS","Mode","TOS","Mode VOMS","Miles of Roadway:","Permanent Busway","Permanent Busway Questionable","Permanent HOV","Permanent HOV Questionable","Part-Time Busway or HOV","Part-Time Busway or HOV Questionable","Total Miles","Total Miles Questionable","Any data questionable?",null,null,null,{"$f":"IF(Z4=1,1,0)","v":1}]
["MTA New York City Transit","New York","NY",2008,20008,"Subsidiary Unit of a Transit Agency, Reporting Separately","Full Reporter",18351295,11004,"MB","DO",3286,null,25.9,null,0,null,63.5,null,89.4,null,{"$f":"IF(U2&S2&Q2&O2<>\"\",\"Yes\",\"No\")","v":"No"},null,null,null,"Hide questionable data tags"]
["MTA New York City Transit","New York","NY",2008,20008,"Subsidiary Unit of a Transit Agency, Reporting Separately","Full Reporter",18351295,11004,"CB","DO",455,null,7.1,null,9.6,null,25.9,null,42.6,null,"No",null,null,null,"Show questionable data tags"]
["MTA New York City Transit","New York","NY",2008,20008,"Subsidiary Unit of a Transit Agency, Reporting Separately","Full Reporter",18351295,11004,"RB","DO",145,null,64.599999999999994,null,0,null,0,null,64.599999999999994,null,"No",null,null,null,1]
["New Jersey Transit Corporation","Newark","NJ",2080,20080,"Other Publicly-Owned or Privately Chartered Corporation","Full Reporter",18351295,4056,"MB","DO",1857,null,0.5,null,0,null,35.799999999999997,null,36.299999999999997,null,"No"]
["New Jersey Transit Corporation","Newark","NJ",2080,20080,"Other Publicly-Owned or Privately Chartered Corporation","Full Reporter",18351295,4056,"MB","PT",182,null,0,null,0,null,0,null,0,null,"No"]
["Los Angeles County Metropolitan Transportation Authority dba: Metro","Los Angeles","CA",9154,90154,"Independent Public Agency or Authority of Transit Service","Full Reporter",12150996,3544,"MB","DO",1777,null,3.1,null,64.3,null,13.5,null,80.900000000000006,null,"No"]
["Los Angeles County Metropolitan Transportation Authority dba: Metro","Los Angeles","CA",9154,90154,"Independent Public Agency or Authority of Transit Service","Full Reporter",12150996,3544,"MB","PT",125,null,2.9,null,61.5,null,0,null,64.400000000000006,null,"No"]
{"$rows_left_out":587}
{"sheet":"Track and Roadway by Agency","index":4,"n_rows":136,"n_cols":45,"rows_kept":136,"cut":false,"hidden":false,"merged":[]}
["Name","City","State","Legacy NTD ID","NTD ID","Organization Type","Reporter Type","Primary UZA Population","VOMS","Miles of Track:","At Grade: Restricted Right-of-Way","At Grade: Restricted Right-of-Way Questionable","Street Running","Street Running Questionable","Elevated on Structure","Elevated on Structure Questionable","Elevated on Fill","Elevated on Fill Questionable","Open Cut","Open Cut Questionable","Subway","Subway Questionable","Total Track Miles","Total Track Miles Questionable","Number of Crossings:","At Grade: Restricted Right-of-Way Crossings","At Grade: Restricted Right-of-Way Questionable","Street Running Crossings","Street Running Questionable","Total Crossings","Total Crossings Questionable","Miles of Roadway:","Permanent Busway","Permanent Busway Questionable","Permanent HOV","Permanent HOV Questionable","Part-Time Busway or HOV","Part-Time Busway or HOV Questionable","Total Roadway Miles","Total Roadway Miles Questionable","Any data questionable?",null,null,null,{"$f":"IF(AS4=1,1,0)","v":1}]
["MTA New York City Transit","New York","NY",2008,20008,"Subsidiary Unit of a Transit Agency, Reporting Separately","Full Reporter",18351295,11004,null,137.30000000000001,null,0,null,196.3,null,29,null,29.5,null,440.4,null,832.5,null,null,0,null,0,null,0,null,null,97.6,null,9.6,null,89.4,null,196.6,null,{"$f":"IF(AN2&AL2&AJ2&AH2&AE2&AC2&AA2&V2&T2&X2&R2&P2&N2&L2<>\"\",\"Yes\",\"No\")","v":"No"},null,null,null,"Hide questionable data tags"]
["New Jersey Transit Corporation","Newark","NJ",2080,20080,"Other Publicly-Owned or Privately Chartered Corporation","Full Reporter",18351295,4056,null,905.9,null,6.9,null,13.1,null,29.3,null,8.6,null,11.3,null,975.1,null,null,416,null,32,null,448,null,null,0.5,null,0,null,35.799999999999997,null,36.299999999999997,null,"No",null,null,null,"Show questionable data tags"]
["Los Angeles County Metropolitan Transportation Authority dba: Metro","Los Angeles","CA",9154,90154,"Independent Public Agency or Authority of Transit Service","Full Reporter",12150996,3544,null,105.7,null,0,null,18,null,34.799999999999997,null,18,null,38.200000000000003,null,214.7,null,null,181,null,0,null,181,null,null,40.5,null,125.8,null,13.5,null,179.8,null,"No",null,null,null,1]
["Washington Metropolitan Area Transit Authority","Washington","DC",3030,30030,"Independent Public Agency or Authority of Transit Service","Full Reporter",4586770,3172,null,152.19999999999999,null,0,null,24.2,null,0.5,null,3.1,null,112.3,null,292.3,null,null,0,null,0,null,0,null,null,2.6,null,10.4,null,62.7,null,75.7,null,"No"]
["King County Department of Transportation","Seattle","WA",1,1,"City, County or Local Government Unit or Department of Transportation","Full Reporter",3059393,2818,null,0.5,null,7.4,null,0,null,0,null,0,null,0,null,7.9,null,null,0,null,55,null,55,null,null,133.4,null,176.4,null,78.7,null,388.5,null,"No"]
["Chicago Transit Authority","Chicago","IL",5066,50066,"Independent Public Agency or Authority of Transit Service","Full Reporter",8608208,2712,null,105.7,null,0,null,104.7,null,30.6,null,1.8,null,22.2,null,265,null,null,25,null,0,null,25,null,null,4.0999999999999996,null,0,null,0,null,4.0999999999999996,null,"No"]
["Massachusetts Bay Transportation Authority","Boston","MA",1003,10003,"Independent Public Agency or Authority of Transit Service","Full Reporter",4181019,2374,null,808,null,2,null,8,null,0,null,10,null,54.5,null,882.5,null,null,315,null,9,null,324,null,null,17.2,null,0,null,0,null,17.2,null,"No"]
{"$rows_left_out":129}
{"sheet":"Summary Tables","index":5,"n_rows":121,"n_cols":24,"rows_kept":121,"cut":false,"hidden":false,"merged":[[63,6,63,12],[63,13,63,15],[63,16,63,19],[48,0,48,2],[22,6,22,12],[22,13,22,15],[47,6,47,12],[47,13,47,15],[22,16,22,19],[47,16,47,19],[7,0,7,2],[1,16,1,19],[1,6,1,12],[1,13,1,15],[6,6,6,12],[6,13,6,15],[6,16,6,19]]}
["To bring up the accessible control panel, press ctrl + a. Some screen reading functionality will not work while the sheet is protected. To unprotect the sheet press alt h o p and enter the password ntd.",null,null,null,null,"National Totals","At Grade: Restricted Right-of-Way","Street Running","Elevated on Structure","Elevated on Fill","Open Cut","Subway","Total Track Miles","At Grade: Restricted Right-of-Way","Street Running","Total Crossings","Permanent Busway","Permanent HOV","Part-Time Busway or HOV","Total Roadway Miles"]
[null,null,null,null,null,null,"Miles of Track",null,null,null,null,null,null,"Number of Crossings",null,null,"Miles of Roadway",null,null,null,null,null,null,{"$f":"IF(X5=1,0,1)","v":0}]
[null,null,null,null,null,"VOMS","At Grade: Restricted Right-of-Way\nTrack Miles","\n\nStreet Running\nTrack Miles","\n\nElevated on Structure\nTrack Miles","\n\nElevated on Fill\nTrack Miles","\n\n\nOpen Cut\nTrack Miles","\n\n\nSubway\nTrack Miles","Total Track Miles","At Grade: Restricted Right-of-Way\nCrossings","\n\nStreet Running\nCrossings","Total Crossings","\n\nPermanent Busway\nRoadway Miles","\n\nPermanent HOV\nRoadway Miles","\nPart-Time Busway or HOV\nRoadway Miles","Total Roadway Miles",null,null,null,"Include questionable data"]
[null,null,null,null,null,{"$f":"IF($X$2,SUMIFS('Track by Mode'!L:L,'Track by Mode'!AI:AI,\"=No\")+SUMIFS('Roadway by Mode'!L:L,'Roadway by Mode'!V:V,\"=No\"),SUM('Track by Mode'!L:L)+SUM('Roadway by Mode'!L:L))","v":68980},{"$f":"IF($X$2,SUMIFS('Track by Mode'!N:N,'Track by Mode'!$AI:$AI,\"=No\"),SUM('Track by Mode'!N:N))","v":10148.300000000001},{"$f":"IF($X$2,SUMIFS('Track by Mode'!P:P,'Track by Mode'!$AI:$AI,\"=No\"),SUM('Track by Mode'!P:P))","v":345},{"$f":"IF($X$2,SUMIFS('Track by Mode'!R:R,'Track by Mode'!$AI:$AI,\"=No\"),SUM('Track by Mode'!R:R))","v":799.10000000000025},{"$f":"IF($X$2,SUMIFS('Track by Mode'!T:T,'Track by Mode'!$AI:$AI,\"=No\"),SUM('Track by Mode'!T:T))","v":657.9},{"$f":"IF($X$2,SUMIFS('Track by Mode'!V:V,'Track by Mode'!$AI:$AI,\"=No\"),SUM('Track by Mode'!V:V))","v":202.59999999999997},{"$f":"IF($X$2,SUMIFS('Track by Mode'!X:X,'Track by Mode'!$AI:$AI,\"=No\"),SUM('Track by Mode'!X:X))","v":941.3},{"$f":"IF($X$2,SUMIFS('Track by Mode'!Z:Z,'Track by Mode'!$AI:$AI,\"=No\"),SUM('Track by Mode'!Z:Z))","v":13094.200000000008},{"$f":"IF($X$2,SUMIFS('Track by Mode'!AC:AC,'Track by Mode'!$AI:$AI,\"=No\"),SUM('Track by Mode'!AC:AC))","v":5860},{"$f":"IF($X$2,SUMIFS('Track by Mode'!AE:AE,'Track by Mode'!$AI:$AI,\"=No\"),SUM('Track by Mode'!AE:AE))","v":1905},{"$f":"IF($X$2,SUMIFS('Track by Mode'!AG:AG,'Track by Mode'!$AI:$AI,\"=No\"),SUM('Track by Mode'!AG:AG))","v":7765},{"$f":"IF($X$2,SUMIFS('Roadway by Mode'!N:N,'Roadway by Mode'!$V:$V,\"=No\"),SUM('Roadway by Mode'!N:N))","v":1021.8000000000006},{"$f":"IF($X$2,SUMIFS('Roadway by Mode'!P:P,'Roadway by Mode'!$V:$V,\"=No\"),SUM('Roadway by Mode'!P:P))","v":1422.1999999999996},{"$f":"IF($X$2,SUMIFS('Roadway by Mode'!R:R,'Roadway by Mode'!$V:$V,\"=No\"),SUM('Roadway by Mode'!R:R))","v":2205.400000000001},{"$f":"IF($X$2,SUMIFS('Roadway by Mode'!T:T,'Roadway by Mode'!$V:$V,\"=No\"),SUM('Roadway by Mode'!T:T))","v":4649.3999999999969},null,null,null,"Exclude questionable data"]
[null,null,null,null,null,{"$f":"IFERROR(G5&CHAR(10)&H5&CHAR(10)&I5&CHAR(10)&J5&CHAR(10)&K5&CHAR(10)&L5,\"\")","v":"At Grade: Restricted Right-of-Way: 78%\nStreet Running: 3%\nElevated on Structure: 6%\nElevated on Fill: 5%\nOpen Cut: 2%\nSubway: 7%"},{"$f":"G1&\": \"&FIXED(100*G4/SUM($G$4:$L$4),0,0)&\"%\"","v":"At Grade: Restricted Right-of-Way: 78%"},{"$f":"H1&\": \"&FIXED(100*H4/SUM($G$4:$L$4),0,0)&\"%\"","v":"Street Running: 3%"},"Elevated on Structure: 6%","Elevated on Fill: 5%","Open Cut: 2%","Subway: 7%",null,null,null,null,null,null,null,null,null,null,null,1]
["By Urbanized Area Size"]
[null,null,null,null,null,null,"Miles of Track",null,null,null,null,null,null,"Number of Crossings",null,null,"Miles of Roadway"]
[null,null,null,"enter bins below","click to graph","VOMS","At Grade: Restricted Right-of-Way\nTrack Miles","\n\nStreet Running\nTrack Miles","\n\nElevated on Structure\nTrack Miles","\n\nElevated on Fill\nTrack Miles","\n\n\nOpen Cut\nTrack Miles","\n\n\nSubway\nTrack Miles","Total Track Miles","At Grade: Restricted Right-of-Way\nCrossings","\n\nStreet Running\nCrossings","Total Crossings","\n\nPermanent Busway\nRoadway Miles","\n\nPermanent HOV\nRoadway Miles","\nPart-Time Busway or HOV\nRoadway Miles","Total Roadway Miles"]
{"$rows_left_out":113}