{"text_format":"1","workbook":"xlsx","n_sheets":5,"sheets":["Read Me","Data Dictionary","Stations","Agency Totals","Summary Tables"],"not_rendered":{"charts":0,"images":0,"macros":1,"external_links":0,"defined_names":16,"comments":0,"pivot_tables":0},"unopened":[],"bounds":{"document_bytes":16777216,"sheet_cells":100000,"rows_first":2000,"rows_last":500,"rows_between":2000,"halvings":0,"cell_chars":16384,"cell_head_chars":4096},"cells_cut":0,"cells_raw":0,"read":"whole","date_system":"1900"}

{"sheet":"Read Me","index":0,"n_rows":0,"n_cols":0,"rows_kept":0,"cut":false,"hidden":false,"merged":[]}

{"sheet":"Data Dictionary","index":1,"n_rows":49,"n_cols":3,"rows_kept":49,"cut":false,"hidden":false,"merged":[]}
["Term","Who reports it?","Definition"]
["Agency","All","The transit agency's name."]
["City","All","The city in which the agency is headquartered."]
["State","All","The state in which the agency is headquartered."]
["Legacy NTD ID","All","A four-digit identifying number for each agency used in the legacy NTD system."]
["NTD ID","All","A five-digit identifying number for each agency used in the current NTD system."]
["Organization Type","All","Description of the agency's legal entity."]
["Reporter Type","All","The type of NTD report that the agency completed this year."]
["Primary UZA Population","DOES NOT APPLY TO: Rural General Public Transit Sub-recipients, Intercity Bus Sub-recipients","The population of the urbanized area primarily served by the agency."]
["Agency VOMS","DOES NOT APPLY TO: Building Reporters, Planning Reporters, Separate Service Reporters, Tribal Subsidy Reporters, Intercity Bus Sub-recipients","The number of revenue vehicles operated across the whole agency to meet the annual maximum service requirement. This is the revenue vehicle count during the peak season of the year; on the week and day that maximum service is provided. Vehicles operated in maximum service (VOMS) exclude atypical days and one-time special events."]
["Mode","DOES NOT APPLY TO: Planning Reporters, Tribal Subsidy Reporters, Intercity Bus Sub-recipients","A system for carrying transit passengers described by specific right-of-way (ROW), technology and operational features."]
["Type of Service","DOES NOT APPLY TO: Planning Reporters, Tribal Subsidy Reporters, Intercity Bus Sub-recipients","Describes how public transportation services are provided by the transit agency: directly operated (DO) or purchased transportation (PT) services."]
["Mode VOMS","DOES NOT APPLY TO: Building Reporters, Planning Reporters, Separate Service Reporters, Tribal Subsidy Reporters, Intercity Bus Sub-recipients","The number of revenue vehicles operated by the given mode and type of service to meet the annual maximum service requirement. This is the revenue vehicle count during the peak season of the year; on the week and day that maximum service is provided. Vehicles operated in maximum service (VOMS) exclude atypical days and one-time special events."]
["Rural General Public Transit",null,"Reporter type for agencies that do not operate in an urban area and are not Tribes."]
["Intercity Bus",null,"Reporter type for private bus lines providing non-transit service connecting wide-ranging areas."]
["Building Reporter",null,"Reporter type for agencies that are building a new transit service but not yet operating it."]
["Planning Reporter",null,"Reporter type for entities that expend funds in planning transit but do not operate service."]
["Separate Service",null,"Reporter type for agencies that have a contractual relationship with another NTD reporter to provide service but do not report any service themselves."]
["Tribal Subsidy",null,"Reporter type for Tribes that subsidize service but do not operate service or pay the full cost of service."]
["Full Reporter",null,"Reporter type for agencies that operate urban service and complete the most detailed level of NTD report. Urban agencies that operate more than 30 vehicles or operate Fixed Guideway service are required to complete Full Reports; other urban agencies may do so if they wish."]
["Reduced Reporter",null,"Reporter type for agencies that operate urban service but complete a simplified NTD report. Urban agencies that operate 30 or fewer vehicles and do not operate Fixed Guideway service are eligible to complete Reduced Reports. This is sometimes called a Small Systems Report."]
["Urbanized Area (UZA)",null,"An area defined by the U. S. Census Bureau that includes: \n- One or more incorporated cities, villages, and towns (central place) \n- The adjacent densely settled surrounding territory (urban fringe) that together has a minimum of 50,000 persons \nThe urban fringe generally consists of contiguous territory having a density of at least 1,000 persons per square mile. Urbanized areas do not conform to congressional districts or any other political boundaries."]
["Alaska Railroad (AR)",null,"The passenger service portion of the Alaska Railroad Corporation. The service encompasses only car miles for passenger cars; car miles for freight cars are specifically excluded."]
["Bus (MB)",null,"A transit mode comprised of rubber-tired passenger vehicles operating on fixed routes and schedules over roadways. Vehicles are powered by: \n- Diesel \n- Gasoline \n- Battery \n- Alternative fuel engines contained within the vehicle"]
["Bus Rapid Transit (RB)",null,"Fixed-route bus mode: \n- In which the majority of each line operates in a separated right-of-way dedicated for public transportation use during peak periods; and \n- That includes features that emulate the services provided by rail fixed guideway public transportation systems, including: \n   o Defined stations \n   o Traffic signal priority for public transportation vehicles \n   o Short headway bidirectional services for a substantial part of weekdays and weekend days \n   o Pre-board ticketing, platform level boarding, and separate branding \nThis mode may include portions of service that are fixed-guideway and non-fixed-guideway."]
["Cable Car (CC)",null,"A transit mode that is an electric railway with individually controlled transit vehicles attached to a moving cable located below the street surface and powered by engines or motors at a central location, not onboard the vehicle."]
["Commuter Bus (CB)",null,"Fixed-route bus systems that are primarily connecting outlying areas with a central city through bus service that operates with at least five miles of continuous closed-door service. This service may operate motorcoaches (aka over-the-road buses), and usually features peak scheduling, multiple-trip tickets, and limited stops in the central city."]
["Commuter Rail (CR)",null,"A transit mode that is an electric or diesel propelled railway for urban passenger train service consisting of local short distance travel operating between a central city and adjacent suburbs. Service must be operated on a regular basis by or under contract with a transit operator for the purpose of transporting passengers within urbanized areas (UZAs), or between urbanized areas and outlying areas. \nSuch rail service, using either locomotive hauled or self-propelled railroad passenger cars, is generally characterized by: \n- Multi-trip tickets \n- Specific station to station fares \n- Railroad employment practices \n- Usually only one or two stations in the central business district \nIt does not include: \n- Heavy rail (HR) rapid transit \n- Light rail (LR)/streetcar transit service \nIntercity rail service is excluded, except for that portion of such service that is operated by or under contract with a public transit agency for predominantly commuter services. Predominantly commuter service means that for any given trip segment (i.e., distance between any two stations), more than 50 percent of the average daily ridership makes a return trip on the same day. Only the predominantly commuter service portion of an intercity route is eligible for inclusion when determining commuter rail (CR) route miles."]
["Demand Response (DR)",null,"A transit mode comprised of automobiles, vans or small buses operating in response to calls from passengers or their agents to the transit operator, who then dispatches a vehicle to pick up the passengers and transport them to their destinations. A demand response (DR) operation is characterized by the following: \n- The vehicles do not operate over a fixed route or on a fixed schedule except, perhaps, on a temporary basis to satisfy a special need; and \n- Typically, the vehicle may be dispatched to pick up several passengers at different pick-up points before taking them to their respective destinations and may even be interrupted en route to these destinations to pick up other passengers. \nThe following types of operations fall under the above definitions provided they are not on a scheduled fixed route basis: \n- Many origins—many destinations \n- Many origins—one destination \n- One origin—many destinations \n- One origin—one destination"]
["Demand Response Taxi (DT)",null,"A special form of the demand response mode operated through taxicab providers. The mode is always purchased transportation type of service. In order to be reportable, there must be a system in place through which passengers can share rides."]
["Ferryboat (FB)",null,"A transit mode comprised of vessels carrying passengers and/or vehicles over a body of water that are generally steam or diesel powered. Intercity ferryboat (FB) service is excluded, except for that portion of such service that is operated by or under contract with a public transit agency for predominantly commuter services. Predominantly commuter service means that for any given trip segment (i.e., distance between any two piers), more than 50 percent of the average daily ridership makes a return trip on the ferryboat on the same day. Only the predominantly commuter service portion of an intercity route is eligible for inclusion when determining ferryboat (FB) route miles."]
["Heavy Rail (HR)",null,"A transit mode that is an electric railway with the capacity for a heavy volume of traffic. It is characterized by: \n- High speed and rapid acceleration passenger rail cars operating singly or in multi-car trains on fixed rails \n- Separate rights-of-way (ROW) from which all other vehicular and foot traffic are excluded \n- Sophisticated signaling \n- Raised platform loading"]
["Hybrid Rail (YR)",null,"Rail systems primarily operating routes on the National system of railroads, but not operating with the characteristics of commuter rail. This service typically operates light rail-type vehicles as diesel multipleunit trains (DMU’s). These trains do not meet Federal Railroad Administration standards, and so must operate with temporal separation from freight rail traffic."]
["Inclined Plane (IP)",null,"A transit mode that is a railway operating over exclusive right-of-way (ROW) on steep grades (slopes) with powerless vehicles propelled by moving cables attached to the vehicles and powered by engines or motors at a central location not onboard the vehicle. The special tramway types of vehicles have passenger seats that remain horizontal while the undercarriage (truck) is angled parallel to the slope."]
["Light Rail (LR)",null,"A transit mode that is typically an electric railway with a light volume traffic capacity compared to heavy rail (HR). It is characterized by: \n- Passenger rail cars operating singly (or in short, usually two car, trains) on fixed rails in shared or exclusive right-of-way (ROW) \n- Low or high platform loading \n- Vehicle power drawn from an overhead electric line via a trolley or a pantograph"]
["Monorail/Automated Guideway (MG)",null,"Monorail and Automated Guideway modes operate on exclusive guideway without using steel wheels on rails."]
["Streetcar Rail (SR)",null,"This mode is for rail transit systems operating entire routes predominantly on streets in mixed-traffic. This service typically operates with single-car trains powered by overhead catenaries and with frequent stops."]
["Trolleybus (TB)",null,"A transit mode comprised of electric rubber-tired passenger vehicles, manually steered and operating singly on city streets. Vehicles are propelled by a motor drawing current through overhead wires via trolleys, from a central power source not onboard the vehicle."]
["Vanpool (VP)",null,"A transit mode comprised of vans, small buses and other vehicles operating as a ride sharing arrangement, providing transportation to a group of individuals traveling directly between their homes and a regular destination within the same geographical area."]
["Jitney (JT)",null,"A transit mode comprising passenger cars or vans operating on fixed routes (sometimes with minor deviations) as demand warrants without fixed schedules or fixed stops."]
["Aerial Tramway (TR)",null,"A transit mode that is an electric system of aerial cables with suspended powerless passenger vehicles. The vehicles are propelled by separate cables attached to the vehicle suspension system and powered by engines or motors at a central location not on-board the vehicle."]
["Publico (PB)",null,"A transit mode comprised of passenger vans or small buses operating with fixed routes but no fixed schedules in Puerto Rico. Publicos (PB) are a privately owned and operated public transit service which is market oriented and unsubsidized, but regulated through a public service commission, state or local government. Publicos (PB) are operated under franchise agreements, fares are regulated by route and there are special insurance requirements. Vehicle capacity varies from 8 to 24, and the vehicles may be owned or leased by the operator."]
["Questionable (Q)",null,"FTA marks a data point as Questionable when there is reason to believe it is incorrect, but the reporting agency has been unable to correct the data or offer an explanation for its anomalous appearance."]
["Waived (W)",null,"FTA marks a data point as Waived when the reporting agency has not reported the data point according to NTD reporting requirements, but has received a waiver to report the data as-is for one year."]
["ADA Accessible Stations","ONLY APPLIES TO: Full Reporters, Reduced Reporters","Public transportation passenger facilities which, in compliance with the Americans with Disabilities Act of 1990 (ADA), provide ready access to passengers with disabilities, including individuals who use wheelchairs, by meeting accessibility requirements of transport devices, signage, and other aids."]
["Non-ADA Accessible Stations","ONLY APPLIES TO: Full Reporters, Reduced Reporters","Public transportation passenger facilities that do not provide ready access to passengers with disabilities, including individuals who use wheelchairs, by meeting accessibility requirements of transport devices, signage, and other aids."]
["Elevators","ONLY APPLIES TO: Full Reporters, Reduced Reporters","A compartment that usually moves up and down vertically to transfer passengers from one level of a station or parking facility to another. Elevators may move horizontally, such as from a station to an adjacent parking garage, but such movement is normally done by non-elevator means such as a pedestrian bridge or a moving sidewalk. Does not include non-passenger elevators used only for freight or by transit staff."]
["Escalators","ONLY APPLIES TO: Full Reporters, Reduced Reporters","A moving stairway that moves up and down at an angle to transfer passengers from one level of a station or parking facility to another. Does not include non-passenger escalators used only for freight or by transit staff."]
["Stations","ONLY APPLIES TO: Full Reporters, Reduced Reporters","Passenger stations are significant structures in a separate right-of-way (ROW). Therefore, agencies may not report a street stop or passenger shelter as a passenger station. Passenger stations typically mean a platform area for rail modes. The following rules apply: \n• All rail passenger facilities are stations (except for light rail (LR), streetcar (SR), and cable car (CC) modes);  \n• All LR, CC, and SR passenger facilities serving track that is in a separate ROW (not in mixed street traffic) that have platforms are stations; \n• All motorbus (MB), rapid bus (RB), commuter bus (CB), and trolley bus (TB) passenger facilities in a separate ROW that have an enclosed structure (building) for passengers for such items as ticketing, information, restrooms, concessions, and telephones are stations; \n• When service is operated in mixed traffic, stops on streets or in medians for CC, LR, SR, MB, RB, CB, and TB are not stations if at most they have shelters, canopies, lighting, signage or ramps for accessibility requirements, (i.e. no separate, enclosed buildings); and \n• All transportation, transit or transfer centers, park-and-ride facilities, and transit malls are stations if they have an enclosed structure (building) for passengers for items such as ticketing, information, restrooms, concessions, and telephones."]

{"sheet":"Stations","index":2,"n_rows":1096,"n_cols":26,"rows_kept":1096,"cut":false,"hidden":false,"merged":[]}
["Name","City","State","Legacy NTD ID","NTD ID","Organization Type","Reporter Type","Primary UZA Population","Agency VOMS","Mode","TOS","Mode VOMS","ADA Accessible Stations","ADA Accessible Stations Questionable","Non-ADA Accessible Stations","Non-ADA Accessible Stations Questionable","Total Stations","Total Stations Questionable","Elevators","Elevators Questionable","Escalators","Escalators Questionable","Any data questionable?",null,null,{"$f":"IF(Z4=1,1,0)","v":0}]
["MTA New York City Transit","New York","NY",2008,20008,"Subsidiary Unit of a Transit Agency, Reporting Separately","Full Reporter",18351295,11004,"HR","DO",5324,111,null,358,null,469,null,264,null,209,null,{"$f":"IF(V2&T2&R2&P2&N2<>\"\",\"Yes\",\"No\")","v":"No"},null,null,"Hide questionable data tags"]
["MTA New York City Transit","New York","NY",2008,20008,"Subsidiary Unit of a Transit Agency, Reporting Separately","Full Reporter",18351295,11004,"MB","DO",3286,2,null,0,null,2,null,0,null,0,null,"No",null,null,"Show questionable data tags"]
["MTA New York City Transit","New York","NY",2008,20008,"Subsidiary Unit of a Transit Agency, Reporting Separately","Full Reporter",18351295,11004,"CB","DO",455,0,null,0,null,0,null,0,null,0,null,"No",null,null,2]
["MTA New York City Transit","New York","NY",2008,20008,"Subsidiary Unit of a Transit Agency, Reporting Separately","Full Reporter",18351295,11004,"RB","DO",145,0,null,0,null,0,null,0,null,0,null,"No"]
["New Jersey Transit Corporation","Newark","NJ",2080,20080,"Other Publicly-Owned or Privately Chartered Corporation","Full Reporter",18351295,4056,"MB","DO",1857,30,null,0,null,30,null,7,null,0,null,"No"]
["New Jersey Transit Corporation","Newark","NJ",2080,20080,"Other Publicly-Owned or Privately Chartered Corporation","Full Reporter",18351295,4056,"CR","DO",1267,78,null,87,null,165,null,102,null,75,null,"No"]
["New Jersey Transit Corporation","Newark","NJ",2080,20080,"Other Publicly-Owned or Privately Chartered Corporation","Full Reporter",18351295,4056,"MB","PT",182,0,null,0,null,0,null,0,null,0,null,"No"]
["New Jersey Transit Corporation","Newark","NJ",2080,20080,"Other Publicly-Owned or Privately Chartered Corporation","Full Reporter",18351295,4056,"LR","PT",42,24,null,0,null,24,null,15,null,0,null,"No"]
["New Jersey Transit Corporation","Newark","NJ",2080,20080,"Other Publicly-Owned or Privately Chartered Corporation","Full Reporter",18351295,4056,"YR","PT",16,21,null,0,null,21,null,0,null,0,null,"No"]
["New Jersey Transit Corporation","Newark","NJ",2080,20080,"Other Publicly-Owned or Privately Chartered Corporation","Full Reporter",18351295,4056,"LR","DO",14,11,null,6,null,17,null,5,null,2,null,"No"]
["Los Angeles County Metropolitan Transportation Authority dba: Metro","Los Angeles","CA",9154,90154,"Independent Public Agency or Authority of Transit Service","Full Reporter",12150996,3544,"MB","DO",1777,12,null,0,null,12,null,25,null,7,null,"No"]
["Los Angeles County Metropolitan Transportation Authority dba: Metro","Los Angeles","CA",9154,90154,"Independent Public Agency or Authority of Transit Service","Full Reporter",12150996,3544,"LR","DO",161,79,null,0,null,79,null,73,null,29,null,"No"]
["Los Angeles County Metropolitan Transportation Authority dba: Metro","Los Angeles","CA",9154,90154,"Independent Public Agency or Authority of Transit Service","Full Reporter",12150996,3544,"MB","PT",125,43,null,0,null,43,null,48,null,50,null,"No"]
["Los Angeles County Metropolitan Transportation Authority dba: Metro","Los Angeles","CA",9154,90154,"Independent Public Agency or Authority of Transit Service","Full Reporter",12150996,3544,"HR","DO",70,16,null,0,null,16,null,49,null,104,null,"No"]
["Los Angeles County Metropolitan Transportation Authority dba: Metro","Los Angeles","CA",9154,90154,"Independent Public Agency or Authority of Transit Service","Full Reporter",12150996,3544,"RB","DO",33,1,null,0,null,1,null,0,null,0,null,"No"]
["Washington Metropolitan Area Transit Authority","Washington","DC",3030,30030,"Independent Public Agency or Authority of Transit Service","Full Reporter",4586770,3172,"MB","DO",1301,3,null,0,null,3,null,0,null,0,null,"No"]
["Washington Metropolitan Area Transit Authority","Washington","DC",3030,30030,"Independent Public Agency or Authority of Transit Service","Full Reporter",4586770,3172,"HR","DO",954,91,null,0,null,91,null,278,null,618,null,"No"]
["King County Department of Transportation","Seattle","WA",1,1,"City, County or Local Government Unit or Department of Transportation","Full Reporter",3059393,2818,"MB","DO",949,12,null,0,null,12,null,34,null,40,null,"No"]
["King County Department of Transportation","Seattle","WA",1,1,"City, County or Local Government Unit or Department of Transportation","Full Reporter",3059393,2818,"TB","DO",138,0,null,0,null,0,null,0,null,0,null,"No"]
["King County Department of Transportation","Seattle","WA",1,1,"City, County or Local Government Unit or Department of Transportation","Full Reporter",3059393,2818,"MB","PT",32,0,null,0,null,0,null,0,null,0,null,"No"]
["King County Department of Transportation","Seattle","WA",1,1,"City, County or Local Government Unit or Department of Transportation","Full Reporter",3059393,2818,"SR","DO",8,25,null,0,null,25,null,0,null,0,null,"No"]
["King County Department of Transportation","Seattle","WA",1,1,"City, County or Local Government Unit or Department of Transportation","Full Reporter",3059393,2818,"FB","DO",2,0,null,3,null,3,null,0,null,0,null,"No"]
["Chicago Transit Authority","Chicago","IL",5066,50066,"Independent Public Agency or Authority of Transit Service","Full Reporter",8608208,2712,"MB","DO",1572,0,null,0,null,0,null,0,null,0,null,"No"]
["Chicago Transit Authority","Chicago","IL",5066,50066,"Independent Public Agency or Authority of Transit Service","Full Reporter",8608208,2712,"HR","DO",1140,98,null,47,null,145,null,147,null,158,null,"No"]
["Massachusetts Bay Transportation Authority","Boston","MA",1003,10003,"Independent Public Agency or Authority of Transit Service","Full Reporter",4181019,2374,"MB","DO",779,52,null,0,null,52,null,12,null,8,null,"No"]
["Massachusetts Bay Transportation Authority","Boston","MA",1003,10003,"Independent Public Agency or Authority of Transit Service","Full Reporter",4181019,2374,"CR","PT",421,104,null,34,null,138,null,4,null,11,null,"No"]
["Massachusetts Bay Transportation Authority","Boston","MA",1003,10003,"Independent Public Agency or Authority of Transit Service","Full Reporter",4181019,2374,"HR","DO",336,52,null,2,null,54,null,135,null,150,null,"No"]
["Massachusetts Bay Transportation Authority","Boston","MA",1003,10003,"Independent Public Agency or Authority of Transit Service","Full Reporter",4181019,2374,"LR","DO",156,38,null,36,null,74,null,23,null,18,null,"No"]
["Massachusetts Bay Transportation Authority","Boston","MA",1003,10003,"Independent Public Agency or Authority of Transit Service","Full Reporter",4181019,2374,"RB","DO",30,15,null,0,null,15,null,7,null,11,null,"No"]
["Massachusetts Bay Transportation Authority","Boston","MA",1003,10003,"Independent Public Agency or Authority of Transit Service","Full Reporter",4181019,2374,"TB","DO",22,1,null,0,null,1,null,0,null,0,null,"No"]
["Massachusetts Bay Transportation Authority","Boston","MA",1003,10003,"Independent Public Agency or Authority of Transit Service","Full Reporter",4181019,2374,"FB","PT",9,8,null,1,null,9,null,0,null,0,null,"No"]
["Massachusetts Bay Transportation Authority","Boston","MA",1003,10003,"Independent Public Agency or Authority of Transit Service","Full Reporter",4181019,2374,"MB","PT",9,0,null,0,null,0,null,0,null,0,null,"No"]
["Southeastern Pennsylvania Transportation Authority","Philadelphia","PA",3019,30019,"Independent Public Agency or Authority of Transit Service","Full Reporter",5441567,2339,"MB","DO",1174,0,null,0,null,0,null,0,null,0,null,"No"]
["Southeastern Pennsylvania Transportation Authority","Philadelphia","PA",3019,30019,"Independent Public Agency or Authority of Transit Service","Full Reporter",5441567,2339,"CR","DO",339,70,null,85,null,155,null,36,null,22,null,"No"]
["Southeastern Pennsylvania Transportation Authority","Philadelphia","PA",3019,30019,"Independent Public Agency or Authority of Transit Service","Full Reporter",5441567,2339,"HR","DO",284,37,null,38,null,75,null,73,null,36,null,"No"]
["Southeastern Pennsylvania Transportation Authority","Philadelphia","PA",3019,30019,"Independent Public Agency or Authority of Transit Service","Full Reporter",5441567,2339,"SR","DO",121,2,null,46,null,48,null,4,null,1,null,"No"]
["Southeastern Pennsylvania Transportation Authority","Philadelphia","PA",3019,30019,"Independent Public Agency or Authority of Transit Service","Full Reporter",5441567,2339,"TB","DO",30,0,null,0,null,0,null,0,null,0,null,"No"]
["Metropolitan Transit Authority of Harris County, Texas","Houston","TX",6008,60008,"Independent Public Agency or Authority of Transit Service","Full Reporter",4944332,2206,"MB","DO",586,42,null,0,null,42,null,3,null,2,null,"No"]
["Metropolitan Transit Authority of Harris County, Texas","Houston","TX",6008,60008,"Independent Public Agency or Authority of Transit Service","Full Reporter",4944332,2206,"CB","DO",235,30,null,0,null,30,null,3,null,2,null,"No"]
["Metropolitan Transit Authority of Harris County, Texas","Houston","TX",6008,60008,"Independent Public Agency or Authority of Transit Service","Full Reporter",4944332,2206,"MB","PT",116,18,null,0,null,18,null,3,null,2,null,"No"]
["Metropolitan Transit Authority of Harris County, Texas","Houston","TX",6008,60008,"Independent Public Agency or Authority of Transit Service","Full Reporter",4944332,2206,"CB","PT",64,14,null,0,null,14,null,3,null,0,null,"No"]
["Metropolitan Transit Authority of Harris County, Texas","Houston","TX",6008,60008,"Independent Public Agency or Authority of Transit Service","Full Reporter",4944332,2206,"LR","DO",54,39,null,0,null,39,null,2,null,2,null,"No"]
["Maryland Transit Administration","Baltimore","MD",3034,30034,"State Government Unit or Department of Transportation","Full Reporter",2203663,1634,"MB","DO",627,0,null,0,null,0,null,0,null,0,null,"No"]
["Maryland Transit Administration","Baltimore","MD",3034,30034,"State Government Unit or Department of Transportation","Full Reporter",2203663,1634,"CB","PT",280,0,null,0,null,0,null,0,null,0,null,"No"]
["Maryland Transit Administration","Baltimore","MD",3034,30034,"State Government Unit or Department of Transportation","Full Reporter",2203663,1634,"CR","PT",142,24,null,18,null,42,null,10,null,3,null,"No"]
["Maryland Transit Administration","Baltimore","MD",3034,30034,"State Government Unit or Department of Transportation","Full Reporter",2203663,1634,"HR","DO",54,14,null,0,null,14,null,27,null,81,null,"No"]
["Maryland Transit Administration","Baltimore","MD",3034,30034,"State Government Unit or Department of Transportation","Full Reporter",2203663,1634,"LR","DO",38,33,null,0,null,33,null,1,null,0,null,"No"]
["Pace - Suburban Bus Division","Arlington Heights","IL",5113,50113,"Independent Public Agency or Authority of Transit Service","Full Reporter",8608208,1619,"MB","DO",545,125,null,31,null,156,null,22,null,22,null,"No"]
["Pace - Suburban Bus Division","Arlington Heights","IL",5113,50113,"Independent Public Agency or Authority of Transit Service","Full Reporter",8608208,1619,"MB","PT",92,27,null,2,null,29,null,1,null,1,null,"No"]
["Orange County Transportation Authority","Orange","CA",9036,90036,"Independent Public Agency or Authority of Transit Service","Full Reporter",12150996,1558,"MB","DO",266,11,null,0,null,11,null,6,null,2,null,"No"]
["Orange County Transportation Authority","Orange","CA",9036,90036,"Independent Public Agency or Authority of Transit Service","Full Reporter",12150996,1558,"MB","PT",176,15,null,0,null,15,null,11,null,2,null,"No"]
["Orange County Transportation Authority","Orange","CA",9036,90036,"Independent Public Agency or Authority of Transit Service","Full Reporter",12150996,1558,"CB","PT",23,6,null,0,null,6,null,6,null,0,null,"No"]
["Orange County Transportation Authority","Orange","CA",9036,90036,"Independent Public Agency or Authority of Transit Service","Full Reporter",12150996,1558,"CB","DO",6,2,null,0,null,2,null,0,null,0,null,"No"]
["Denver Regional Transportation District","Denver","CO",8006,80006,"Independent Public Agency or Authority of Transit Service","Full Reporter",2374203,1435,"MB","DO",485,2,null,0,null,2,null,2,null,2,null,"No"]
["Denver Regional Transportation District","Denver","CO",8006,80006,"Independent Public Agency or Authority of Transit Service","Full Reporter",2374203,1435,"MB","PT",388,2,null,0,null,2,null,2,null,2,null,"No"]
["Denver Regional Transportation District","Denver","CO",8006,80006,"Independent Public Agency or Authority of Transit Service","Full Reporter",2374203,1435,"LR","DO",140,46,null,0,null,46,null,49,null,0,null,"No"]
["Denver Regional Transportation District","Denver","CO",8006,80006,"Independent Public Agency or Authority of Transit Service","Full Reporter",2374203,1435,"CR","PT",18,9,null,0,null,9,null,14,null,6,null,"No"]
["Miami-Dade Transit","Miami","FL",4034,40034,"City, County or Local Government Unit or Department of Transportation","Full Reporter",5502379,1181,"MB","DO",709,0,null,0,null,0,null,0,null,0,null,"No"]
["Miami-Dade Transit","Miami","FL",4034,40034,"City, County or Local Government Unit or Department of Transportation","Full Reporter",5502379,1181,"HR","DO",84,23,null,0,null,23,null,65,null,68,null,"No"]
["Miami-Dade Transit","Miami","FL",4034,40034,"City, County or Local Government Unit or Department of Transportation","Full Reporter",5502379,1181,"MG","DO",23,21,null,0,null,21,null,21,null,18,null,"No"]
["Miami-Dade Transit","Miami","FL",4034,40034,"City, County or Local Government Unit or Department of Transportation","Full Reporter",5502379,1181,"CB","PT",7,0,null,0,null,0,null,0,null,0,null,"No"]
["Metro-North Commuter Railroad Company, dba: MTA Metro-North Railroad","New York","NY",2078,20078,"Subsidiary Unit of a Transit Agency, Reporting Separately","Full Reporter",18351295,1175,"CR","DO",1164,46,null,66,null,112,null,141,null,32,null,"No"]
["Metro-North Commuter Railroad Company, dba: MTA Metro-North Railroad","New York","NY",2078,20078,"Subsidiary Unit of a Transit Agency, Reporting Separately","Full Reporter",18351295,1175,"MB","PT",9,1,null,1,null,2,null,2,null,0,null,"No"]
["Metro-North Commuter Railroad Company, dba: MTA Metro-North Railroad","New York","NY",2078,20078,"Subsidiary Unit of a Transit Agency, Reporting Separately","Full Reporter",18351295,1175,"FB","PT",2,4,null,0,null,4,null,5,null,0,null,"No"]
["MTA Bus Company","New York","NY",2188,20188,"Subsidiary Unit of a Transit Agency, Reporting Separately","Full Reporter",18351295,1093,"MB","DO",1093,1,null,1,null,2,null,0,null,0,null,{"$f":"IF(V66&T66&R66&P66&N66<>\"\",\"Yes\",\"No\")","v":"No"}]
["Utah Transit Authority","Salt Lake City","UT",8001,80001,"Independent Public Agency or Authority of Transit Service","Full Reporter",1021243,1087,"MB","DO",391,28,null,0,null,28,null,0,null,0,null,"No"]
["Utah Transit Authority","Salt Lake City","UT",8001,80001,"Independent Public Agency or Authority of Transit Service","Full Reporter",1021243,1087,"LR","DO",91,56,null,0,null,56,null,6,null,0,null,"No"]
["Utah Transit Authority","Salt Lake City","UT",8001,80001,"Independent Public Agency or Authority of Transit Service","Full Reporter",1021243,1087,"CR","DO",45,16,null,0,null,16,null,6,null,2,null,"No"]
["Utah Transit Authority","Salt Lake City","UT",8001,80001,"Independent Public Agency or Authority of Transit Service","Full Reporter",1021243,1087,"CB","DO",43,0,null,0,null,0,null,0,null,0,null,"No"]
["Utah Transit Authority","Salt Lake City","UT",8001,80001,"Independent Public Agency or Authority of Transit Service","Full Reporter",1021243,1087,"MB","PT",6,1,null,0,null,1,null,0,null,0,null,"No"]
["Dallas Area Rapid Transit","Dallas","TX",6056,60056,"Independent Public Agency or Authority of Transit Service","Full Reporter",5121892,1069,"MB","DO",533,18,null,0,null,18,null,0,null,0,null,"No"]
["Dallas Area Rapid Transit","Dallas","TX",6056,60056,"Independent Public Agency or Authority of Transit Service","Full Reporter",5121892,1069,"LR","DO",104,62,null,0,null,62,null,30,null,8,null,"No"]
["Dallas Area Rapid Transit","Dallas","TX",6056,60056,"Independent Public Agency or Authority of Transit Service","Full Reporter",5121892,1069,"CR","PT",23,10,null,0,null,10,null,2,null,0,null,"No"]
["Dallas Area Rapid Transit","Dallas","TX",6056,60056,"Independent Public Agency or Authority of Transit Service","Full Reporter",5121892,1069,"SR","DO",2,6,null,0,null,6,null,0,null,0,null,"No"]
["Northeast Illinois Regional Commuter Railroad Corporation dba: Metra Rail","Chicago","IL",5118,50118,"Independent Public Agency or Authority of Transit Service","Full Reporter",8608208,1061,"CR","DO",1061,184,null,57,null,241,null,36,null,24,null,"No"]
["MTA Long Island Rail Road","Jamaica","NY",2100,20100,"Subsidiary Unit of a Transit Agency, Reporting Separately","Full Reporter",18351295,1020,"CR","DO",1020,103,null,21,null,124,null,37,null,19,null,"No"]
["Metropolitan Atlanta Rapid Transit Authority","Atlanta","GA",4022,40022,"Independent Public Agency or Authority of Transit Service","Full Reporter",4515419,1011,"MB","DO",465,1,null,0,null,1,null,0,null,0,null,"No"]
["Metropolitan Atlanta Rapid Transit Authority","Atlanta","GA",4022,40022,"Independent Public Agency or Authority of Transit Service","Full Reporter",4515419,1011,"HR","DO",208,38,null,0,null,38,null,97,null,149,null,"No"]
["San Francisco Municipal Railway","San Francisco","CA",9015,90015,"City, County or Local Government Unit or Department of Transportation","Full Reporter",3281212,985,"MB","DO",475,0,null,0,null,0,null,0,null,0,null,"No"]
["San Francisco Municipal Railway","San Francisco","CA",9015,90015,"City, County or Local Government Unit or Department of Transportation","Full Reporter",3281212,985,"TB","DO",196,0,null,0,null,0,null,0,null,0,null,"No"]
["San Francisco Municipal Railway","San Francisco","CA",9015,90015,"City, County or Local Government Unit or Department of Transportation","Full Reporter",3281212,985,"LR","DO",131,9,null,0,null,9,null,28,null,11,null,"No"]
["San Francisco Municipal Railway","San Francisco","CA",9015,90015,"City, County or Local Government Unit or Department of Transportation","Full Reporter",3281212,985,"CC","DO",27,0,null,0,null,0,null,0,null,0,null,"No"]
["San Francisco Municipal Railway","San Francisco","CA",9015,90015,"City, County or Local Government Unit or Department of Transportation","Full Reporter",3281212,985,"SR","DO",24,0,null,0,null,0,null,0,null,0,null,"No"]
["Tri-County Metropolitan Transportation District of Oregon","Portland","OR",8,8,"Independent Public Agency or Authority of Transit Service","Full Reporter",1849898,950,"MB","DO",534,6,null,0,null,6,null,0,null,0,null,"No"]
["Tri-County Metropolitan Transportation District of Oregon","Portland","OR",8,8,"Independent Public Agency or Authority of Transit Service","Full Reporter",1849898,950,"LR","DO",116,44,null,0,null,44,null,16,null,0,null,"No"]
["Tri-County Metropolitan Transportation District of Oregon","Portland","OR",8,8,"Independent Public Agency or Authority of Transit Service","Full Reporter",1849898,950,"YR","PT",4,5,null,0,null,5,null,0,null,0,null,"No"]
["Port Authority of Allegheny County","Pittsburgh","PA",3022,30022,"Independent Public Agency or Authority of Transit Service","Full Reporter",1733853,939,"MB","DO",606,16,null,0,null,16,null,0,null,0,null,"No"]
["Port Authority of Allegheny County","Pittsburgh","PA",3022,30022,"Independent Public Agency or Authority of Transit Service","Full Reporter",1733853,939,"LR","DO",60,26,null,0,null,26,null,17,null,19,null,"No"]
["Port Authority of Allegheny County","Pittsburgh","PA",3022,30022,"Independent Public Agency or Authority of Transit Service","Full Reporter",1733853,939,"IP","DO",2,2,null,0,null,2,null,0,null,0,null,"No"]
["Metro Transit","Minneapolis","MN",5027,50027,"Subsidiary Unit of a Transit Agency, Reporting Separately","Full Reporter",2650890,843,"MB","DO",754,27,null,0,null,27,null,30,null,15,null,"No"]
["Metro Transit","Minneapolis","MN",5027,50027,"Subsidiary Unit of a Transit Agency, Reporting Separately","Full Reporter",2650890,843,"LR","DO",69,37,null,0,null,37,null,16,null,9,null,"No"]
["Metro Transit","Minneapolis","MN",5027,50027,"Subsidiary Unit of a Transit Agency, Reporting Separately","Full Reporter",2650890,843,"CR","PT",20,7,null,0,null,7,null,10,null,1,null,"No"]
["VIA Metropolitan Transit","San Antonio","TX",6011,60011,"Independent Public Agency or Authority of Transit Service","Full Reporter",1758210,816,"MB","DO",378,10,null,0,null,10,null,0,null,0,null,"No"]
["City and County of Honolulu Department of Transportation Services","Honolulu","HI",9002,90002,"City, County or Local Government Unit or Department of Transportation","Full Reporter",802459,812,"MB","PT",455,1,null,0,null,1,null,0,null,0,null,"No"]
["San Diego Metropolitan Transit System","San Diego","CA",9026,90026,"Independent Public Agency or Authority of Transit Service","Full Reporter",2956746,765,"MB","PT",261,0,null,0,null,0,null,0,null,0,null,"No"]
["San Diego Metropolitan Transit System","San Diego","CA",9026,90026,"Independent Public Agency or Authority of Transit Service","Full Reporter",2956746,765,"MB","DO",224,4,null,0,null,4,null,1,null,0,null,"No"]
["San Diego Metropolitan Transit System","San Diego","CA",9026,90026,"Independent Public Agency or Authority of Transit Service","Full Reporter",2956746,765,"LR","DO",97,53,null,0,null,53,null,10,null,4,null,"No"]
["San Diego Metropolitan Transit System","San Diego","CA",9026,90026,"Independent Public Agency or Authority of Transit Service","Full Reporter",2956746,765,"CB","PT",17,0,null,0,null,0,null,0,null,0,null,"No"]
["Capital Metropolitan Transportation Authority","Austin","TX",6048,60048,"Independent Public Agency or Authority of Transit Service","Full Reporter",1362416,732,"MB","PT",304,6,null,0,null,6,null,0,null,0,null,"No"]
["Capital Metropolitan Transportation Authority","Austin","TX",6048,60048,"Independent Public Agency or Authority of Transit Service","Full Reporter",1362416,732,"CB","PT",35,2,null,0,null,2,null,0,null,0,null,"No"]
["Capital Metropolitan Transportation Authority","Austin","TX",6048,60048,"Independent Public Agency or Authority of Transit Service","Full Reporter",1362416,732,"YR","PT",4,9,null,0,null,9,null,0,null,0,null,"No"]
["Alameda-Contra Costa Transit District","Oakland","CA",9014,90014,"Independent Public Agency or Authority of Transit Service","Full Reporter",3281212,702,"MB","DO",381,3,null,0,null,3,null,13,null,0,null,"No"]
["Alameda-Contra Costa Transit District","Oakland","CA",9014,90014,"Independent Public Agency or Authority of Transit Service","Full Reporter",3281212,702,"CB","DO",104,3,null,0,null,3,null,9,null,0,null,"No"]
["Alameda-Contra Costa Transit District","Oakland","CA",9014,90014,"Independent Public Agency or Authority of Transit Service","Full Reporter",3281212,702,"MB","PT",14,0,null,0,null,0,null,0,null,0,null,"No"]
["Santa Clara Valley Transportation Authority","San Jose","CA",9013,90013,"Independent Public Agency or Authority of Transit Service","Full Reporter",1664496,686,"MB","DO",392,12,null,0,null,12,null,1,null,0,null,"No"]
["Santa Clara Valley Transportation Authority","San Jose","CA",9013,90013,"Independent Public Agency or Authority of Transit Service","Full Reporter",1664496,686,"LR","DO",59,64,null,0,null,64,null,10,null,28,null,"No"]
["Santa Clara Valley Transportation Authority","San Jose","CA",9013,90013,"Independent Public Agency or Authority of Transit Service","Full Reporter",1664496,686,"MB","PT",11,1,null,0,null,1,null,0,null,0,null,"No"]
["Regional Transportation Commission of Southern Nevada","Las Vegas","NV",9045,90045,"Independent Public Agency or Authority of Transit Service","Full Reporter",1886011,612,"MB","PT",318,4,null,0,null,4,null,0,null,0,null,"No"]
["Regional Transportation Commission of Southern Nevada","Las Vegas","NV",9045,90045,"Independent Public Agency or Authority of Transit Service","Full Reporter",1886011,612,"RB","PT",23,1,null,0,null,1,null,0,null,0,null,"No"]
["Snohomish County Public Transportation Benefit Area Corporation","Everett","WA",29,29,"Independent Public Agency or Authority of Transit Service","Full Reporter",3059393,609,"MB","DO",106,1,null,0,null,1,null,0,null,0,null,"No"]
["Snohomish County Public Transportation Benefit Area Corporation","Everett","WA",29,29,"Independent Public Agency or Authority of Transit Service","Full Reporter",3059393,609,"CB","PT",54,1,null,0,null,1,null,0,null,0,null,"No"]
["Snohomish County Public Transportation Benefit Area Corporation","Everett","WA",29,29,"Independent Public Agency or Authority of Transit Service","Full Reporter",3059393,609,"CB","DO",40,1,null,0,null,1,null,0,null,0,null,"No"]
["Central Florida Regional Transportation Authority","Orlando","FL",4035,40035,"Independent Public Agency or Authority of Transit Service","Full Reporter",1510516,581,"MB","DO",250,2,null,0,null,2,null,0,null,0,null,"No"]
["Central Florida Regional Transportation Authority","Orlando","FL",4035,40035,"Independent Public Agency or Authority of Transit Service","Full Reporter",1510516,581,"RB","DO",13,1,null,0,null,1,null,0,null,0,null,"No"]
["Central Florida Regional Transportation Authority","Orlando","FL",4035,40035,"Independent Public Agency or Authority of Transit Service","Full Reporter",1510516,581,"MB","PT",13,0,null,0,null,0,null,0,null,0,null,"No"]
["Central Florida Regional Transportation Authority","Orlando","FL",4035,40035,"Independent Public Agency or Authority of Transit Service","Full Reporter",1510516,581,"CB","PT",2,0,null,0,null,0,null,0,null,0,null,"No"]
["City of Phoenix Public Transit Department dba Valley Metro","Phoenix","AZ",9032,90032,"City, County or Local Government Unit or Department of Transportation","Full Reporter",3629114,565,"MB","PT",456,4,null,0,null,4,null,0,null,0,null,"No"]
["San Francisco Bay Area Rapid Transit District","Oakland","CA",9003,90003,"Independent Public Agency or Authority of Transit Service","Full Reporter",3281212,545,"HR","DO",541,44,null,0,null,44,null,126,null,177,null,"No"]
["The Greater Cleveland Regional Transit Authority","Cleveland","OH",5015,50015,"Independent Public Agency or Authority of Transit Service","Full Reporter",1780673,545,"MB","DO",350,6,null,0,null,6,null,0,null,0,null,"No"]
["The Greater Cleveland Regional Transit Authority","Cleveland","OH",5015,50015,"Independent Public Agency or Authority of Transit Service","Full Reporter",1780673,545,"HR","DO",20,16,null,2,null,18,null,14,null,6,null,"No"]
["The Greater Cleveland Regional Transit Authority","Cleveland","OH",5015,50015,"Independent Public Agency or Authority of Transit Service","Full Reporter",1780673,545,"RB","DO",14,6,null,0,null,6,null,3,null,6,null,"No"]
["The Greater Cleveland Regional Transit Authority","Cleveland","OH",5015,50015,"Independent Public Agency or Authority of Transit Service","Full Reporter",1780673,545,"LR","DO",13,12,null,22,null,34,null,6,null,0,null,"No"]
["San Francisco Bay Area Rapid Transit District","Oakland","CA",9003,90003,"Independent Public Agency or Authority of Transit Service","Full Reporter",3281212,545,"MG","PT",4,2,null,0,null,2,null,2,null,4,null,"No"]
["Pierce County Transportation Benefit Area Authority","Tacoma","WA",3,3,"Independent Public Agency or Authority of Transit Service","Full Reporter",3059393,533,"MB","DO",118,28,null,0,null,28,null,5,null,0,null,"No"]
["Potomac and Rappahannock Transportation Commission","Woodbridge","VA",3070,30070,"Independent Public Agency or Authority of Transit Service","Full Reporter",4586770,532,"CB","PT",92,1,null,0,null,1,null,0,null,0,null,"No"]
["Potomac and Rappahannock Transportation Commission","Woodbridge","VA",3070,30070,"Independent Public Agency or Authority of Transit Service","Full Reporter",4586770,532,"MB","PT",36,1,null,0,null,1,null,0,null,0,null,"No"]
["Delaware Transit Corporation","Dover","DE",3075,30075,"Independent Public Agency or Authority of Transit Service","Full Reporter",5441567,481,"MB","DO",173,4,null,0,null,4,null,1,null,1,null,"No"]
["Delaware Transit Corporation","Dover","DE",3075,30075,"Independent Public Agency or Authority of Transit Service","Full Reporter",5441567,481,"MB","PT",31,3,null,0,null,3,null,1,null,1,null,"No"]
["Bi-State Development Agency of the Missouri-Illinois Metropolitan District, d.b.a.(St. Louis) Metro","St. Louis","MO",7006,70006,"Independent Public Agency or Authority of Transit Service","Full Reporter",2150706,480,"MB","DO",321,25,null,0,null,25,null,2,null,1,null,{"$f":"IF(V130&T130&R130&P130&N130<>\"\",\"Yes\",\"No\")","v":"No"}]
["Bi-State Development Agency of the Missouri-Illinois Metropolitan District, d.b.a.(St. Louis) Metro","St. Louis","MO",7006,70006,"Independent Public Agency or Authority of Transit Service","Full Reporter",2150706,480,"LR","DO",58,37,null,0,null,37,null,6,null,18,null,"No"]
["Broward County Transit Division","Plantation","FL",4029,40029,"City, County or Local Government Unit or Department of Transportation","Full Reporter",5502379,471,"MB","DO",273,4,null,0,null,4,null,0,null,0,null,"No"]
["Broward County Transit Division","Plantation","FL",4029,40029,"City, County or Local Government Unit or Department of Transportation","Full Reporter",5502379,471,"MB","PT",7,0,null,0,null,0,null,0,null,0,null,"No"]
["City of Detroit Department of Transportation","Detroit","MI",5119,50119,"City, County or Local Government Unit or Department of Transportation","Full Reporter",3734090,456,"MB","DO",230,1,null,0,null,1,null,1,null,1,null,"No"]
["Ben Franklin Transit","Richland","WA",18,18,"Independent Public Agency or Authority of Transit Service","Full Reporter",210975,431,"MB","DO",46,1,null,0,null,1,null,0,null,0,null,"No"]
["Board of County Commissioners, Palm Beach County, PalmTran, Inc.","West Palm Beach","FL",4037,40037,"City, County or Local Government Unit or Department of Transportation","Full Reporter",5502379,424,"MB","DO",130,1,null,0,null,1,null,1,null,0,null,"No"]
["Milwaukee County Transit System","Milwaukee","WI",5008,50008,"City, County or Local Government Unit or Department of Transportation","Full Reporter",1376476,421,"MB","DO",337,1,null,0,null,1,null,1,null,2,null,"No"]
["Charlotte Area Transit System","Charlotte","NC",4008,40008,"City, County or Local Government Unit or Department of Transportation","Full Reporter",1249442,421,"MB","DO",198,7,null,0,null,7,null,0,null,0,null,"No"]
["Charlotte Area Transit System","Charlotte","NC",4008,40008,"City, County or Local Government Unit or Department of Transportation","Full Reporter",1249442,421,"CB","DO",64,0,null,0,null,0,null,0,null,0,null,"No"]
["Charlotte Area Transit System","Charlotte","NC",4008,40008,"City, County or Local Government Unit or Department of Transportation","Full Reporter",1249442,421,"LR","DO",14,15,null,0,null,15,null,9,null,0,null,"No"]
["Charlotte Area Transit System","Charlotte","NC",4008,40008,"City, County or Local Government Unit or Department of Transportation","Full Reporter",1249442,421,"SR","DO",2,1,null,0,null,1,null,0,null,0,null,"No"]
["Regional Public Transportation Authority, dba: Valley Metro","Phoenix","AZ",9136,90136,"Independent Public Agency or Authority of Transit Service","Full Reporter",3629114,384,"MB","PT",273,2,null,0,null,2,null,0,null,0,null,"No"]
["Central Puget Sound Regional Transit Authority","Seattle","WA",40,40,"Independent Public Agency or Authority of Transit Service","Full Reporter",3059393,371,"CB","DO",205,18,null,0,null,18,null,12,null,4,null,"No"]
["San Mateo County Transit District","San Carlos","CA",9009,90009,"Independent Public Agency or Authority of Transit Service","Full Reporter",3281212,371,"MB","DO",190,16,null,1,null,17,null,5,null,3,null,"No"]
["San Mateo County Transit District","San Carlos","CA",9009,90009,"Independent Public Agency or Authority of Transit Service","Full Reporter",3281212,371,"MB","PT",80,0,null,0,null,0,null,0,null,0,null,"No"]
["Central Puget Sound Regional Transit Authority","Seattle","WA",40,40,"Independent Public Agency or Authority of Transit Service","Full Reporter",3059393,371,"CR","PT",67,12,null,0,null,12,null,15,null,0,null,"No"]
["Central Puget Sound Regional Transit Authority","Seattle","WA",40,40,"Independent Public Agency or Authority of Transit Service","Full Reporter",3059393,371,"LR","DO",50,16,null,0,null,16,null,45,null,70,null,"No"]
["Central Puget Sound Regional Transit Authority","Seattle","WA",40,40,"Independent Public Agency or Authority of Transit Service","Full Reporter",3059393,371,"CB","PT",47,8,null,0,null,8,null,3,null,0,null,"No"]
["Central Puget Sound Regional Transit Authority","Seattle","WA",40,40,"Independent Public Agency or Authority of Transit Service","Full Reporter",3059393,371,"SR","DO",2,0,null,0,null,0,null,0,null,0,null,"No"]
["Transportation District Commission of Hampton Roads","Hampton","VA",3083,30083,"Independent Public Agency or Authority of Transit Service","Full Reporter",1439666,369,"MB","DO",236,6,null,0,null,6,null,0,null,0,null,"No"]
["Transportation District Commission of Hampton Roads","Hampton","VA",3083,30083,"Independent Public Agency or Authority of Transit Service","Full Reporter",1439666,369,"LR","DO",6,11,null,0,null,11,null,1,null,0,null,"No"]
["Transportation District Commission of Hampton Roads","Hampton","VA",3083,30083,"Independent Public Agency or Authority of Transit Service","Full Reporter",1439666,369,"FB","PT",3,4,null,0,null,4,null,0,null,0,null,"No"]
["Central Ohio Transit Authority","Columbus","OH",5016,50016,"Independent Public Agency or Authority of Transit Service","Full Reporter",1368035,359,"MB","DO",295,5,null,0,null,5,null,1,null,1,null,"No"]
["City of Los Angeles Department of Transportation","Los Angeles","CA",9147,90147,"City, County or Local Government Unit or Department of Transportation","Full Reporter",12150996,355,"MB","PT",169,0,null,0,null,0,null,0,null,0,null,"No"]
["City of Los Angeles Department of Transportation","Los Angeles","CA",9147,90147,"City, County or Local Government Unit or Department of Transportation","Full Reporter",12150996,355,"CB","PT",89,4,null,0,null,4,null,0,null,0,null,"No"]
["Niagara Frontier Transportation Authority","Buffalo","NY",2004,20004,"Independent Public Agency or Authority of Transit Service","Full Reporter",935906,352,"MB","DO",267,10,null,0,null,10,null,0,null,0,null,"No"]
["Nassau Inter County Express","Garden City","NY",2206,20206,"City, County or Local Government Unit or Department of Transportation","Full Reporter",18351295,352,"MB","PT",255,1,null,0,null,1,null,0,null,0,null,"No"]
["Niagara Frontier Transportation Authority","Buffalo","NY",2004,20004,"Independent Public Agency or Authority of Transit Service","Full Reporter",935906,352,"LR","DO",23,14,null,0,null,14,null,19,null,24,null,"No"]
["Southwest Ohio Regional Transit Authority","Cincinnati","OH",5012,50012,"City, County or Local Government Unit or Department of Transportation","Full Reporter",1624827,350,"MB","DO",299,3,null,0,null,3,null,2,null,0,null,"No"]
["Southwest Ohio Regional Transit Authority","Cincinnati","OH",5012,50012,"City, County or Local Government Unit or Department of Transportation","Full Reporter",1624827,350,"SR","PT",3,18,null,0,null,18,null,0,null,0,null,"No"]
["Lane Transit District","Eugene","OR",7,7,"Independent Public Agency or Authority of Transit Service","Full Reporter",247421,342,"MB","DO",73,11,null,0,null,11,null,0,null,0,null,"No"]
["Lane Transit District","Eugene","OR",7,7,"Independent Public Agency or Authority of Transit Service","Full Reporter",247421,342,"RB","DO",8,3,null,0,null,3,null,0,null,0,null,"No"]
["Lane Transit District","Eugene","OR",7,7,"Independent Public Agency or Authority of Transit Service","Full Reporter",247421,342,"MB","PT",1,1,null,0,null,1,null,0,null,0,null,"No"]
["Westchester County Bee-Line System","Mount Vernon","NY",2076,20076,"City, County or Local Government Unit or Department of Transportation","Full Reporter",18351295,340,"MB","PT",264,2,null,0,null,2,null,0,null,0,null,"No"]
["City of Tuscon","Tucson   ","AZ",9033,90033,"City, County or Local Government Unit or Department of Transportation","Full Reporter",843168,336,"MB","DO",207,3,null,0,null,3,null,0,null,0,null,"No"]
["City of Tuscon","Tucson   ","AZ",9033,90033,"City, County or Local Government Unit or Department of Transportation","Full Reporter",843168,336,"SR","DO",6,0,null,0,null,0,null,0,null,0,null,"No"]
["Cape Cod Regional Transit Authority","Hyannis","MA",1105,10105,"Independent Public Agency or Authority of Transit Service","Full Reporter",246695,335,"MB","PT",47,1,null,0,null,1,null,1,null,0,null,"No"]
["Cape Cod Regional Transit Authority","Hyannis","MA",1105,10105,"Independent Public Agency or Authority of Transit Service","Full Reporter",246695,335,"CB","PT",2,0,null,0,null,0,null,0,null,0,null,"No"]
["Greater Richmond Transit Company","Richmond","VA",3006,30006,"Other Publicly-Owned or Privately Chartered Corporation","Full Reporter",953556,330,"MB","DO",121,0,null,0,null,0,null,0,null,0,null,"No"]
["Foothill Transit","West Covina","CA",9146,90146,"Independent Public Agency or Authority of Transit Service","Full Reporter",12150996,318,"MB","PT",318,2,null,0,null,2,null,0,null,0,null,"No"]
["Suburban Mobility Authority for Regional Transportation","Detroit","MI",5031,50031,"Independent Public Agency or Authority of Transit Service","Full Reporter",3734090,317,"MB","DO",195,1,null,0,null,1,null,0,null,0,null,"No"]
["Suburban Mobility Authority for Regional Transportation","Detroit","MI",5031,50031,"Independent Public Agency or Authority of Transit Service","Full Reporter",3734090,317,"MB","PT",8,1,null,0,null,1,null,0,null,0,null,"No"]
["Transit Authority of River City","Louisville","KY",4018,40018,"Independent Public Agency or Authority of Transit Service","Full Reporter",972546,316,"MB","DO",172,2,null,0,null,2,null,0,null,0,null,"No"]
["Transit Authority of River City","Louisville","KY",4018,40018,"Independent Public Agency or Authority of Transit Service","Full Reporter",972546,316,"MB","PT",1,0,null,0,null,0,null,0,null,0,null,"No"]
["Spokane Transit Authority","Spokane","WA",2,2,"Independent Public Agency or Authority of Transit Service","Full Reporter",387847,307,"MB","DO",111,1,null,0,null,1,null,2,null,1,null,"No"]
["Port Authority Trans-Hudson Corporation","Jersey City","NJ",2098,20098,"Independent Public Agency or Authority of Transit Service","Full Reporter",18351295,303,"HR","DO",298,7,null,6,null,13,null,24,null,34,null,"No"]
["Port Authority Trans-Hudson Corporation","Jersey City","NJ",2098,20098,"Independent Public Agency or Authority of Transit Service","Full Reporter",18351295,303,"FB","PT",5,2,null,0,null,2,null,0,null,0,null,"No"]
["Suffolk County Department of Public Works - Transportation Division","Yaphank","NY",2072,20072,"City, County or Local Government Unit or Department of Transportation","Full Reporter",18351295,300,"MB","PT",128,0,null,0,null,0,null,0,null,0,null,"No"]
["Kansas City Area Transportation Authority","Kansas City","MO",7005,70005,"Independent Public Agency or Authority of Transit Service","Full Reporter",1519417,298,"MB","DO",168,0,null,0,null,0,null,0,null,0,null,"No"]
["Capital Area Transit","Raleigh","NC",4007,40007,"City, County or Local Government Unit or Department of Transportation","Full Reporter",884891,298,"MB","DO",65,1,null,0,null,1,null,1,null,0,null,"No"]
["Kansas City Area Transportation Authority","Kansas City","MO",7005,70005,"Independent Public Agency or Authority of Transit Service","Full Reporter",1519417,298,"RB","DO",11,0,null,0,null,0,null,0,null,0,null,"No"]
["Pinellas Suncoast Transit Authority","St. Petersburg","FL",4027,40027,"Independent Public Agency or Authority of Transit Service","Full Reporter",2441770,295,"MB","DO",157,4,null,0,null,4,null,0,null,0,null,"No"]
["Pinellas Suncoast Transit Authority","St. Petersburg","FL",4027,40027,"Independent Public Agency or Authority of Transit Service","Full Reporter",2441770,295,"MB","PT",10,0,null,0,null,0,null,0,null,0,null,"No"]
["Pinellas Suncoast Transit Authority","St. Petersburg","FL",4027,40027,"Independent Public Agency or Authority of Transit Service","Full Reporter",2441770,295,"CB","DO",7,0,null,0,null,0,null,0,null,0,null,"No"]
["Rhode Island Public Transit Authority","Providence","RI",1001,10001,"Independent Public Agency or Authority of Transit Service","Full Reporter",1190956,291,"MB","DO",195,1,null,0,null,1,null,0,null,0,null,"No"]
["Intercity Transit","Olympia","WA",19,19,"Independent Public Agency or Authority of Transit Service","Full Reporter",176617,286,"MB","DO",50,2,null,0,null,2,null,0,null,0,null,"No"]
["Intercity Transit","Olympia","WA",19,19,"Independent Public Agency or Authority of Transit Service","Full Reporter",176617,286,"CB","DO",9,2,null,0,null,2,null,0,null,0,null,"No"]
["Ride-On Montgomery County Transit","Rockville","MD",3051,30051,"City, County or Local Government Unit or Department of Transportation","Full Reporter",4586770,282,"MB","DO",282,3,null,0,null,3,null,2,null,0,null,"No"]
["Capital District Transportation Authority","Albany","NY",2002,20002,"Independent Public Agency or Authority of Transit Service","Full Reporter",594962,277,"MB","DO",201,0,null,0,null,0,null,0,null,0,null,"No"]
["Capital District Transportation Authority","Albany","NY",2002,20002,"Independent Public Agency or Authority of Transit Service","Full Reporter",594962,277,"CB","PT",10,0,null,0,null,0,null,0,null,0,null,"No"]
["Salem Area Mass Transit District","Salem","OR",25,25,"Independent Public Agency or Authority of Transit Service","Full Reporter",236632,276,"MB","DO",53,3,null,0,null,3,null,0,null,0,null,"No"]
["Victor Valley Transit Authority","Hesperia","CA",9148,90148,"Independent Public Agency or Authority of Transit Service","Full Reporter",328454,276,"MB","PT",45,0,null,0,null,0,null,0,null,0,null,"No"]
["Victor Valley Transit Authority","Hesperia","CA",9148,90148,"Independent Public Agency or Authority of Transit Service","Full Reporter",328454,276,"CB","PT",7,0,null,0,null,0,null,0,null,0,null,"No"]
["Riverside Transit Agency","Riverside","CA",9031,90031,"Independent Public Agency or Authority of Transit Service","Full Reporter",1932666,274,"MB","DO",82,9,null,0,null,9,null,4,null,0,null,{"$f":"IF(V194&T194&R194&P194&N194<>\"\",\"Yes\",\"No\")","v":"No"}]
["Riverside Transit Agency","Riverside","CA",9031,90031,"Independent Public Agency or Authority of Transit Service","Full Reporter",1932666,274,"MB","PT",51,5,null,0,null,5,null,1,null,0,null,"No"]
["Riverside Transit Agency","Riverside","CA",9031,90031,"Independent Public Agency or Authority of Transit Service","Full Reporter",1932666,274,"CB","PT",16,5,null,0,null,5,null,1,null,0,null,"No"]
["Riverside Transit Agency","Riverside","CA",9031,90031,"Independent Public Agency or Authority of Transit Service","Full Reporter",1932666,274,"CB","DO",15,3,null,0,null,3,null,1,null,0,null,"No"]
["Omnitrans","San Bernardino","CA",9029,90029,"Independent Public Agency or Authority of Transit Service","Full Reporter",1932666,266,"MB","DO",162,8,null,0,null,8,null,2,null,0,null,"No"]
["Omnitrans","San Bernardino","CA",9029,90029,"Independent Public Agency or Authority of Transit Service","Full Reporter",1932666,266,"MB","PT",7,2,null,0,null,2,null,0,null,0,null,"No"]
["Pioneer Valley Transit Authority","Springfield","MA",1008,10008,"Independent Public Agency or Authority of Transit Service","Full Reporter",621300,264,"MB","PT",154,2,null,0,null,2,null,0,null,0,null,"No"]
["Toledo Area Regional Transit Authority","Toledo","OH",5022,50022,"Independent Public Agency or Authority of Transit Service","Full Reporter",507643,261,"MB","DO",109,5,null,0,null,5,null,2,null,1,null,"No"]
["Metropolitan Transit Authority","Nashville","TN",4004,40004,"Independent Public Agency or Authority of Transit Service","Full Reporter",969587,260,"MB","DO",124,1,null,0,null,1,null,1,null,2,null,"No"]
["Metropolitan Transit Authority","Nashville","TN",4004,40004,"Independent Public Agency or Authority of Transit Service","Full Reporter",969587,260,"CB","DO",23,1,null,0,null,1,null,1,null,2,null,"No"]
["RTS - Monroe County","Rochester","NY",2113,20113,"Independent Public Agency or Authority of Transit Service","Full Reporter",720572,257,"MB","DO",213,3,null,0,null,3,null,0,null,0,null,"No"]
["Kitsap Transit","Bremerton","WA",20,20,"Independent Public Agency or Authority of Transit Service","Full Reporter",198979,257,"MB","DO",90,13,null,0,null,13,null,1,null,0,null,"No"]
["Kitsap Transit","Bremerton","WA",20,20,"Independent Public Agency or Authority of Transit Service","Full Reporter",198979,257,"FB","PT",2,2,null,1,null,3,null,1,null,0,null,"No"]
["Metro Transit System","Madison","WI",5005,50005,"City, County or Local Government Unit or Department of Transportation","Full Reporter",401661,254,"MB","DO",182,0,null,0,null,0,null,0,null,0,null,"No"]
["Jacksonville Transportation Authority","Jacksonville","FL",4040,40040,"Independent Public Agency or Authority of Transit Service","Full Reporter",1065219,244,"MB","DO",150,3,null,0,null,3,null,2,null,2,null,"No"]
["Jacksonville Transportation Authority","Jacksonville","FL",4040,40040,"Independent Public Agency or Authority of Transit Service","Full Reporter",1065219,244,"MG","DO",5,8,null,0,null,8,null,8,null,16,null,"No"]
["Jacksonville Transportation Authority","Jacksonville","FL",4040,40040,"Independent Public Agency or Authority of Transit Service","Full Reporter",1065219,244,"FB","PT",1,2,null,0,null,2,null,0,null,0,null,"No"]
["Interurban Transit Partnership","Grand Rapids","MI",5033,50033,"Independent Public Agency or Authority of Transit Service","Full Reporter",569935,241,"MB","DO",125,1,null,0,null,1,null,1,null,0,null,"No"]
["Interurban Transit Partnership","Grand Rapids","MI",5033,50033,"Independent Public Agency or Authority of Transit Service","Full Reporter",569935,241,"RB","DO",8,2,null,0,null,2,null,1,null,0,null,"No"]
["Connecticut Department of Transportation - CTTRANSIT - Hartford Division","Hartford","CT",1048,10048,"State Government Unit or Department of Transportation","Full Reporter",924859,232,"MB","DO",223,0,null,0,null,0,null,0,null,0,null,"No"]
["Sacramento Regional Transit District","Sacramento","CA",9019,90019,"Independent Public Agency or Authority of Transit Service","Full Reporter",1723634,232,"MB","DO",162,32,null,0,null,32,null,0,null,0,null,"No"]
["Sacramento Regional Transit District","Sacramento","CA",9019,90019,"Independent Public Agency or Authority of Transit Service","Full Reporter",1723634,232,"LR","DO",68,41,null,0,null,41,null,8,null,0,null,"No"]
["Connecticut Department of Transportation - CTTRANSIT - Hartford Division","Hartford","CT",1048,10048,"State Government Unit or Department of Transportation","Full Reporter",924859,232,"RB","DO",9,0,null,0,null,0,null,0,null,0,null,"No"]
["North County Transit District","Oceanside","CA",9030,90030,"Independent Public Agency or Authority of Transit Service","Full Reporter",2956746,230,"MB","PT",137,4,null,0,null,4,null,0,null,0,null,"No"]
["North County Transit District","Oceanside","CA",9030,90030,"Independent Public Agency or Authority of Transit Service","Full Reporter",2956746,230,"CR","PT",24,8,null,0,null,8,null,1,null,0,null,"No"]
["North County Transit District","Oceanside","CA",9030,90030,"Independent Public Agency or Authority of Transit Service","Full Reporter",2956746,230,"YR","PT",8,15,null,0,null,15,null,1,null,0,null,"No"]
["Fairfax Connector Bus System","Fairfax","VA",3068,30068,"City, County or Local Government Unit or Department of Transportation","Full Reporter",4586770,226,"MB","PT",226,16,null,0,null,16,null,5,null,2,null,"No"]
["Des Moines Area Regional Transit Authority","Des Moines","IA",7010,70010,"Independent Public Agency or Authority of Transit Service","Full Reporter",450070,226,"MB","DO",113,1,null,0,null,1,null,1,null,0,null,"No"]
["Academy Lines, Inc.","Hoboken","NJ",2122,20122,"Private-For-Profit Corporation","Full Reporter",18351295,225,"CB","DO",225,2,null,0,null,2,null,2,null,0,null,"No"]
["Metropolitan Council","St. Paul","MN",5154,50154,"City, County or Local Government Unit or Department of Transportation","Full Reporter",2650890,219,"MB","PT",68,14,null,0,null,14,null,14,null,5,null,"No"]
["Central New York Regional Transportation Authority","Syracuse","NY",2018,20018,"Independent Public Agency or Authority of Transit Service","Full Reporter",412317,208,"MB","DO",162,1,null,0,null,1,null,0,null,0,null,"No"]
["METRO Regional Transit Authority","Akron","OH",5010,50010,"Independent Public Agency or Authority of Transit Service","Full Reporter",569499,208,"MB","DO",110,2,null,0,null,2,null,0,null,0,null,"No"]
["METRO Regional Transit Authority","Akron","OH",5010,50010,"Independent Public Agency or Authority of Transit Service","Full Reporter",569499,208,"CB","DO",7,0,null,0,null,0,null,0,null,0,null,"No"]
["Blue Water Area Transportation Commission","Port Huron","MI",5148,50148,"Independent Public Agency or Authority of Transit Service","Full Reporter",87106,205,"MB","DO",9,1,null,0,null,1,null,0,null,0,null,"No"]
["Blue Water Area Transportation Commission","Port Huron","MI",5148,50148,"Independent Public Agency or Authority of Transit Service","Full Reporter",87106,205,"CB","DO",3,1,null,0,null,1,null,0,null,0,null,"No"]
["Regional Transportation Commission of Washoe County","Reno","NV",9001,90001,"Independent Public Agency or Authority of Transit Service","Full Reporter",392141,204,"MB","PT",54,2,null,0,null,2,null,0,null,0,null,"No"]
["Regional Transportation Commission of Washoe County","Reno","NV",9001,90001,"Independent Public Agency or Authority of Transit Service","Full Reporter",392141,204,"CB","PT",3,0,null,0,null,0,null,0,null,0,null,"No"]
["Indianapolis and Marion County Public Transportation","Indianapolis","IN",5050,50050,"Independent Public Agency or Authority of Transit Service","Full Reporter",1487483,202,"MB","DO",136,1,null,0,null,1,null,0,null,0,null,"No"]
["Mass Transportation Authority","Flint","MI",5032,50032,"Independent Public Agency or Authority of Transit Service","Full Reporter",356218,202,"MB","DO",99,1,null,0,null,1,null,0,null,0,null,"No"]
["Hillsborough Area Regional Transit Authority","Tampa","FL",4041,40041,"Independent Public Agency or Authority of Transit Service","Full Reporter",2441770,201,"MB","DO",162,5,null,0,null,5,null,1,null,0,null,"No"]
["Hillsborough Area Regional Transit Authority","Tampa","FL",4041,40041,"Independent Public Agency or Authority of Transit Service","Full Reporter",2441770,201,"SR","DO",3,9,null,0,null,9,null,0,null,0,null,"No"]
["Long Beach Transit","Long Beach","CA",9023,90023,"Other Publicly-Owned or Privately Chartered Corporation","Full Reporter",12150996,197,"MB","DO",187,0,null,0,null,0,null,0,null,0,null,"No"]
["Southern California Regional Rail Authority dba: Metrolink","Los Angeles","CA",9151,90151,"Independent Public Agency or Authority of Transit Service","Full Reporter",12150996,195,"CR","PT",195,59,null,0,null,59,null,25,null,0,null,"No"]
["City of Albuquerque Transit Department","Albuquerque","NM",6019,60019,"City, County or Local Government Unit or Department of Transportation","Full Reporter",741318,193,"MB","DO",131,1,null,0,null,1,null,0,null,0,null,"No"]
["Fort Worth Transportation Authority","Fort Worth","TX",6007,60007,"Independent Public Agency or Authority of Transit Service","Full Reporter",5121892,192,"MB","DO",108,5,null,0,null,5,null,3,null,0,null,"No"]
["Fort Worth Transportation Authority","Fort Worth","TX",6007,60007,"Independent Public Agency or Authority of Transit Service","Full Reporter",5121892,192,"MB","PT",4,0,null,0,null,0,null,0,null,0,null,"No"]
["Mass Transit Department - City of El Paso","El Paso","TX",6006,60006,"City, County or Local Government Unit or Department of Transportation","Full Reporter",803086,186,"MB","DO",125,8,null,0,null,8,null,5,null,0,null,"No"]
["Greater Dayton Regional Transit Authority","Dayton","OH",5017,50017,"Independent Public Agency or Authority of Transit Service","Full Reporter",724091,178,"MB","DO",98,5,null,0,null,5,null,0,null,0,null,"No"]
["York County Transportation Authority","York","PA",3027,30027,"Independent Public Agency or Authority of Transit Service","Full Reporter",232045,178,"MB","DO",35,2,null,0,null,2,null,0,null,0,null,"No"]
["Greater Dayton Regional Transit Authority","Dayton","OH",5017,50017,"Independent Public Agency or Authority of Transit Service","Full Reporter",724091,178,"TB","DO",26,4,null,0,null,4,null,0,null,0,null,"No"]
["York County Transportation Authority","York","PA",3027,30027,"Independent Public Agency or Authority of Transit Service","Full Reporter",232045,178,"CB","DO",9,1,null,0,null,1,null,0,null,0,null,"No"]
["Capital Area Transportation Authority","Lansing","MI",5036,50036,"Independent Public Agency or Authority of Transit Service","Full Reporter",313532,176,"MB","DO",76,3,null,0,null,3,null,0,null,0,null,"No"]
["Clark County Public Transportation Benefit Area Authority","Vancouver","WA",24,24,"Independent Public Agency or Authority of Transit Service","Full Reporter",1849898,176,"MB","DO",56,3,null,0,null,3,null,0,null,0,null,"No"]
["Clark County Public Transportation Benefit Area Authority","Vancouver","WA",24,24,"Independent Public Agency or Authority of Transit Service","Full Reporter",1849898,176,"CB","DO",41,3,null,0,null,3,null,0,null,0,null,"No"]
["Lehigh and Northampton Transportation Authority","Allentown","PA",3010,30010,"Independent Public Agency or Authority of Transit Service","Full Reporter",664651,175,"MB","DO",71,3,null,0,null,3,null,4,null,0,null,"No"]
["Santa Monica's Big Blue Bus","Santa Monica","CA",9008,90008,"City, County or Local Government Unit or Department of Transportation","Full Reporter",12150996,173,"MB","DO",167,1,null,0,null,1,null,0,null,0,null,"No"]
["Mountain Metropolitan Transit","Colorado Springs","CO",8005,80005,"City, County or Local Government Unit or Department of Transportation","Full Reporter",559409,170,"MB","PT",40,1,null,0,null,1,null,0,null,0,null,"No"]
["Wichita Transit","Wichita","KS",7015,70015,"City, County or Local Government Unit or Department of Transportation","Full Reporter",472870,170,"MB","DO",38,1,null,0,null,1,null,0,null,0,null,"No"]
["Montachusett Regional Transit Authority","Fitchburg","MA",1061,10061,"Independent Public Agency or Authority of Transit Service","Full Reporter",116960,170,"MB","PT",19,2,null,0,null,2,null,3,null,0,null,"No"]
["New Orleans Regional Transit Authority","New Orleans","LA",6032,60032,"Independent Public Agency or Authority of Transit Service","Full Reporter",899703,163,"MB","PT",89,0,null,0,null,0,null,0,null,0,null,"No"]
["New Orleans Regional Transit Authority","New Orleans","LA",6032,60032,"Independent Public Agency or Authority of Transit Service","Full Reporter",899703,163,"SR","PT",31,16,null,0,null,16,null,0,null,0,null,"No"]
["New Orleans Regional Transit Authority","New Orleans","LA",6032,60032,"Independent Public Agency or Authority of Transit Service","Full Reporter",899703,163,"FB","PT",2,4,null,0,null,4,null,0,null,0,null,"No"]
["Hudson Transit Lines, Inc.","Mahwah","NJ",2126,20126,"Private-For-Profit Corporation","Full Reporter",18351295,161,"CB","DO",161,4,null,0,null,4,null,12,null,0,null,"No"]
["Ann Arbor Area Transportation Authority","Ann Arbor","MI",5040,50040,"Independent Public Agency or Authority of Transit Service","Full Reporter",306022,160,"MB","DO",84,2,null,0,null,2,null,1,null,0,null,"No"]
["Ann Arbor Area Transportation Authority","Ann Arbor","MI",5040,50040,"Independent Public Agency or Authority of Transit Service","Full Reporter",306022,160,"CB","DO",2,0,null,0,null,0,null,0,null,0,null,{"$f":"IF(V258&T258&R258&P258&N258<>\"\",\"Yes\",\"No\")","v":"No"}]
["Ann Arbor Area Transportation Authority","Ann Arbor","MI",5040,50040,"Independent Public Agency or Authority of Transit Service","Full Reporter",306022,160,"CB","PT",2,0,null,0,null,0,null,0,null,0,null,"No"]
["Research Triangle Regional Public Transportation Authority","Research Triangle Park","NC",4108,40108,"Independent Public Agency or Authority of Transit Service","Full Reporter",347602,153,"MB","DO",58,5,null,0,null,5,null,0,null,0,null,"No"]
["Research Triangle Regional Public Transportation Authority","Research Triangle Park","NC",4108,40108,"Independent Public Agency or Authority of Transit Service","Full Reporter",347602,153,"MB","PT",20,3,null,0,null,3,null,0,null,0,null,"No"]
["Golden Gate Bridge, Highway and Transportation District","San Francisco","CA",9016,90016,"Independent Public Agency or Authority of Transit Service","Full Reporter",3281212,152,"MB","DO",129,2,null,0,null,2,null,0,null,0,null,"No"]
["Municipality of Anchorage - Public Transportation Department","Anchorage","AK",12,12,"City, County or Local Government Unit or Department of Transportation","Full Reporter",251243,152,"MB","DO",43,2,null,0,null,2,null,0,null,0,null,"No"]
["Space Coast Area Transit","Cocoa","FL",4063,40063,"City, County or Local Government Unit or Department of Transportation","Full Reporter",452791,152,"MB","DO",29,0,null,0,null,0,null,0,null,0,null,"No"]
["Golden Gate Bridge, Highway and Transportation District","San Francisco","CA",9016,90016,"Independent Public Agency or Authority of Transit Service","Full Reporter",3281212,152,"FB","DO",6,4,null,0,null,4,null,0,null,0,null,"No"]
["Memphis Area Transit Authority","Memphis","TN",4003,40003,"City, County or Local Government Unit or Department of Transportation","Full Reporter",1060061,150,"MB","DO",108,4,null,0,null,4,null,2,null,0,null,"No"]
["Memphis Area Transit Authority","Memphis","TN",4003,40003,"City, County or Local Government Unit or Department of Transportation","Full Reporter",1060061,150,"SR","DO",0,7,null,0,null,7,null,0,null,0,null,"No"]
["Madison County Transit District","Granite City","IL",5146,50146,"Independent Public Agency or Authority of Transit Service","Full Reporter",2150706,145,"MB","PT",74,5,null,0,null,5,null,0,null,0,null,"No"]
["Gainesville Regional Transit System","Gainesville","FL",4030,40030,"City, County or Local Government Unit or Department of Transportation","Full Reporter",187781,143,"MB","DO",108,2,null,0,null,2,null,0,null,0,null,"No"]
["Central Contra Costa Transit Authority","Concord","CA",9078,90078,"Independent Public Agency or Authority of Transit Service","Full Reporter",615968,143,"MB","DO",93,1,null,0,null,1,null,3,null,0,null,"No"]
["Peninsula Corridor Joint Powers Board dba: Caltrain","San Carlos","CA",9134,90134,"Independent Public Agency or Authority of Transit Service","Full Reporter",3281212,135,"CR","PT",105,26,null,6,null,32,null,11,null,4,null,"No"]
["Peninsula Corridor Joint Powers Board dba: Caltrain","San Carlos","CA",9134,90134,"Independent Public Agency or Authority of Transit Service","Full Reporter",3281212,135,"MB","PT",30,0,null,0,null,0,null,0,null,0,null,"No"]
["Minnesota Valley Transit Authority","Burnsville","MN",5222,50519,"Independent Public Agency or Authority of Transit Service","Full Reporter",2650890,134,"MB","PT",134,7,null,0,null,7,null,2,null,6,null,"No"]
["County of Volusia, dba: VOTRAN","South Daytona","FL",4032,40032,"City, County or Local Government Unit or Department of Transportation","Full Reporter",349064,133,"MB","DO",54,2,null,0,null,2,null,0,null,0,null,"No"]
["Fresno Area Express","Fresno","CA",9027,90027,"City, County or Local Government Unit or Department of Transportation","Full Reporter",654628,129,"MB","DO",80,1,null,0,null,1,null,0,null,0,null,"No"]
["Prince George's County Transit","Largo","MD",3085,30085,"City, County or Local Government Unit or Department of Transportation","Full Reporter",4586770,128,"MB","PT",76,0,null,0,null,0,null,0,null,0,null,"No"]
["Hill Country Transit District","San Saba","TX",6091,60091,"Independent Public Agency or Authority of Transit Service","Full Reporter",217630,122,"MB","DO",14,0,null,0,null,0,null,0,null,0,null,"No"]
["Champaign-Urbana Mass Transit District","Urbana","IL",5060,50060,"Independent Public Agency or Authority of Transit Service","Full Reporter",145361,120,"MB","DO",97,1,null,0,null,1,null,2,null,0,null,"No"]
["Rides Mass Transit District","Harrisburg","IL",5211,50211,"Independent Public Agency or Authority of Transit Service","Full Reporter",67821,119,"MB","DO",119,4,null,0,null,4,null,0,null,0,null,"No"]
["Metropolitan Bus Authority","San Juan","PR",4086,40086,"Independent Public Agency or Authority of Transit Service","Full Reporter",2148346,118,"MB","DO",88,8,null,0,null,8,null,0,null,0,null,"No"]
["Santa Cruz Metropolitan Transit District","Santa Cruz","CA",9006,90006,"Independent Public Agency or Authority of Transit Service","Full Reporter",163703,117,"MB","DO",67,4,null,0,null,4,null,0,null,0,null,"No"]
["Santa Cruz Metropolitan Transit District","Santa Cruz","CA",9006,90006,"Independent Public Agency or Authority of Transit Service","Full Reporter",163703,117,"CB","DO",15,3,null,0,null,3,null,0,null,0,null,"No"]
["Erie Metropolitan Transit Authority","Erie","PA",3013,30013,"Independent Public Agency or Authority of Transit Service","Full Reporter",196611,116,"MB","DO",61,1,null,0,null,1,null,0,null,0,null,"No"]
["Centre Area Transportation Authority","State College","PA",3054,30054,"Independent Public Agency or Authority of Transit Service","Full Reporter",87454,114,"MB","DO",61,1,null,0,null,1,null,0,null,0,null,"No"]
["Denton County Transportation Authority","Lewisville","TX",6101,60101,"Independent Public Agency or Authority of Transit Service","Full Reporter",366174,114,"MB","DO",50,0,null,0,null,0,null,0,null,0,null,"No"]
["Greater Attleboro-Taunton Regional Transit Authority","Taunton","MA",1064,10064,"Independent Public Agency or Authority of Transit Service","Full Reporter",1190956,114,"MB","PT",41,2,null,0,null,2,null,0,null,0,null,"No"]
["Denton County Transportation Authority","Lewisville","TX",6101,60101,"Independent Public Agency or Authority of Transit Service","Full Reporter",366174,114,"YR","PT",8,5,null,0,null,5,null,0,null,0,null,"No"]
["Greater Attleboro-Taunton Regional Transit Authority","Taunton","MA",1064,10064,"Independent Public Agency or Authority of Transit Service","Full Reporter",1190956,114,"CB","PT",2,0,null,0,null,0,null,0,null,0,null,"No"]
["Transit Authority of Northern Kentucky","Fort Wright","KY",4019,40019,"Independent Public Agency or Authority of Transit Service","Full Reporter",1624827,113,"MB","DO",91,1,null,0,null,1,null,0,null,0,null,"No"]
["Transit Authority of Omaha","Omaha","NE",7002,70002,"Independent Public Agency or Authority of Transit Service","Full Reporter",725008,112,"MB","DO",90,1,null,0,null,1,null,1,null,0,null,"No"]
["Cumberland Dauphin-Harrisburg Transit Authority","Harrisburg","PA",3014,30014,"Independent Public Agency or Authority of Transit Service","Full Reporter",444474,111,"MB","DO",63,1,null,0,null,1,null,0,null,0,null,"No"]
["Cumberland Dauphin-Harrisburg Transit Authority","Harrisburg","PA",3014,30014,"Independent Public Agency or Authority of Transit Service","Full Reporter",444474,111,"MB","PT",2,0,null,0,null,0,null,0,null,0,null,"No"]
["Lexington Transit Authority","Lexington","KY",4017,40017,"Independent Public Agency or Authority of Transit Service","Full Reporter",290263,108,"MB","DO",54,1,null,0,null,1,null,1,null,0,null,"No"]
["Montebello Bus Lines","Montebello","CA",9041,90041,"City, County or Local Government Unit or Department of Transportation","Full Reporter",12150996,107,"MB","DO",62,1,null,0,null,1,null,0,null,0,null,"No"]
["Montebello Bus Lines","Montebello","CA",9041,90041,"City, County or Local Government Unit or Department of Transportation","Full Reporter",12150996,107,"MB","PT",5,1,null,0,null,1,null,0,null,0,null,"No"]
["Monterey-Salinas Transit","Monterey","CA",9062,90062,"Independent Public Agency or Authority of Transit Service","Full Reporter",114237,105,"MB","DO",51,4,null,0,null,4,null,0,null,0,null,"No"]
["Monterey-Salinas Transit","Monterey","CA",9062,90062,"Independent Public Agency or Authority of Transit Service","Full Reporter",114237,105,"MB","PT",17,4,null,0,null,4,null,0,null,0,null,"No"]
["Monterey-Salinas Transit","Monterey","CA",9062,90062,"Independent Public Agency or Authority of Transit Service","Full Reporter",114237,105,"CB","DO",7,8,null,0,null,8,null,1,null,1,null,"No"]
["Sarasota County Area Transit","Sarasota","FL",4046,40046,"City, County or Local Government Unit or Department of Transportation","Full Reporter",643260,104,"MB","DO",49,4,null,0,null,4,null,0,null,0,null,"No"]
["San Joaquin Regional Transit District","Stockton","CA",9012,90012,"Independent Public Agency or Authority of Transit Service","Full Reporter",370583,104,"MB","DO",48,1,null,0,null,1,null,0,null,0,null,"No"]
["San Joaquin Regional Transit District","Stockton","CA",9012,90012,"Independent Public Agency or Authority of Transit Service","Full Reporter",370583,104,"MB","PT",22,0,null,0,null,0,null,0,null,0,null,"No"]
["San Joaquin Regional Transit District","Stockton","CA",9012,90012,"Independent Public Agency or Authority of Transit Service","Full Reporter",370583,104,"CB","PT",14,0,null,0,null,0,null,0,null,0,null,"No"]
["Sarasota County Area Transit","Sarasota","FL",4046,40046,"City, County or Local Government Unit or Department of Transportation","Full Reporter",643260,104,"CB","DO",5,1,null,0,null,1,null,0,null,0,null,"No"]
["Worcester Regional Transit Authority","Worcester","MA",1014,10014,"Independent Public Agency or Authority of Transit Service","Full Reporter",486514,103,"MB","DO",44,1,null,0,null,1,null,0,null,0,null,"No"]
["Cobb County Department of Transportation","Marietta","GA",4078,40078,"City, County or Local Government Unit or Department of Transportation","Full Reporter",4515419,103,"MB","PT",40,2,null,0,null,2,null,0,null,0,null,"No"]
["Cobb County Department of Transportation","Marietta","GA",4078,40078,"City, County or Local Government Unit or Department of Transportation","Full Reporter",4515419,103,"CB","PT",38,2,null,0,null,2,null,0,null,0,null,"No"]
["Worcester Regional Transit Authority","Worcester","MA",1014,10014,"Independent Public Agency or Authority of Transit Service","Full Reporter",486514,103,"MB","PT",1,0,null,0,null,0,null,0,null,0,null,"No"]
["Suburban Transit Corporation","New Brunswick","NJ",2128,20128,"Private-For-Profit Corporation","Full Reporter",18351295,102,"CB","DO",102,3,null,0,null,3,null,2,null,0,null,"No"]
["Corpus Christi Regional Transportation Authority","Corpus Christi","TX",6051,60051,"Independent Public Agency or Authority of Transit Service","Full Reporter",320069,102,"MB","DO",58,5,null,0,null,5,null,0,null,0,null,"No"]
["Corpus Christi Regional Transportation Authority","Corpus Christi","TX",6051,60051,"Independent Public Agency or Authority of Transit Service","Full Reporter",320069,102,"MB","PT",9,1,null,0,null,1,null,0,null,0,null,"No"]
["Georgia Regional Transportation Authority","Atlanta","GA",4135,40135,"State Government Unit or Department of Transportation","Full Reporter",4515419,101,"CB","PT",101,10,null,0,null,10,null,31,null,76,null,"No"]
["Whatcom Transportation Authority","Bellingham","WA",21,21,"Independent Public Agency or Authority of Transit Service","Full Reporter",114473,101,"MB","DO",44,4,null,0,null,4,null,0,null,0,null,"No"]
["Birmingham-Jefferson County Transit Authority","Birmingham","AL",4042,40042,"Independent Public Agency or Authority of Transit Service","Full Reporter",749495,100,"MB","DO",70,1,null,0,null,1,null,0,null,0,null,"No"]
["City of Alexandria","Alexandria","VA",3071,30071,"City, County or Local Government Unit or Department of Transportation","Full Reporter",4586770,99,"MB","DO",66,7,null,0,null,7,null,0,null,0,null,"No"]
["Connecticut Department of Transportation - CTTRANSIT New Haven Division","Hartford","CT",1055,10055,"State Government Unit or Department of Transportation","Full Reporter",562839,98,"MB","DO",98,0,null,0,null,0,null,0,null,0,null,"No"]
["Lee County Transit","Fort Myers","FL",4028,40028,"City, County or Local Government Unit or Department of Transportation","Full Reporter",530290,98,"MB","DO",48,3,null,0,null,3,null,0,null,0,null,"No"]
["Virginia Railway Express","Alexandria","VA",3073,30073,"Independent Public Agency or Authority of Transit Service","Full Reporter",4586770,97,"CR","PT",97,19,null,0,null,19,null,5,null,0,null,"No"]
["Charleston Area Regional Transportation Authority","Charleston","SC",4110,40110,"Independent Public Agency or Authority of Transit Service","Full Reporter",548404,97,"MB","PT",70,1,null,0,null,1,null,0,null,0,null,"No"]
["Berks Area Regional Transportation Authority","Reading","PA",3024,30024,"Independent Public Agency or Authority of Transit Service","Full Reporter",266254,97,"MB","DO",44,2,null,0,null,2,null,1,null,0,null,"No"]
["Charleston Area Regional Transportation Authority","Charleston","SC",4110,40110,"Independent Public Agency or Authority of Transit Service","Full Reporter",548404,97,"CB","PT",7,0,null,0,null,0,null,0,null,0,null,"No"]
["Chapel Hill Transit","Chapel Hill","NC",4051,40051,"City, County or Local Government Unit or Department of Transportation","Full Reporter",347602,96,"MB","DO",81,0,null,0,null,0,null,0,null,0,null,"No"]
["Red Rose Transit Authority","Lancaster","PA",3018,30018,"Independent Public Agency or Authority of Transit Service","Full Reporter",402004,96,"MB","DO",34,1,null,0,null,1,null,0,null,0,null,{"$f":"IF(V322&T322&R322&P322&N322<>\"\",\"Yes\",\"No\")","v":"No"}]
["Westmoreland County Transit Authority","Greensburg","PA",3044,30044,"City, County or Local Government Unit or Department of Transportation","Full Reporter",1733853,95,"MB","PT",31,1,null,0,null,1,null,0,null,0,null,"No"]
["Laketran","Grand River","OH",5117,50117,"Independent Public Agency or Authority of Transit Service","Full Reporter",1780673,95,"CB","DO",13,0,null,0,null,0,null,0,null,0,null,"No"]
["Laketran","Grand River","OH",5117,50117,"Independent Public Agency or Authority of Transit Service","Full Reporter",1780673,95,"MB","DO",10,5,null,0,null,5,null,0,null,0,null,"No"]
["Metropolitan Tulsa Transit Authority","Tulsa","OK",6018,60018,"City, County or Local Government Unit or Department of Transportation","Full Reporter",655479,93,"MB","DO",53,2,null,0,null,2,null,0,null,0,null,"No"]
["Metropolitan Tulsa Transit Authority","Tulsa","OK",6018,60018,"City, County or Local Government Unit or Department of Transportation","Full Reporter",655479,93,"MB","PT",7,2,null,0,null,2,null,0,null,0,null,"No"]
["Loudoun County Commuter Bus Service - Office of Transportation Services","Leesburg","VA",3081,30081,"City, County or Local Government Unit or Department of Transportation","Full Reporter",4586770,92,"CB","PT",55,0,null,0,null,0,null,0,null,0,null,"No"]
["Norwalk Transit District","Norwalk","CT",1057,10057,"Independent Public Agency or Authority of Transit Service","Full Reporter",923311,92,"MB","DO",44,1,null,0,null,1,null,0,null,0,null,"No"]
["Loudoun County Commuter Bus Service - Office of Transportation Services","Leesburg","VA",3081,30081,"City, County or Local Government Unit or Department of Transportation","Full Reporter",4586770,92,"MB","PT",37,0,null,0,null,0,null,0,null,0,null,"No"]
["Norwalk Transit District","Norwalk","CT",1057,10057,"Independent Public Agency or Authority of Transit Service","Full Reporter",923311,92,"MB","PT",4,0,null,0,null,0,null,0,null,0,null,"No"]
["Durham Area Transit Authority","Durham","NC",4087,40087,"City, County or Local Government Unit or Department of Transportation","Full Reporter",347602,91,"MB","PT",45,1,null,0,null,1,null,1,null,0,null,"No"]
["Santa Clarita Transit","Santa Clarita","CA",9171,90171,"City, County or Local Government Unit or Department of Transportation","Full Reporter",258653,90,"MB","PT",44,3,null,0,null,3,null,0,null,0,null,"No"]
["Santa Clarita Transit","Santa Clarita","CA",9171,90171,"City, County or Local Government Unit or Department of Transportation","Full Reporter",258653,90,"CB","PT",24,3,null,0,null,3,null,0,null,0,null,"No"]
["Skagit Transit","Burlington","WA",44,44,"Independent Public Agency or Authority of Transit Service","Full Reporter",62966,90,"MB","DO",15,1,null,0,null,1,null,0,null,0,null,"No"]
["Skagit Transit","Burlington","WA",44,44,"Independent Public Agency or Authority of Transit Service","Full Reporter",62966,90,"CB","DO",5,3,null,0,null,3,null,2,null,0,null,"No"]
["City Transit Management Company, Inc.","Lubbock","TX",6010,60010,"City, County or Local Government Unit or Department of Transportation","Full Reporter",237356,89,"MB","DO",60,1,null,0,null,1,null,0,null,0,null,"No"]
["Pasco County Public Transportation","Port Richey","FL",4074,40074,"City, County or Local Government Unit or Department of Transportation","Full Reporter",2441770,89,"MB","DO",21,0,null,0,null,0,null,0,null,0,null,"No"]
["SunLine Transit Agency","Thousand Palms","CA",9079,90079,"Independent Public Agency or Authority of Transit Service","Full Reporter",345580,88,"MB","DO",57,1,null,0,null,1,null,0,null,0,null,"No"]
["Johnson County Kansas, aka: Johnson County Transit","Olathe","KS",7035,70035,"City, County or Local Government Unit or Department of Transportation","Full Reporter",1519417,88,"MB","PT",22,0,null,0,null,0,null,0,null,0,null,"No"]
["Johnson County Kansas, aka: Johnson County Transit","Olathe","KS",7035,70035,"City, County or Local Government Unit or Department of Transportation","Full Reporter",1519417,88,"CB","PT",21,0,null,0,null,0,null,0,null,0,null,"No"]
["Middlesex County Area Transit","New Brunswick","NJ",2196,20196,"City, County or Local Government Unit or Department of Transportation","Full Reporter",18351295,88,"MB","DO",13,0,null,0,null,0,null,0,null,0,null,"No"]
["Santa Barbara Metropolitan Transit District","Santa Barbara","CA",9020,90020,"Independent Public Agency or Authority of Transit Service","Full Reporter",195861,87,"MB","DO",87,1,null,0,null,1,null,0,null,0,null,"No"]
["Rio Metro Regional Transit District","Albuquerque","NM",6111,60111,"Independent Public Agency or Authority of Transit Service","Full Reporter",741318,87,"CR","PT",25,14,null,0,null,14,null,0,null,0,null,"No"]
["Rio Metro Regional Transit District","Albuquerque","NM",6111,60111,"Independent Public Agency or Authority of Transit Service","Full Reporter",741318,87,"CB","PT",5,2,null,0,null,2,null,0,null,0,null,"No"]
["Rio Metro Regional Transit District","Albuquerque","NM",6111,60111,"Independent Public Agency or Authority of Transit Service","Full Reporter",741318,87,"CB","DO",2,0,null,0,null,0,null,0,null,0,null,"No"]
["Rio Metro Regional Transit District","Albuquerque","NM",6111,60111,"Independent Public Agency or Authority of Transit Service","Full Reporter",741318,87,"MB","DO",2,0,null,0,null,0,null,0,null,0,null,"No"]
["City of Tallahassee","Tallahassee","FL",4036,40036,"City, County or Local Government Unit or Department of Transportation","Full Reporter",240223,86,"MB","DO",68,1,null,0,null,1,null,0,null,0,null,"No"]
["Brockton Area Transit Authority","Brockton","MA",1004,10004,"Independent Public Agency or Authority of Transit Service","Full Reporter",4181019,86,"MB","PT",43,1,null,0,null,1,null,0,null,0,null,"No"]
["Arlington Transit - Arlington County","Arlington","VA",3080,30080,"City, County or Local Government Unit or Department of Transportation","Full Reporter",4586770,85,"MB","PT",46,11,null,0,null,11,null,0,null,0,null,"No"]
["Ames Transit Agency dba CyRide","Ames","IA",7041,70041,"City, County or Local Government Unit or Department of Transportation","Full Reporter",60438,84,"MB","DO",77,1,null,0,null,1,null,0,null,0,null,"No"]
["Torrance Transit System","Torrance","CA",9010,90010,"City, County or Local Government Unit or Department of Transportation","Full Reporter",12150996,84,"MB","DO",48,2,null,0,null,2,null,1,null,0,null,"No"]
["Ames Transit Agency dba CyRide","Ames","IA",7041,70041,"City, County or Local Government Unit or Department of Transportation","Full Reporter",60438,84,"MB","PT",4,0,null,0,null,0,null,0,null,0,null,"No"]
["Greensboro Transit Authority","Greensboro","NC",4093,40093,"City, County or Local Government Unit or Department of Transportation","Full Reporter",311810,83,"MB","PT",41,1,null,0,null,1,null,2,null,1,null,"No"]
["MetroWest Regional Transit Authority","Framingham","MA",1118,10118,"Independent Public Agency or Authority of Transit Service","Full Reporter",4181019,83,"MB","PT",32,1,null,0,null,1,null,0,null,0,null,"No"]
["Golden Empire Transit District","Bakersfield","CA",9004,90004,"Independent Public Agency or Authority of Transit Service","Full Reporter",523994,82,"MB","DO",66,3,null,0,null,3,null,0,null,0,null,"No"]
["Marin County Transit District","San Rafael","CA",9234,90234,"Independent Public Agency or Authority of Transit Service","Full Reporter",3281212,82,"MB","PT",55,1,null,0,null,1,null,0,null,0,null,"No"]
["Greater Peoria Mass Transit District","Peoria","IL",5056,50056,"Independent Public Agency or Authority of Transit Service","Full Reporter",266921,82,"MB","DO",45,1,null,0,null,1,null,1,null,0,null,"No"]
["The Greater New Haven Transit District","Hamden","CT",1049,10049,"Independent Public Agency or Authority of Transit Service","Full Reporter",562839,82,"MB","DO",2,0,null,0,null,0,null,0,null,0,null,"No"]
["Hampton Jitney, Inc.","Southampton","NY",2217,20217,"Private-For-Profit Corporation","Full Reporter",18351295,80,"CB","DO",80,2,null,0,null,2,null,1,null,0,null,"No"]
["Chattanooga Area Regional Transportation Authority","Chattanooga","TN",4001,40001,"City, County or Local Government Unit or Department of Transportation","Full Reporter",381112,80,"MB","DO",60,1,null,0,null,1,null,0,null,0,null,"No"]
["Chatham Area Transit Authority","Savannah","GA",4025,40025,"Independent Public Agency or Authority of Transit Service","Full Reporter",260677,80,"MB","DO",52,1,null,0,null,1,null,0,null,0,null,"No"]
["Piedmont Authority for Regional Transportation","Greensboro","NC",4173,40173,"Independent Public Agency or Authority of Transit Service","Full Reporter",311810,80,"CB","PT",26,1,null,0,null,1,null,0,null,0,null,"No"]
["Chattanooga Area Regional Transportation Authority","Chattanooga","TN",4001,40001,"City, County or Local Government Unit or Department of Transportation","Full Reporter",381112,80,"IP","DO",2,2,null,0,null,2,null,1,null,0,null,"No"]
["Chatham Area Transit Authority","Savannah","GA",4025,40025,"Independent Public Agency or Authority of Transit Service","Full Reporter",260677,80,"FB","DO",2,3,null,0,null,3,null,0,null,0,null,"No"]
["County of Maui - Dept. of Transportation","Wailuku","HI",9241,90241,"City, County or Local Government Unit or Department of Transportation","Full Reporter",55934,79,"MB","PT",16,1,null,0,null,1,null,0,null,0,null,"No"]
["County of Maui - Dept. of Transportation","Wailuku","HI",9241,90241,"City, County or Local Government Unit or Department of Transportation","Full Reporter",55934,79,"CB","PT",7,0,null,0,null,0,null,0,null,0,null,"No"]
["Port Authority Transit Corporation","Lindenwold","NJ",2075,20075,"Independent Public Agency or Authority of Transit Service","Full Reporter",5441567,78,"HR","DO",78,7,null,6,null,13,null,11,null,14,null,"No"]
["Capital Area Transit System","Baton Rouge","LA",6022,60022,"Independent Public Agency or Authority of Transit Service","Full Reporter",594309,78,"MB","DO",60,1,null,0,null,1,null,0,null,0,null,"No"]
["Knoxville Area Transit","Knoxville","TN",4002,40002,"City, County or Local Government Unit or Department of Transportation","Full Reporter",558696,78,"MB","DO",59,1,null,0,null,1,null,2,null,1,null,"No"]
["StarTran","Lincoln","NE",7001,70001,"City, County or Local Government Unit or Department of Transportation","Full Reporter",258719,78,"MB","DO",56,1,null,0,null,1,null,0,null,0,null,"No"]
["Lowell Regional Transit Authority","Lowell","MA",1005,10005,"Independent Public Agency or Authority of Transit Service","Full Reporter",4181019,78,"MB","PT",42,1,null,0,null,1,null,2,null,0,null,"No"]
["Central Oklahoma Transportation and Parking Authority","Oklahoma City","OK",6017,60017,"City, County or Local Government Unit or Department of Transportation","Full Reporter",861505,77,"MB","DO",48,1,null,0,null,1,null,0,null,0,null,"No"]
["Luzerne County Transportation Authority","Kingston","PA",3015,30015,"Independent Public Agency or Authority of Transit Service","Full Reporter",381502,77,"MB","DO",32,1,null,0,null,1,null,0,null,0,null,"No"]
["Central Oklahoma Transportation and Parking Authority","Oklahoma City","OK",6017,60017,"City, County or Local Government Unit or Department of Transportation","Full Reporter",861505,77,"MB","PT",4,0,null,0,null,0,null,0,null,0,null,"No"]
["Central Oklahoma Transportation and Parking Authority","Oklahoma City","OK",6017,60017,"City, County or Local Government Unit or Department of Transportation","Full Reporter",861505,77,"FB","PT",2,4,null,0,null,4,null,0,null,0,null,"No"]
["Rockland Coaches, Inc.","Westwood","NJ",2149,20149,"Private-For-Profit Corporation","Full Reporter",18351295,75,"CB","DO",75,2,null,0,null,2,null,0,null,0,null,"No"]
["Antelope Valley Transit Authority","Lancaster","CA",9121,90121,"Independent Public Agency or Authority of Transit Service","Full Reporter",341219,75,"MB","PT",37,0,null,0,null,0,null,0,null,0,null,"No"]
["Brazos Transit District","Bryan","TX",6059,60059,"Independent Public Agency or Authority of Transit Service","Full Reporter",171345,75,"MB","DO",27,3,null,0,null,3,null,0,null,0,null,"No"]
["Antelope Valley Transit Authority","Lancaster","CA",9121,90121,"Independent Public Agency or Authority of Transit Service","Full Reporter",341219,75,"CB","PT",26,0,null,0,null,0,null,0,null,0,null,"No"]
["Port Imperial Ferry Corporation dba NY Waterway","Weehawken","NJ",2190,20190,"Private-For-Profit Corporation","Full Reporter",18351295,74,"MB","DO",62,2,null,0,null,2,null,0,null,0,null,"No"]
["Chittenden County Transportation Authority","Burlington","VT",1066,10066,"Independent Public Agency or Authority of Transit Service","Full Reporter",108740,74,"MB","DO",40,1,null,0,null,1,null,0,null,0,null,"No"]
["City of Appleton - Valley Transit","Appleton","WI",5001,50001,"City, County or Local Government Unit or Department of Transportation","Full Reporter",216154,74,"MB","DO",21,1,null,0,null,1,null,0,null,0,null,"No"]
["Chittenden County Transportation Authority","Burlington","VT",1066,10066,"Independent Public Agency or Authority of Transit Service","Full Reporter",108740,74,"CB","DO",14,1,null,0,null,1,null,0,null,0,null,"No"]
["Port Imperial Ferry Corporation dba NY Waterway","Weehawken","NJ",2190,20190,"Private-For-Profit Corporation","Full Reporter",18351295,74,"FB","DO",12,6,null,0,null,6,null,0,null,0,null,"No"]
["City of Appleton - Valley Transit","Appleton","WI",5001,50001,"City, County or Local Government Unit or Department of Transportation","Full Reporter",216154,74,"MB","PT",10,0,null,0,null,0,null,0,null,0,null,{"$f":"IF(V386&T386&R386&P386&N386<>\"\",\"Yes\",\"No\")","v":"No"}]
["The Eastern Contra Costa Transit Authority","Antioch","CA",9162,90162,"Independent Public Agency or Authority of Transit Service","Full Reporter",277634,73,"MB","PT",52,0,null,0,null,0,null,0,null,0,null,"No"]
["Southeastern Regional Transit Authority","New Bedford","MA",1006,10006,"Independent Public Agency or Authority of Transit Service","Full Reporter",149443,73,"MB","PT",51,2,null,0,null,2,null,2,null,0,null,"No"]
["Ms Coast Transportation Authority","Gulfport","MS",4014,40014,"Independent Public Agency or Authority of Transit Service","Full Reporter",208948,72,"MB","DO",17,8,null,0,null,8,null,1,null,0,null,"No"]
["Transport of Rockland","Pomona","NY",2084,20084,"City, County or Local Government Unit or Department of Transportation","Full Reporter",18351295,71,"MB","PT",52,0,null,0,null,0,null,0,null,0,null,"No"]
["Central Arkansas Transit Authority","North Little Rock","AR",6033,60033,"Independent Public Agency or Authority of Transit Service","Full Reporter",431388,71,"MB","DO",49,1,null,0,null,1,null,0,null,0,null,"No"]
["Gwinnett County Board of Commissioners","Lawrenceville","GA",4138,40138,"City, County or Local Government Unit or Department of Transportation","Full Reporter",4515419,71,"CB","PT",37,3,null,0,null,3,null,3,null,3,null,"No"]
["Gwinnett County Board of Commissioners","Lawrenceville","GA",4138,40138,"City, County or Local Government Unit or Department of Transportation","Full Reporter",4515419,71,"MB","PT",26,1,null,0,null,1,null,2,null,2,null,"No"]
["STAR Transit","Terrell","TX",6114,60114,"City, County or Local Government Unit or Department of Transportation","Full Reporter",5121892,71,"CB","DO",4,3,null,0,null,3,null,0,null,0,null,"No"]
["Central Arkansas Transit Authority","North Little Rock","AR",6033,60033,"Independent Public Agency or Authority of Transit Service","Full Reporter",431388,71,"SR","DO",3,0,null,0,null,0,null,0,null,0,null,"No"]
["STAR Transit","Terrell","TX",6114,60114,"City, County or Local Government Unit or Department of Transportation","Full Reporter",5121892,71,"MB","DO",1,0,null,0,null,0,null,0,null,0,null,"No"]
["Northern Indiana Commuter Transportation District","Chesterton","IN",5104,50104,"Independent Public Agency or Authority of Transit Service","Full Reporter",8608208,70,"CR","DO",70,13,null,6,null,19,null,7,null,1,null,"No"]
["Connecticut Department of Transportation- CTTransit Waterbury- NET","Waterbury","CT",1128,10128,"Subsidiary Unit of a Transit Agency, Reporting Separately","Full Reporter",194535,70,"MB","PT",35,0,null,0,null,0,null,0,null,0,null,"No"]
["Somerset County Transportation","Somerville","NJ",2209,20209,"City, County or Local Government Unit or Department of Transportation","Full Reporter",18351295,70,"MB","DO",10,0,null,0,null,0,null,0,null,0,null,"No"]
["Kalamazoo Metro Transit System","Kalamazoo","MI",5035,50035,"City, County or Local Government Unit or Department of Transportation","Full Reporter",209703,69,"MB","DO",28,1,null,0,null,1,null,0,null,0,null,"No"]
["Bergen County Community Transportation","Lodi","NJ",2192,20192,"City, County or Local Government Unit or Department of Transportation","Full Reporter",18351295,69,"MB","DO",4,0,null,0,null,0,null,0,null,0,null,"No"]
["Washington County Transportation Authority","Washington","PA",3111,30111,"Independent Public Agency or Authority of Transit Service","Full Reporter",1733853,68,"MB","PT",8,1,null,0,null,1,null,1,null,0,null,"No"]
["Gold Coast Transit","Oxnard","CA",9035,90035,"Independent Public Agency or Authority of Transit Service","Full Reporter",367260,67,"MB","DO",45,0,null,0,null,0,null,0,null,0,null,"No"]
["Merrimack Valley Regional Transit Authority","Haverhill","MA",1013,10013,"Independent Public Agency or Authority of Transit Service","Full Reporter",4181019,67,"MB","PT",40,3,null,0,null,3,null,5,null,0,null,"No"]
["Regional Transportation Authority","Nashville","TN",4159,40159,"Independent Public Agency or Authority of Transit Service","Full Reporter",969587,67,"CB","PT",18,0,null,0,null,0,null,0,null,0,null,"No"]
["Regional Transportation Authority","Nashville","TN",4159,40159,"Independent Public Agency or Authority of Transit Service","Full Reporter",969587,67,"CR","PT",7,6,null,0,null,6,null,0,null,0,null,"No"]
["Merrimack Valley Regional Transit Authority","Haverhill","MA",1013,10013,"Independent Public Agency or Authority of Transit Service","Full Reporter",4181019,67,"CB","PT",6,1,null,0,null,1,null,2,null,0,null,"No"]
["SouthWest Transit","Eden Prairie","MN",5221,50518,"City, County or Local Government Unit or Department of Transportation","Full Reporter",2650890,66,"MB","PT",59,4,null,0,null,4,null,7,null,0,null,"No"]
["South Florida Regional Transportation Authority","Pompano Beach","FL",4077,40077,"Independent Public Agency or Authority of Transit Service","Full Reporter",5502379,66,"CR","PT",42,18,null,0,null,18,null,27,null,2,null,"No"]
["Sonoma County Transit","Santa Rosa","CA",9089,90089,"City, County or Local Government Unit or Department of Transportation","Full Reporter",308231,66,"MB","PT",40,2,null,0,null,2,null,1,null,0,null,"No"]
["Escambia County Area Transit","Pensacola","FL",4038,40038,"City, County or Local Government Unit or Department of Transportation","Full Reporter",340067,66,"MB","PT",39,1,null,0,null,1,null,0,null,0,null,"No"]
["Winston-Salem Transit Authority - Trans-Aid of Forsyth County","Winston-Salem","NC",4012,40012,"Independent Public Agency or Authority of Transit Service","Full Reporter",391024,66,"MB","DO",36,1,null,0,null,1,null,0,null,0,null,"No"]
["South Florida Regional Transportation Authority","Pompano Beach","FL",4077,40077,"Independent Public Agency or Authority of Transit Service","Full Reporter",5502379,66,"MB","PT",24,0,null,0,null,0,null,0,null,0,null,"No"]
["Sonoma County Transit","Santa Rosa","CA",9089,90089,"City, County or Local Government Unit or Department of Transportation","Full Reporter",308231,66,"MB","DO",1,1,null,0,null,1,null,1,null,0,null,"No"]
["Livermore / Amador Valley Transit Authority","Livermore","CA",9144,90144,"Independent Public Agency or Authority of Transit Service","Full Reporter",615968,64,"MB","PT",49,5,null,0,null,5,null,6,null,13,null,"No"]
["Greater Bridgeport Transit Authority","Bridgeport","CT",1050,10050,"Independent Public Agency or Authority of Transit Service","Full Reporter",923311,64,"MB","DO",43,1,null,0,null,1,null,1,null,0,null,"No"]
["Anaheim Transportation Network","Anaheim","CA",9211,90211,"Private-Non-Profit Corporation","Full Reporter",12150996,63,"MB","PT",63,4,null,0,null,4,null,2,null,3,null,"No"]
["Modesto Area Express","Modesto","CA",9007,90007,"City, County or Local Government Unit or Department of Transportation","Full Reporter",358172,63,"MB","PT",46,1,null,0,null,1,null,0,null,0,null,"No"]
["Stark Area Regional Transit Authority","Canton","OH",5011,50011,"Independent Public Agency or Authority of Transit Service","Full Reporter",279245,63,"MB","DO",33,4,null,0,null,4,null,0,null,0,null,"No"]
["Yakima Transit","Yakima","WA",6,6,"City, County or Local Government Unit or Department of Transportation","Full Reporter",129534,63,"MB","DO",19,1,null,0,null,1,null,0,null,0,null,"No"]
["Yakima Transit","Yakima","WA",6,6,"City, County or Local Government Unit or Department of Transportation","Full Reporter",129534,63,"CB","PT",2,0,null,0,null,0,null,0,null,0,null,"No"]
["Rock Island County Metropolitan Mass Transit District","Moline ","IL",5057,50057,"Independent Public Agency or Authority of Transit Service","Full Reporter",280051,62,"MB","DO",46,3,null,0,null,3,null,1,null,0,null,"No"]
["Tompkins Consolidated Area Transit","Ithaca","NY",2145,20145,"Private-Non-Profit Corporation","Full Reporter",53661,62,"MB","DO",40,1,null,0,null,1,null,0,null,0,null,"No"]
["County of Lackawanna Transit System","Scranton","PA",3025,30025,"Independent Public Agency or Authority of Transit Service","Full Reporter",381502,62,"MB","DO",26,1,null,0,null,1,null,0,null,0,null,"No"]
["County of Lackawanna Transit System","Scranton","PA",3025,30025,"Independent Public Agency or Authority of Transit Service","Full Reporter",381502,62,"MB","PT",6,0,null,0,null,0,null,0,null,0,null,"No"]
["Rock Island County Metropolitan Mass Transit District","Moline ","IL",5057,50057,"Independent Public Agency or Authority of Transit Service","Full Reporter",280051,62,"FB","PT",3,4,null,0,null,4,null,0,null,0,null,"No"]
["Greater Lafayette Public Transportation Corporation","Lafayette","IN",5051,50051,"Independent Public Agency or Authority of Transit Service","Full Reporter",147725,61,"MB","DO",56,1,null,0,null,1,null,0,null,0,null,"No"]
["Lakeland Area Mass Transit District","Lakeland","FL",4031,40031,"Independent Public Agency or Authority of Transit Service","Full Reporter",262596,61,"MB","DO",30,2,null,0,null,2,null,0,null,0,null,"No"]
["Springfield Mass Transit District","Springfield","IL",5059,50059,"Independent Public Agency or Authority of Transit Service","Full Reporter",161316,60,"MB","DO",48,0,null,0,null,0,null,0,null,0,null,"No"]
["Valley Regional Transit","Meridian","ID",11,11,"Independent Public Agency or Authority of Transit Service","Full Reporter",349684,60,"MB","DO",40,0,null,0,null,0,null,0,null,0,null,"No"]
["Lakeland Bus Lines, Inc.","Dover","NJ",2163,20163,"Private-For-Profit Corporation","Full Reporter",18351295,59,"CB","DO",59,1,null,0,null,1,null,0,null,0,null,"No"]
["Transit Authority of Central Kentucky","Elizabethtown","KY",4191,40191,"Independent Public Agency or Authority of Transit Service","Full Reporter",73467,59,"MB","DO",5,0,null,0,null,0,null,0,null,0,null,"No"]
["Everett Transit","Everett","WA",5,5,"City, County or Local Government Unit or Department of Transportation","Full Reporter",3059393,58,"MB","DO",34,3,null,0,null,3,null,0,null,0,null,"No"]
["Alternativa de Transporte Integrado -ATI","San Juan","PR",4094,40094,"State Government Unit or Department of Transportation","Full Reporter",2148346,58,"HR","PT",32,16,null,0,null,16,null,33,null,51,null,"No"]
["Alternativa de Transporte Integrado -ATI","San Juan","PR",4094,40094,"State Government Unit or Department of Transportation","Full Reporter",2148346,58,"MB","PT",26,4,null,0,null,4,null,0,null,0,null,"No"]
["DeCamp Bus Lines","Montclair","NJ",2161,20161,"Private-For-Profit Corporation","Full Reporter",18351295,57,"CB","DO",57,0,null,0,null,0,null,0,null,0,null,"No"]
["DDOT - Progressive Transportation Services Administration","Washington","DC",3112,30112,"State Government Unit or Department of Transportation","Full Reporter",4586770,57,"MB","PT",52,0,null,0,null,0,null,0,null,0,null,"No"]
["Duluth Transit Authority","Duluth","MN",5025,50025,"Independent Public Agency or Authority of Transit Service","Full Reporter",120378,57,"MB","DO",50,2,null,0,null,2,null,4,null,0,null,"No"]
["DDOT - Progressive Transportation Services Administration","Washington","DC",3112,30112,"State Government Unit or Department of Transportation","Full Reporter",4586770,57,"SR","PT",5,0,null,0,null,0,null,0,null,0,null,"No"]
["Kanawha Valley Regional Transportation Authority","Charleston","WV",3001,30001,"Independent Public Agency or Authority of Transit Service","Full Reporter",153199,54,"MB","DO",42,3,null,0,null,3,null,1,null,0,null,"No"]
["Central Midlands Transit","Columbia","SC",4141,40141,"Independent Public Agency or Authority of Transit Service","Full Reporter",549777,54,"MB","PT",38,1,null,0,null,1,null,0,null,0,null,"No"]
["Broome County Department of Public Transportation","Vestal","NY",2003,20003,"City, County or Local Government Unit or Department of Transportation","Full Reporter",158084,54,"MB","DO",38,1,null,0,null,1,null,1,null,0,null,"No"]
["Shreveport Area Transit System","Shreveport","LA",6024,60024,"City, County or Local Government Unit or Department of Transportation","Full Reporter",298317,54,"MB","DO",36,1,null,0,null,1,null,0,null,0,null,"No"]
["Laredo Transit Management, Inc.","Laredo","TX",6009,60009,"City, County or Local Government Unit or Department of Transportation","Full Reporter",235730,54,"MB","DO",36,2,null,0,null,2,null,0,null,0,null,"No"]
["Transfort","Fort Collins","CO",8011,80011,"City, County or Local Government Unit or Department of Transportation","Full Reporter",264465,54,"MB","DO",36,3,null,0,null,3,null,0,null,0,null,"No"]
["Cambria County Transit Authority","Johnstown","PA",3012,30012,"Independent Public Agency or Authority of Transit Service","Full Reporter",69014,54,"MB","DO",32,1,null,0,null,1,null,0,null,0,null,"No"]
["Yuma County Intergovernmental Public Transportation Authority","Yuma","AZ",9233,90233,"Independent Public Agency or Authority of Transit Service","Full Reporter",135267,54,"MB","PT",19,1,null,0,null,1,null,0,null,0,null,"No"]
["Transfort","Fort Collins","CO",8011,80011,"City, County or Local Government Unit or Department of Transportation","Full Reporter",264465,54,"RB","DO",6,2,null,0,null,2,null,0,null,0,null,"No"]
["Transfort","Fort Collins","CO",8011,80011,"City, County or Local Government Unit or Department of Transportation","Full Reporter",264465,54,"MB","PT",4,0,null,0,null,0,null,0,null,0,null,"No"]
["Cambria County Transit Authority","Johnstown","PA",3012,30012,"Independent Public Agency or Authority of Transit Service","Full Reporter",69014,54,"IP","DO",2,2,null,0,null,2,null,2,null,0,null,{"$f":"IF(V450&T450&R450&P450&N450<>\"\",\"Yes\",\"No\")","v":"No"}]
["Greater Roanoke Transit Company","Roanoke","VA",3007,30007,"Other Publicly-Owned or Privately Chartered Corporation","Full Reporter",210111,53,"MB","DO",35,1,null,0,null,1,null,1,null,0,null,"No"]
["City of Elk Grove","Elk Grove","CA",9205,90205,"City, County or Local Government Unit or Department of Transportation","Full Reporter",1723634,53,"CB","PT",26,1,null,0,null,1,null,0,null,0,null,"No"]
["City of Elk Grove","Elk Grove","CA",9205,90205,"City, County or Local Government Unit or Department of Transportation","Full Reporter",1723634,53,"MB","PT",19,1,null,0,null,1,null,0,null,0,null,"No"]
["Greater Roanoke Transit Company","Roanoke","VA",3007,30007,"Other Publicly-Owned or Privately Chartered Corporation","Full Reporter",210111,53,"CB","DO",1,0,null,0,null,0,null,0,null,0,null,"No"]
["Bay Metropolitan Transit Authority","Bay City","MI",5029,50029,"Independent Public Agency or Authority of Transit Service","Full Reporter",70585,52,"MB","DO",38,1,null,0,null,1,null,0,null,0,null,"No"]
["Kenosha Transit","Kenosha","WI",5003,50003,"City, County or Local Government Unit or Department of Transportation","Full Reporter",124064,52,"MB","DO",37,1,null,0,null,1,null,0,null,0,null,"No"]
["St. Cloud Metropolitan Transit Commission","St. Cloud","MN",5028,50028,"Independent Public Agency or Authority of Transit Service","Full Reporter",110621,52,"MB","DO",27,2,null,0,null,2,null,0,null,0,null,"No"]
["Portage Area Regional Transportation Authority","Kent","OH",5021,50021,"Independent Public Agency or Authority of Transit Service","Full Reporter",569499,52,"MB","DO",25,2,null,0,null,2,null,2,null,0,null,"No"]
["St. Cloud Metropolitan Transit Commission","St. Cloud","MN",5028,50028,"Independent Public Agency or Authority of Transit Service","Full Reporter",110621,52,"CB","DO",4,1,null,0,null,1,null,0,null,0,null,"No"]
["Kenosha Transit","Kenosha","WI",5003,50003,"City, County or Local Government Unit or Department of Transportation","Full Reporter",124064,52,"SR","DO",3,0,null,0,null,0,null,0,null,0,null,"No"]
["University of Georgia Transit System","Athens","GA",4180,40180,"University","Full Reporter",128754,51,"MB","DO",45,0,null,0,null,0,null,0,null,0,null,"No"]
["Transit Joint Powers Authority for Merced County","Merced","CA",9173,90173,"Independent Public Agency or Authority of Transit Service","Full Reporter",136969,51,"MB","PT",40,3,null,0,null,3,null,0,null,0,null,"No"]
["Western Reserve Transit Authority","Youngstown","OH",5024,50024,"Independent Public Agency or Authority of Transit Service","Full Reporter",387550,51,"MB","DO",35,1,null,0,null,1,null,0,null,0,null,"No"]
["Rockford Mass Transit District","Rockford","IL",5058,50058,"Independent Public Agency or Authority of Transit Service","Full Reporter",296863,51,"MB","DO",25,2,null,0,null,2,null,0,null,0,null,"No"]
["Trans-Bridge Lines, Inc.","Bethlehem","PA",2169,20169,"Private-For-Profit Corporation","Full Reporter",18351295,50,"CB","DO",50,5,null,0,null,5,null,0,null,0,null,"No"]
["Eau Claire Transit","Eau Claire","WI",5099,50099,"City, County or Local Government Unit or Department of Transportation","Full Reporter",102852,50,"MB","DO",16,1,null,0,null,1,null,0,null,0,null,"No"]
["Orange-Newark-Elizabeth, Inc.","Elizabeth","NJ",2166,20166,"Private-For-Profit Corporation","Full Reporter",18351295,49,"MB","DO",49,1,null,0,null,1,null,3,null,1,null,"No"]
["City of Gardena Transportation Department","Gardena","CA",9042,90042,"City, County or Local Government Unit or Department of Transportation","Full Reporter",12150996,49,"MB","DO",43,1,null,0,null,1,null,0,null,0,null,"No"]
["Concho Valley Transit District","San Angelo","TX",6102,60102,"Independent Public Agency or Authority of Transit Service","Full Reporter",92984,49,"MB","DO",7,1,null,0,null,1,null,0,null,0,null,"No"]
["Western Piedmont Regional Transit Authority","Conover","NC",4172,40172,"Independent Public Agency or Authority of Transit Service","Full Reporter",212195,49,"MB","DO",6,1,null,0,null,1,null,0,null,0,null,"No"]
["West Virginia University - Morgantown Personal Rapid Transit","Morgantown","WV",3107,30107,"University","Full Reporter",70350,48,"MG","DO",48,7,null,0,null,7,null,7,null,0,null,"No"]
["Yolo County Transportation District","Woodland","CA",9090,90090,"Independent Public Agency or Authority of Transit Service","Full Reporter",1723634,48,"MB","PT",39,0,null,0,null,0,null,0,null,0,null,"No"]
["Lower Rio Grande Valley Development Council","Weslaco","TX",6090,60090,"MPO, COG or Other Planning Agency","Full Reporter",728825,48,"CB","DO",26,3,null,1,null,4,null,0,null,0,null,"No"]
["The Wave Transit System","Mobile","AL",4043,40043,"City, County or Local Government Unit or Department of Transportation","Full Reporter",326183,48,"MB","DO",23,1,null,0,null,1,null,0,null,0,null,"No"]
["Lower Rio Grande Valley Development Council","Weslaco","TX",6090,60090,"MPO, COG or Other Planning Agency","Full Reporter",728825,48,"MB","DO",17,3,null,1,null,4,null,0,null,0,null,"No"]
["Western Contra Costa Transit Authority","Pinole","CA",9159,90159,"Independent Public Agency or Authority of Transit Service","Full Reporter",3281212,47,"MB","PT",32,3,null,0,null,3,null,2,null,2,null,"No"]
["Butte County Association of Governments","Chico","CA",9208,90208,"MPO, COG or Other Planning Agency","Full Reporter",98176,47,"MB","PT",26,0,null,0,null,0,null,0,null,0,null,"No"]
["Central Oregon Intergovernmental Council","Bend","OR",57,57,"MPO, COG or Other Planning Agency","Full Reporter",83794,47,"CB","DO",14,1,null,0,null,1,null,0,null,0,null,"No"]
["Central Oregon Intergovernmental Council","Bend","OR",57,57,"MPO, COG or Other Planning Agency","Full Reporter",83794,47,"MB","PT",12,1,null,0,null,1,null,0,null,0,null,"No"]
["Western Contra Costa Transit Authority","Pinole","CA",9159,90159,"Independent Public Agency or Authority of Transit Service","Full Reporter",3281212,47,"CB","PT",6,2,null,0,null,2,null,0,null,0,null,"No"]
["Central Oregon Intergovernmental Council","Bend","OR",57,57,"MPO, COG or Other Planning Agency","Full Reporter",83794,47,"MB","DO",1,0,null,0,null,0,null,0,null,0,null,"No"]
["Culver City Municipal Bus Lines","Culver City","CA",9039,90039,"City, County or Local Government Unit or Department of Transportation","Full Reporter",12150996,46,"MB","DO",44,0,null,0,null,0,null,0,null,0,null,"No"]
["South Bend Public Transportation Corporation","South Bend","IN",5052,50052,"Independent Public Agency or Authority of Transit Service","Full Reporter",278165,46,"MB","DO",35,2,null,0,null,2,null,2,null,0,null,"No"]
["Fort Bend County Public Transportation","Sugar Land","TX",6103,60103,"City, County or Local Government Unit or Department of Transportation","Full Reporter",4944332,46,"CB","PT",20,0,null,0,null,0,null,0,null,0,null,"No"]
["Okaloosa County Board of County Commissioners","Fort Walton Beach","FL",4128,40128,"City, County or Local Government Unit or Department of Transportation","Full Reporter",191917,46,"MB","PT",13,0,null,0,null,0,null,0,null,0,null,"No"]
["Fort Bend County Public Transportation","Sugar Land","TX",6103,60103,"City, County or Local Government Unit or Department of Transportation","Full Reporter",4944332,46,"MB","PT",5,0,null,0,null,0,null,0,null,0,null,"No"]
["Manatee County Area Transit","Bradenton","FL",4026,40026,"City, County or Local Government Unit or Department of Transportation","Full Reporter",643260,45,"MB","DO",23,3,null,0,null,3,null,0,null,0,null,"No"]
["Staten Island Rapid Transit Operating Authority, dba: MTA Staten Island Railway","Staten Island","NY",2099,20099,"Independent Public Agency or Authority of Transit Service","Full Reporter",18351295,44,"HR","DO",44,4,null,18,null,22,null,1,null,0,null,"No"]
["Link Transit","Wenatchee","WA",43,43,"Independent Public Agency or Authority of Transit Service","Full Reporter",67227,44,"MB","DO",30,1,null,0,null,1,null,1,null,0,null,"No"]
["Ventura Intercity Service Transit Authority","Ventura","CA",9164,90164,"Independent Public Agency or Authority of Transit Service","Full Reporter",367260,44,"CB","PT",29,0,null,0,null,0,null,0,null,0,null,"No"]
["Jefferson Parish Department of Transit Administration","Gretna","LA",6088,60088,"City, County or Local Government Unit or Department of Transportation","Full Reporter",899703,44,"MB","PT",29,2,null,0,null,2,null,0,null,0,null,"No"]
["The Tri-County Council for the Lower Eastern Shore of Maryland","Salisbury","MD",3096,30096,"Independent Public Agency or Authority of Transit Service","Full Reporter",98081,44,"MB","DO",15,1,null,0,null,1,null,0,null,0,null,"No"]
["Ventura Intercity Service Transit Authority","Ventura","CA",9164,90164,"Independent Public Agency or Authority of Transit Service","Full Reporter",367260,44,"MB","PT",5,0,null,0,null,0,null,0,null,0,null,"No"]
["Housatonic Area Regional Transit","Danbury","CT",1051,10051,"Independent Public Agency or Authority of Transit Service","Full Reporter",168136,43,"MB","DO",28,0,null,0,null,0,null,0,null,0,null,"No"]
["Connecticut Department of Transportation","Newington","CT",1102,10102,"State Government Unit or Department of Transportation","Full Reporter",924859,43,"CR","PT",28,8,null,1,null,9,null,4,null,1,null,"No"]
["Cape Fear Public Transportation Authority","Wilmington","NC",4006,40006,"Independent Public Agency or Authority of Transit Service","Full Reporter",219957,43,"MB","PT",25,1,null,0,null,1,null,0,null,0,null,"No"]
["Napa Valley Transportation Authority","Napa","CA",9088,90088,"Independent Public Agency or Authority of Transit Service","Full Reporter",83913,43,"MB","PT",24,2,null,0,null,2,null,0,null,0,null,"No"]
["San Luis Obispo Regional Transit Authority","San Luis Obispo","CA",9206,90206,"Independent Public Agency or Authority of Transit Service","Full Reporter",59219,43,"MB","DO",22,0,null,0,null,0,null,0,null,0,null,"No"]
["Connecticut Department of Transportation","Newington","CT",1102,10102,"State Government Unit or Department of Transportation","Full Reporter",924859,43,"CB","PT",15,0,null,0,null,0,null,0,null,0,null,"No"]
["Santee Wateree Regional Transportation Authority","Sumter","SC",4100,40100,"Independent Public Agency or Authority of Transit Service","Full Reporter",73107,43,"MB","DO",11,1,null,0,null,1,null,0,null,0,null,"No"]
["Clermont Transportation Connection","Batavia","OH",5166,50166,"City, County or Local Government Unit or Department of Transportation","Full Reporter",1624827,43,"MB","DO",9,0,null,0,null,0,null,0,null,0,null,"No"]
["Clay County Council on Aging, Inc., dba Clay Transit","Green Cove Springs","FL",null,40245,"Private-Non-Profit Corporation","Full Reporter",1065219,43,"MB","DO",7,0,null,0,null,0,null,0,null,0,null,"No"]
["Napa Valley Transportation Authority","Napa","CA",9088,90088,"Independent Public Agency or Authority of Transit Service","Full Reporter",83913,43,"CB","PT",7,2,null,0,null,2,null,0,null,0,null,"No"]
["Santee Wateree Regional Transportation Authority","Sumter","SC",4100,40100,"Independent Public Agency or Authority of Transit Service","Full Reporter",73107,43,"CB","DO",7,1,null,0,null,1,null,0,null,0,null,"No"]
["Connecticut Department of Transportation - CTTRANSIT Stamford Division","Hartford","CT",1056,10056,"State Government Unit or Department of Transportation","Full Reporter",923311,42,"MB","DO",42,0,null,0,null,0,null,0,null,0,null,"No"]
["City of Rochester Public Transportation","Rochester","MN",5092,50092,"City, County or Local Government Unit or Department of Transportation","Full Reporter",107677,42,"MB","PT",37,1,null,0,null,1,null,0,null,0,null,"No"]
["Blacksburg Transit","Blacksburg","VA",3091,30091,"City, County or Local Government Unit or Department of Transportation","Full Reporter",88542,42,"MB","DO",34,0,null,0,null,0,null,0,null,0,null,"No"]
["Fort Wayne Public Transportation Corporation","Fort Wayne","IN",5044,50044,"Independent Public Agency or Authority of Transit Service","Full Reporter",313492,42,"MB","DO",30,2,null,0,null,2,null,0,null,0,null,"No"]
["Su Tran LLC dba: Sioux Area Metro","Sioux Falls","SD",8002,80002,"Private Provider Reporting on Behalf of a Public Entity","Full Reporter",156777,42,"MB","DO",22,2,null,0,null,2,null,0,null,0,null,"No"]
["Howard Transit","Ellicott City","MD",3048,30048,"City, County or Local Government Unit or Department of Transportation","Full Reporter",2203663,42,"MB","PT",17,1,null,0,null,1,null,0,null,0,null,"No"]
["City of Fairfield - Fairfield and Suisun Transit","Fairfield","CA",9092,90092,"City, County or Local Government Unit or Department of Transportation","Full Reporter",133683,42,"CB","PT",17,1,null,0,null,1,null,2,null,0,null,"No"]
["City of Fairfield - Fairfield and Suisun Transit","Fairfield","CA",9092,90092,"City, County or Local Government Unit or Department of Transportation","Full Reporter",133683,42,"MB","PT",16,1,null,0,null,1,null,2,null,0,null,"No"]
["Monroe County Transportation Authority","Scotrun","PA","3R04-012",30137,"Independent Public Agency or Authority of Transit Service","Full Reporter",54316,42,"MB","DO",10,1,null,0,null,1,null,1,null,0,null,"No"]
["Menominee Indian Tribe of Wisconsin","Keshena","WI","5T03",55228,"Tribe","Reduced Reporter",0,42,"MB","DO",10,0,null,0,null,0,null,0,null,0,null,{"$f":"IF(V514&T514&R514&P514&N514<>\"\",\"Yes\",\"No\")","v":"No"}]
["Lake County Board of County Commissioners","Tavares","FL",4158,40158,"City, County or Local Government Unit or Department of Transportation","Full Reporter",131337,42,"MB","PT",10,0,null,0,null,0,null,0,null,0,null,"No"]
["Martz Trailways","Wilkes Barre","PA",3102,30102,"Private-For-Profit Corporation","Full Reporter",18351295,41,"CB","DO",41,5,null,0,null,5,null,1,null,1,null,"No"]
["Dutchess County Division of Mass Transportation","Poughkeepsie","NY",2010,20010,"City, County or Local Government Unit or Department of Transportation","Full Reporter",423566,41,"MB","DO",26,1,null,0,null,1,null,0,null,0,null,"No"]
["City of Waukesha Transit Commission","Waukesha","WI",5096,50096,"City, County or Local Government Unit or Department of Transportation","Full Reporter",1376476,41,"MB","DO",20,2,null,0,null,2,null,3,null,2,null,"No"]
["City of Waukesha Transit Commission","Waukesha","WI",5096,50096,"City, County or Local Government Unit or Department of Transportation","Full Reporter",1376476,41,"CB","PT",13,0,null,0,null,0,null,0,null,0,null,"No"]
["Butler County Regional Transit Authority","Hamilton","OH",5157,50157,"Independent Public Agency or Authority of Transit Service","Full Reporter",1624827,41,"MB","DO",11,0,null,0,null,0,null,0,null,0,null,"No"]
["Butler County Regional Transit Authority","Hamilton","OH",5157,50157,"Independent Public Agency or Authority of Transit Service","Full Reporter",1624827,41,"CB","DO",6,0,null,0,null,0,null,0,null,0,null,"No"]
["River Bend Transit","Davenport","IA",7049,70049,"Private-Non-Profit Corporation","Full Reporter",280051,41,"MB","PT",1,0,null,0,null,0,null,0,null,0,null,"No"]
["Pennsylvania Department of Transportation","Harrisburg","PA",3057,30057,"State Government Unit or Department of Transportation","Full Reporter",5441567,40,"CR","PT",40,5,null,7,null,12,null,10,null,11,null,"No"]
["Fayetteville Area System of Transit","Fayetteville","NC",4009,40009,"City, County or Local Government Unit or Department of Transportation","Full Reporter",310282,40,"MB","DO",23,1,null,0,null,1,null,0,null,0,null,"No"]
["Solano County Transit","Vallejo","CA",9232,90232,"City, County or Local Government Unit or Department of Transportation","Full Reporter",165074,40,"MB","PT",19,2,null,0,null,2,null,0,null,0,null,"No"]
["Solano County Transit","Vallejo","CA",9232,90232,"City, County or Local Government Unit or Department of Transportation","Full Reporter",165074,40,"CB","PT",12,2,null,0,null,2,null,0,null,0,null,"No"]
["Baldwin County Commission","Bay Minette ","AL","4R01-005",40928,"City, County or Local Government Unit or Department of Transportation","Full Reporter",57383,40,"CB","DO",4,2,null,0,null,2,null,0,null,0,null,"No"]
["Fayetteville Area System of Transit","Fayetteville","NC",4009,40009,"City, County or Local Government Unit or Department of Transportation","Full Reporter",310282,40,"MB","PT",1,0,null,0,null,0,null,0,null,0,null,"No"]
["Alaska Railroad Corporation","Anchorage","AK",41,41,"State Government Unit or Department of Transportation","Full Reporter",251243,39,"AR","DO",39,11,null,0,null,11,null,2,null,2,null,"No"]
["City of Harrisonburg Department of Public Transportation","Harrisonburg","VA",3094,30094,"City, County or Local Government Unit or Department of Transportation","Full Reporter",66784,39,"MB","DO",32,0,null,0,null,0,null,0,null,0,null,"No"]
["Belle Urban System - Racine","Racine","WI",5006,50006,"City, County or Local Government Unit or Department of Transportation","Full Reporter",133700,39,"MB","DO",29,1,null,0,null,1,null,0,null,0,null,"No"]
["City of Visalia - Visalia City Coach","Visalia","CA",9091,90091,"City, County or Local Government Unit or Department of Transportation","Full Reporter",219454,39,"MB","PT",28,1,null,0,null,1,null,0,null,0,null,"No"]
["Collier Area Transit","Naples","FL",4140,40140,"City, County or Local Government Unit or Department of Transportation","Full Reporter",310298,39,"MB","PT",17,2,null,0,null,2,null,1,null,0,null,"No"]
["Anne Arundel County","Annapolis","MD","3R03-018",30129,"City, County or Local Government Unit or Department of Transportation","Full Reporter",2203663,39,"MB","PT",5,0,null,0,null,0,null,0,null,0,null,"No"]
["Belle Urban System - Racine","Racine","WI",5006,50006,"City, County or Local Government Unit or Department of Transportation","Full Reporter",133700,39,"CB","PT",3,1,null,0,null,1,null,0,null,0,null,"No"]
["City of Visalia - Visalia City Coach","Visalia","CA",9091,90091,"City, County or Local Government Unit or Department of Transportation","Full Reporter",219454,39,"CB","PT",3,0,null,0,null,0,null,0,null,0,null,"No"]
["Valley Metro Rail, Inc.","Phoenix","AZ",9209,90209,"Other Publicly-Owned or Privately Chartered Corporation","Full Reporter",3629114,38,"LR","PT",38,40,null,0,null,40,null,1,null,1,null,"No"]
["University of Michigan Parking and Transportation Services","Ann Arbor","MI",5158,50158,"University","Full Reporter",306022,38,"MB","DO",38,0,null,0,null,0,null,0,null,0,null,"No"]
["Bloomington Public Transportation Corporation","Bloomington","IN",5110,50110,"Independent Public Agency or Authority of Transit Service","Full Reporter",108657,38,"MB","DO",30,1,null,0,null,1,null,0,null,0,null,"No"]
["Santa Fe Trails - City of Santa Fe","Santa Fe","NM",6077,60077,"City, County or Local Government Unit or Department of Transportation","Full Reporter",89284,38,"MB","DO",26,2,null,0,null,2,null,0,null,0,null,"No"]
["Green Bay Metro","Green Bay","WI",5002,50002,"City, County or Local Government Unit or Department of Transportation","Full Reporter",206520,38,"MB","DO",25,1,null,0,null,1,null,0,null,0,null,"No"]
["Beaver County Transit Authority","Rochester","PA",3023,30023,"Independent Public Agency or Authority of Transit Service","Full Reporter",1733853,38,"MB","DO",20,2,null,0,null,2,null,2,null,0,null,"No"]
["Rogue Valley Transportation District","Medford","OR",34,34,"Independent Public Agency or Authority of Transit Service","Full Reporter",154081,38,"MB","DO",18,1,null,0,null,1,null,0,null,0,null,"No"]
["Placer County Department of Public Works and Facilities","Auburn","CA",9196,90196,"City, County or Local Government Unit or Department of Transportation","Full Reporter",1723634,38,"MB","DO",15,1,null,0,null,1,null,0,null,0,null,"No"]
["Placer County Department of Public Works and Facilities","Auburn","CA",9196,90196,"City, County or Local Government Unit or Department of Transportation","Full Reporter",1723634,38,"CB","PT",4,0,null,0,null,0,null,0,null,0,null,"No"]
["Buncombe County","Asheville ","NC",4224,40224,"City, County or Local Government Unit or Department of Transportation","Full Reporter",280648,38,"MB","PT",3,0,null,0,null,0,null,0,null,0,null,"No"]
["Placer County Department of Public Works and Facilities","Auburn","CA",9196,90196,"City, County or Local Government Unit or Department of Transportation","Full Reporter",1723634,38,"MB","PT",1,0,null,0,null,0,null,0,null,0,null,"No"]
["City of Rome Transit Department","Rome","GA",4058,40058,"City, County or Local Government Unit or Department of Transportation","Full Reporter",60851,37,"MB","DO",31,0,null,0,null,0,null,0,null,0,null,"No"]
["City of Plymouth","City of Plymouth","MN",5219,50516,"City, County or Local Government Unit or Department of Transportation","Full Reporter",2650890,37,"MB","PT",29,2,null,0,null,2,null,1,null,0,null,"No"]
["City of Columbia","Columbia","MO",7016,70016,"City, County or Local Government Unit or Department of Transportation","Full Reporter",124748,37,"MB","DO",28,1,null,0,null,1,null,0,null,0,null,"No"]
["Greater Lynchburg Transit Company","Lynchburg","VA",3008,30008,"Independent Public Agency or Authority of Transit Service","Full Reporter",116636,37,"MB","DO",28,1,null,0,null,1,null,1,null,0,null,"No"]
["The Tri-State Transit Authority","Huntington","WV",3002,30002,"Independent Public Agency or Authority of Transit Service","Full Reporter",202637,37,"MB","DO",27,1,null,0,null,1,null,0,null,0,null,"No"]
["Metropolitan Evansville Transit System","Evansville","IN",5043,50043,"City, County or Local Government Unit or Department of Transportation","Full Reporter",229351,37,"MB","DO",24,1,null,0,null,1,null,0,null,0,null,"No"]
["Topeka Metropolitan Transit Authority","Topeka","KS",7014,70014,"Independent Public Agency or Authority of Transit Service","Full Reporter",150003,37,"MB","DO",22,1,null,0,null,1,null,0,null,0,null,"No"]
["Williamsburg Area Transit Authority","Williamsburg","VA",3076,30076,"Independent Public Agency or Authority of Transit Service","Full Reporter",75689,37,"MB","DO",20,1,null,0,null,1,null,0,null,0,null,"No"]
["City of Lawrence","Lawrence","KS",7048,70048,"City, County or Local Government Unit or Department of Transportation","Full Reporter",88053,37,"MB","PT",18,0,null,0,null,0,null,0,null,0,null,"No"]
["Williamsburg Area Transit Authority","Williamsburg","VA",3076,30076,"Independent Public Agency or Authority of Transit Service","Full Reporter",75689,37,"MB","PT",13,0,null,0,null,0,null,0,null,0,null,"No"]
["Unitrans - City of Davis/ASUCD","Davis","CA",9142,90142,"University","Full Reporter",72794,36,"MB","DO",36,0,null,0,null,0,null,0,null,0,null,"No"]
["Muncie Indiana Transit System","Muncie","IN",5054,50054,"City, County or Local Government Unit or Department of Transportation","Full Reporter",90580,36,"MB","DO",26,1,null,0,null,1,null,0,null,0,null,"No"]
["Bloomington-Normal Public Transit System","Normal","IL",5047,50047,"Independent Public Agency or Authority of Transit Service","Full Reporter",132600,36,"MB","DO",23,1,null,0,null,1,null,3,null,0,null,"No"]
["Tahoe Transportation District","Zephyr Cove","NV","9R02-137",91092,"Independent Public Agency or Authority of Transit Service","Full Reporter",210000,36,"MB","PT",21,3,null,0,null,3,null,2,null,0,null,"No"]
["Transit Services of Frederick County","Frederick","MD",3072,30072,"City, County or Local Government Unit or Department of Transportation","Full Reporter",141576,36,"MB","DO",18,1,null,0,null,1,null,0,null,0,null,"No"]
["Tahoe Transportation District","Zephyr Cove","NV","9R02-137",91092,"Independent Public Agency or Authority of Transit Service","Full Reporter",210000,36,"CB","PT",8,2,null,0,null,2,null,2,null,0,null,"No"]
["City of Fargo, DBA: Metropolitan Area Transit","Fargo","ND",8003,80003,"City, County or Local Government Unit or Department of Transportation","Full Reporter",176676,35,"MB","PT",23,2,null,0,null,2,null,1,null,0,null,"No"]
["Bay County Transportation Planning Organization","Panama City","FL",4185,40185,"MPO, COG or Other Planning Agency","Full Reporter",143280,35,"MB","PT",11,1,null,0,null,1,null,0,null,0,null,"No"]
["City of Glendale","Glendale","CA",null,99423,"City, County or Local Government Unit or Department of Transportation","Full Reporter",12150996,34,"MB","PT",28,0,null,0,null,0,null,0,null,0,null,"No"]
["Woods Hole, Martha's Vineyard and Nantucket Steamship Authority","Woods Hole","MA",null,10183,"Independent Public Agency or Authority of Transit Service","Full Reporter",246695,34,"MB","DO",24,3,null,0,null,3,null,0,null,0,null,"No"]
["City of Santa Rosa","Santa Rosa","CA",9017,90017,"City, County or Local Government Unit or Department of Transportation","Full Reporter",308231,34,"MB","DO",23,2,null,0,null,2,null,0,null,0,null,"No"]
["Altoona Metro Transit","Altoona","PA",3011,30011,"Independent Public Agency or Authority of Transit Service","Full Reporter",79930,34,"MB","DO",21,1,null,0,null,1,null,0,null,0,null,"No"]
["Yuba-Sutter Transit Authority","Marysville","CA",9061,90061,"Independent Public Agency or Authority of Transit Service","Full Reporter",116719,34,"MB","PT",14,0,null,0,null,0,null,0,null,0,null,"No"]
["Woods Hole, Martha's Vineyard and Nantucket Steamship Authority","Woods Hole","MA",null,10183,"Independent Public Agency or Authority of Transit Service","Full Reporter",246695,34,"FB","DO",10,5,null,0,null,5,null,4,null,0,null,"No"]
["Yuba-Sutter Transit Authority","Marysville","CA",9061,90061,"Independent Public Agency or Authority of Transit Service","Full Reporter",116719,34,"CB","PT",10,0,null,0,null,0,null,0,null,0,null,"No"]
["City of Santa Rosa","Santa Rosa","CA",9017,90017,"City, County or Local Government Unit or Department of Transportation","Full Reporter",308231,34,"MB","PT",1,1,null,0,null,1,null,0,null,0,null,"No"]
["Missoula Urban Transportation District","Missoula","MT",8009,80009,"Independent Public Agency or Authority of Transit Service","Full Reporter",82157,33,"MB","DO",24,1,null,0,null,1,null,1,null,0,null,"No"]
["City of Brownsville - Brownsville Metro","Brownsville","TX",6014,60014,"City, County or Local Government Unit or Department of Transportation","Full Reporter",217585,33,"MB","DO",19,3,null,0,null,3,null,2,null,0,null,"No"]
["Council on Aging of St. Lucie, Inc.","Fort Pierce","FL",4097,40097,"Private Provider Reporting on Behalf of a Public Entity","Full Reporter",376047,33,"MB","DO",9,1,null,0,null,1,null,0,null,0,null,"No"]
["Washington County Transit","West Bend","WI",5160,50160,"City, County or Local Government Unit or Department of Transportation","Full Reporter",1376476,33,"CB","PT",8,0,null,0,null,0,null,0,null,0,null,"No"]
["City of Brownsville - Brownsville Metro","Brownsville","TX",6014,60014,"City, County or Local Government Unit or Department of Transportation","Full Reporter",217585,33,"CB","PT",6,0,null,0,null,0,null,0,null,0,null,{"$f":"IF(V578&T578&R578&P578&N578<>\"\",\"Yes\",\"No\")","v":"No"}]
["North Carolina State University Transportation Department","Raleigh","NC",4147,40147,"University","Full Reporter",884891,32,"MB","PT",32,0,null,0,null,0,null,0,null,0,null,"No"]
["Monsey New Square Trails Corporation","Spring Valley","NY",2135,20135,"Private-For-Profit Corporation","Full Reporter",18351295,32,"CB","DO",32,0,null,0,null,0,null,0,null,0,null,"No"]
["The Woodlands Township","The Woodlands","TX",6134,60134,"City, County or Local Government Unit or Department of Transportation","Full Reporter",239938,32,"CB","PT",30,3,null,0,null,3,null,0,null,0,null,"No"]
["Saginaw Transit Authority Regional Service","Saginaw","MI",5039,50039,"Independent Public Agency or Authority of Transit Service","Full Reporter",126265,32,"MB","DO",28,1,null,0,null,1,null,0,null,0,null,"No"]
["Northern Arizona Intergovernmental Public Transportation Authority","Flagstaff","AZ",9219,90219,"Independent Public Agency or Authority of Transit Service","Full Reporter",71957,32,"MB","DO",18,0,null,0,null,0,null,0,null,0,null,"No"]
["City of Huntsville, Alabama - Public Transportation Division","Huntsville","AL",4071,40071,"City, County or Local Government Unit or Department of Transportation","Full Reporter",286692,32,"MB","DO",13,2,null,0,null,2,null,2,null,1,null,"No"]
["Western Maine Transportation Services, Inc.","Auburn","ME",1098,10098,"Private-Non-Profit Corporation","Full Reporter",59397,32,"MB","DO",12,0,null,0,null,0,null,0,null,0,null,"No"]
["El Dorado County Transit Authority","Diamond Springs","CA",9229,90229,"Independent Public Agency or Authority of Transit Service","Full Reporter",1723634,32,"CB","DO",11,0,null,0,null,0,null,0,null,0,null,"No"]
["Fayette Area Coordinated Transportation","Lemont Furnace","PA",3087,30087,"City, County or Local Government Unit or Department of Transportation","Full Reporter",51370,32,"MB","DO",7,1,null,0,null,1,null,1,null,0,null,"No"]
["El Dorado County Transit Authority","Diamond Springs","CA",9229,90229,"Independent Public Agency or Authority of Transit Service","Full Reporter",1723634,32,"MB","DO",6,0,null,0,null,0,null,0,null,0,null,"No"]
["Fayette Area Coordinated Transportation","Lemont Furnace","PA",3087,30087,"City, County or Local Government Unit or Department of Transportation","Full Reporter",51370,32,"MB","PT",3,1,null,0,null,1,null,0,null,0,null,"No"]
["The Woodlands Township","The Woodlands","TX",6134,60134,"City, County or Local Government Unit or Department of Transportation","Full Reporter",239938,32,"MB","PT",2,0,null,0,null,0,null,0,null,0,null,"No"]
["Billings Metropolitan Transit","Billings","MT",8004,80004,"City, County or Local Government Unit or Department of Transportation","Full Reporter",114773,31,"MB","DO",20,2,null,0,null,2,null,0,null,0,null,"No"]
["Decatur Public Transit System","Decatur","IL",5061,50061,"City, County or Local Government Unit or Department of Transportation","Full Reporter",93863,31,"MB","DO",19,1,null,0,null,1,null,0,null,0,null,"No"]
["LaCrosse Municipal Transit Utility","La Crosse","WI",5004,50004,"City, County or Local Government Unit or Department of Transportation","Full Reporter",100868,30,"MB","DO",16,1,null,0,null,1,null,0,null,0,null,"No"]
["Virgin Islands Department of Public Works","St. Thomas","VI",4188,40188,"State Government Unit or Department of Transportation","Reduced Reporter",106405,30,"MB","DO",16,0,null,0,null,0,null,1,null,0,null,"No"]
["Meadowlands Transportation Brokerage Corporation, dba Meadowlink","Wood Ridge","NJ",2197,20197,"Private-Non-Profit Corporation","Reduced Reporter",18351295,30,"MB","DO",11,0,null,0,null,0,null,0,null,0,null,"No"]
["GO Transit","Oshkosh","WI",5009,50009,"City, County or Local Government Unit or Department of Transportation","Full Reporter",74495,30,"MB","DO",9,1,null,0,null,1,null,0,null,0,null,"No"]
["Ozaukee County Transit Services","Port Washington","WI",5161,50161,"City, County or Local Government Unit or Department of Transportation","Full Reporter",1376476,30,"CB","DO",7,1,null,0,null,1,null,1,null,2,null,"No"]
["City of Kokomo","Kokomo","IN",5145,50145,"City, County or Local Government Unit or Department of Transportation","Full Reporter",62182,30,"MB","DO",5,1,null,0,null,1,null,0,null,0,null,"No"]
["Carroll County Department of Public Works","Westminster","MD",3092,30092,"City, County or Local Government Unit or Department of Transportation","Reduced Reporter",72714,30,"MB","PT",4,0,null,0,null,0,null,0,null,0,null,"No"]
["Gaston County","Gastonia","NC",4221,40221,"City, County or Local Government Unit or Department of Transportation","Reduced Reporter",169495,30,"MB","DO",2,1,null,0,null,1,null,0,null,0,null,"No"]
["Lee-Russell Council of Governments","Opelika","AL",4073,40073,"MPO, COG or Other Planning Agency","Reduced Reporter",74741,30,"MB","DO",2,0,null,0,null,0,null,0,null,0,null,"No"]
["GO Transit","Oshkosh","WI",5009,50009,"City, County or Local Government Unit or Department of Transportation","Full Reporter",74495,30,"MB","PT",1,1,null,0,null,1,null,0,null,0,null,"No"]
["Jalbert Leasing, Inc.","Portsmouth","NH",1122,10122,"Private-For-Profit Corporation","Reduced Reporter",88200,29,"CB","DO",29,3,null,0,null,3,null,0,null,0,null,"No"]
["New York City Department of Transportation","New York","NY",2082,20082,"City, County or Local Government Unit or Department of Transportation","Full Reporter",18351295,29,"MB","PT",25,1,null,0,null,1,null,0,null,0,null,"No"]
["Cedar Rapids Transit","Cedar Rapids","IA",7008,70008,"City, County or Local Government Unit or Department of Transportation","Full Reporter",177844,29,"MB","DO",22,1,null,0,null,1,null,1,null,0,null,"No"]
["City of Pasadena","Pasadena","CA",null,99424,"City, County or Local Government Unit or Department of Transportation","Reduced Reporter",12150996,29,"MB","PT",19,0,null,0,null,0,null,0,null,0,null,"No"]
["Indian River County","Vero Beach","FL",4104,40104,"City, County or Local Government Unit or Department of Transportation","Full Reporter",149422,29,"MB","PT",16,0,null,0,null,0,null,0,null,0,null,"No"]
["Redding Area Bus Authority","Redding","CA",9093,90093,"Independent Public Agency or Authority of Transit Service","Full Reporter",117731,29,"MB","PT",13,1,null,0,null,1,null,0,null,0,null,"No"]
["New York City Department of Transportation","New York","NY",2082,20082,"City, County or Local Government Unit or Department of Transportation","Full Reporter",18351295,29,"FB","DO",4,2,null,0,null,2,null,7,null,6,null,"No"]
["Cape Girardeau County Transit Authority","Cape Girardeau","MO",7051,70051,"Independent Public Agency or Authority of Transit Service","Reduced Reporter",52900,29,"MB","DO",3,0,null,0,null,0,null,0,null,0,null,"No"]
["Central Indiana Regional Transportation Authority","Indianapolis","IN",5209,50209,"Independent Public Agency or Authority of Transit Service","Reduced Reporter",1487483,29,"CB","PT",3,0,null,0,null,0,null,0,null,0,null,"No"]
["City of San Juan","San Juan","PR",4112,40112,"City, County or Local Government Unit or Department of Transportation","Reduced Reporter",2148346,28,"MB","DO",28,4,null,0,null,4,null,2,null,4,null,"No"]
["A&C Bus Corporation & Montgomery & Westside Owners Association","Jersey City","NJ",2219,20219,"Private-For-Profit Corporation","Reduced Reporter",18351295,28,"MB","DO",28,0,null,0,null,0,null,0,null,0,null,"No"]
["Laguna Beach Municipal Transit","Laguna Beach","CA",9119,90119,"City, County or Local Government Unit or Department of Transportation","Full Reporter",583681,28,"MB","DO",28,0,null,0,null,0,null,0,null,0,null,"No"]
["University of Iowa","Iowa City","IA",7019,70019,"University","Full Reporter",106621,28,"MB","DO",25,0,null,0,null,0,null,0,null,0,null,"No"]
["Santa Maria Area Transit","Santa Maria","CA",9087,90087,"City, County or Local Government Unit or Department of Transportation","Full Reporter",130447,28,"MB","PT",19,1,null,0,null,1,null,0,null,0,null,"No"]
["Flint Hills Area Transportation","Manhattan","KS",7053,70053,"Private-Non-Profit Corporation","Reduced Reporter",54622,28,"MB","DO",16,0,null,0,null,0,null,0,null,0,null,"No"]
["Ozark Regional Transit","Springdale","AR",6072,60072,"Independent Public Agency or Authority of Transit Service","Full Reporter",295083,28,"MB","DO",16,0,null,0,null,0,null,0,null,0,null,"No"]
["Jackson County Mass Transit District","Carbondale","IL",5204,50204,"Independent Public Agency or Authority of Transit Service","Reduced Reporter",67821,28,"MB","DO",14,0,null,0,null,0,null,0,null,0,null,"No"]
["The Gulf Coast Center","Texas City","TX",6082,60082,"Independent Public Agency or Authority of Transit Service","Full Reporter",106383,28,"MB","DO",12,0,null,0,null,0,null,0,null,0,null,"No"]
["City of Pocatello","Pocatello","ID",22,22,"City, County or Local Government Unit or Department of Transportation","Reduced Reporter",69809,28,"MB","DO",11,1,null,0,null,1,null,0,null,0,null,"No"]
["Golden Crescent Regional Planning Commission","Victoria","TX",6095,60095,"MPO, COG or Other Planning Agency","Reduced Reporter",63683,28,"MB","DO",11,1,null,0,null,1,null,0,null,0,null,"No"]
["Thousand Oaks Transit","Thousand Oaks","CA",9165,90165,"City, County or Local Government Unit or Department of Transportation","Reduced Reporter",214811,28,"MB","PT",7,1,null,0,null,1,null,0,null,0,null,"No"]
["East Alabama Regional Planning and Development Commission","Anniston","AL",4064,40064,"MPO, COG or Other Planning Agency","Reduced Reporter",79796,28,"MB","PT",4,1,null,0,null,1,null,0,null,0,null,"No"]
["Iredell County Area Transportation Services","Statesville","NC",4205,40205,"City, County or Local Government Unit or Department of Transportation","Reduced Reporter",1249442,28,"MB","DO",3,0,null,0,null,0,null,0,null,0,null,"No"]
["Cape May County Fare Free Transportation","Cape May Court House","NJ",2203,20203,"City, County or Local Government Unit or Department of Transportation","Reduced Reporter",51291,28,"MB","DO",1,0,null,0,null,0,null,0,null,0,null,"No"]
["Palos Verdes Peninsula Transit Authority","Palos Verdes Peninsula","CA",null,90287,"Independent Public Agency or Authority of Transit Service","Reduced Reporter",12150996,27,"MB","PT",21,0,null,0,null,0,null,0,null,0,null,"No"]
["City of Montgomery-Montgomery Area Transit System","Montgomery","AL",4044,40044,"City, County or Local Government Unit or Department of Transportation","Full Reporter",263907,27,"MB","DO",19,3,null,0,null,3,null,3,null,0,null,"No"]
["Cleveland Area Rapid Transit"," Norman","OK",6096,60096,"City, County or Local Government Unit or Department of Transportation","Reduced Reporter",103898,27,"MB","DO",17,2,null,0,null,2,null,0,null,0,null,"No"]
["Stanislaus County Public Works - Transit","Modesto","CA",9236,90236,"City, County or Local Government Unit or Department of Transportation","Reduced Reporter",358172,27,"MB","PT",17,2,null,0,null,2,null,0,null,0,null,"No"]
["County Commissioners of Charles County, MD","Port Tobacco","MD",3088,30088,"City, County or Local Government Unit or Department of Transportation","Full Reporter",109919,27,"MB","PT",16,2,null,0,null,2,null,0,null,0,null,"No"]
["Johnson City Transit System","Johnson City","TN",4054,40054,"City, County or Local Government Unit or Department of Transportation","Reduced Reporter",120415,27,"MB","DO",15,1,null,0,null,1,null,1,null,0,null,"No"]
["City of Jackson, Department of Planning and Development, Transit Services Division","Jackson","MS",4015,40015,"City, County or Local Government Unit or Department of Transportation","Full Reporter",351478,27,"MB","PT",14,1,null,0,null,1,null,1,null,0,null,"No"]
["Metropolitan Transit Authority of Black Hawk County","Waterloo","IA",7013,70013,"Independent Public Agency or Authority of Transit Service","Reduced Reporter",113418,27,"MB","DO",13,1,null,0,null,1,null,0,null,0,null,"No"]
["Las Cruces Area Transit","Las Cruces","NM",6049,60049,"City, County or Local Government Unit or Department of Transportation","Reduced Reporter",128600,27,"MB","DO",13,1,null,0,null,1,null,1,null,0,null,"No"]
["Fond du Lac Area Transit","Fond du Lac","WI",5171,50171,"City, County or Local Government Unit or Department of Transportation","Reduced Reporter",54901,27,"MB","DO",7,1,null,0,null,1,null,0,null,0,null,"No"]
["Shenango Valley Shuttle Service","Hermitage","PA",3055,30055,"City, County or Local Government Unit or Department of Transportation","Full Reporter",387550,27,"MB","DO",5,1,null,0,null,1,null,0,null,0,null,"No"]
["Voluntary Action Center","Sycamore","IL",5215,50215,"Private-Non-Profit Corporation","Reduced Reporter",68545,27,"MB","DO",4,0,null,0,null,0,null,0,null,0,null,"No"]
["Handitran Special Transit Division - City of Arlington","Arlington","TX",6041,60041,"City, County or Local Government Unit or Department of Transportation","Full Reporter",5121892,27,"MB","PT",2,0,null,0,null,0,null,0,null,0,null,"No"]
["Public Transit Services","Mineral Wells","TX",6115,60115,"City, County or Local Government Unit or Department of Transportation","Reduced Reporter",5121892,27,"CB","DO",2,1,null,0,null,1,null,1,null,0,null,"No"]
["Fond du Lac Area Transit","Fond du Lac","WI",5171,50171,"City, County or Local Government Unit or Department of Transportation","Reduced Reporter",54901,27,"MB","PT",1,1,null,0,null,1,null,0,null,0,null,"No"]
["South Jersey Transportation Authority","Camden","NJ",2200,20200,"Independent Public Agency or Authority of Transit Service","Reduced Reporter",248402,26,"MB","DO",26,0,null,0,null,0,null,0,null,0,null,{"$f":"IF(V642&T642&R642&P642&N642<>\"\",\"Yes\",\"No\")","v":"No"}]
["Greater Portland Transit District","Portland","ME",1016,10016,"Independent Public Agency or Authority of Transit Service","Full Reporter",203914,26,"MB","DO",26,1,null,0,null,1,null,0,null,0,null,"No"]
["Altamont Corridor Express","Stockton","CA",9182,90182,"Independent Public Agency or Authority of Transit Service","Full Reporter",370583,26,"CR","PT",26,10,null,0,null,10,null,0,null,0,null,"No"]
["Adirondack Transit Lines, Inc,","Hurley","NY",2177,20177,"Private-For-Profit Corporation","Full Reporter",18351295,26,"CB","DO",26,10,null,0,null,10,null,0,null,0,null,"No"]
["Municipality of Carolina","Carolina","PR",4125,40125,"City, County or Local Government Unit or Department of Transportation","Reduced Reporter",2148346,26,"MB","DO",24,2,null,0,null,2,null,0,null,0,null,"No"]
["Williamsport Bureau of Transportation","Williamsport","PA",3026,30026,"City, County or Local Government Unit or Department of Transportation","Full Reporter",56142,26,"MB","DO",23,1,null,0,null,1,null,0,null,0,null,"No"]
["Sioux City Transit System","Sioux City","IA",7012,70012,"City, County or Local Government Unit or Department of Transportation","Full Reporter",106494,26,"MB","DO",21,1,null,0,null,1,null,2,null,0,null,"No"]
["Imperial County Transportation Commission","El Centro","CA",9226,90226,"Independent Public Agency or Authority of Transit Service","Full Reporter",107672,26,"MB","PT",18,3,null,0,null,3,null,0,null,0,null,"No"]
["Clarksville Transit System","Clarksville","TN",4092,40092,"City, County or Local Government Unit or Department of Transportation","Reduced Reporter",158655,26,"MB","DO",16,1,null,0,null,1,null,0,null,0,null,"No"]
["Harford Transit","Abingdon","MD",3074,30074,"City, County or Local Government Unit or Department of Transportation","Reduced Reporter",213751,26,"MB","DO",14,1,null,0,null,1,null,0,null,0,null,"No"]
["Harris County Community Services Department, Office of Transit Services","Houston","TX",6108,60108,"City, County or Local Government Unit or Department of Transportation","Reduced Reporter",4944332,26,"MB","PT",6,0,null,0,null,0,null,0,null,0,null,"No"]
["Harris County Community Services Department, Office of Transit Services","Houston","TX",6108,60108,"City, County or Local Government Unit or Department of Transportation","Reduced Reporter",4944332,26,"CB","PT",5,0,null,0,null,0,null,0,null,0,null,"No"]
["Muscogee (Creek) Nation","Okmulgee","OK","6T08",66170,"Tribe","Reduced Reporter",0,26,"MB","DO",1,0,null,0,null,0,null,0,null,0,null,"No"]
["University Of New Hampshire - University Transportation Services","Durham","NH",1119,10119,"University","Full Reporter",88087,25,"MB","DO",25,2,null,0,null,2,null,0,null,0,null,"No"]
["Athens Transit System","Athens","GA",4047,40047,"City, County or Local Government Unit or Department of Transportation","Full Reporter",128754,25,"MB","DO",22,2,null,0,null,2,null,2,null,0,null,"No"]
["Macon-Bibb County Transit Authority","Macon","GA",4130,40130,"Independent Public Agency or Authority of Transit Service","Reduced Reporter",137570,25,"MB","DO",19,1,null,0,null,1,null,4,null,0,null,"No"]
["Berkshire Regional Transit Authority","Pittsfield","MA",1007,10007,"Subsidiary Unit of a Transit Agency, Reporting Separately","Full Reporter",59124,25,"MB","PT",17,1,null,0,null,1,null,1,null,0,null,"No"]
["Waco Transit System, Inc.","Waco","TX",6012,60012,"City, County or Local Government Unit or Department of Transportation","Full Reporter",172378,25,"MB","DO",16,1,null,0,null,1,null,0,null,0,null,"No"]
["Island Transit","Galveston","TX",6015,60015,"City, County or Local Government Unit or Department of Transportation","Reduced Reporter",0,25,"MB","DO",11,1,null,0,null,1,null,2,null,0,null,"No"]
["CityLink Transit","Abilene","TX",6040,60040,"City, County or Local Government Unit or Department of Transportation","Reduced Reporter",110421,25,"MB","DO",10,1,null,0,null,1,null,0,null,0,null,"No"]
["Island Transit","Galveston","TX",6015,60015,"City, County or Local Government Unit or Department of Transportation","Reduced Reporter",0,25,"CB","DO",10,1,null,0,null,1,null,2,null,0,null,"No"]
["Town of Cary","Cary","NC",4143,40143,"City, County or Local Government Unit or Department of Transportation","Reduced Reporter",884891,25,"MB","PT",9,1,null,0,null,1,null,0,null,0,null,"No"]
["Twin Cities Area Transportation Authority","Benton Harbor","MI",5132,50132,"Independent Public Agency or Authority of Transit Service","Reduced Reporter",61022,25,"MB","DO",4,1,null,0,null,1,null,0,null,0,null,"No"]
["University of Kansas Parking & Transit","Lawrence","KS",null,70044,"University","Full Reporter",88053,24,"MB","PT",24,0,null,0,null,0,null,0,null,0,null,"No"]
["Boston Express Bus, Inc.","Concord","NH",1133,10133,"Private-For-Profit Corporation","Reduced Reporter",4181019,24,"CB","DO",24,6,null,0,null,6,null,0,null,0,null,"No"]
["Las Vegas Monorail Company","Las Vegas","NV",9242,90242,"Private-Non-Profit Corporation","Full Reporter",1886011,24,"MG","DO",24,7,null,0,null,7,null,22,null,11,null,"No"]
["Berkeley Charleston Dorchester RTMA","Moncks Corner","SC",4206,40206,"Independent Public Agency or Authority of Transit Service","Reduced Reporter",548404,24,"CB","DO",22,1,null,0,null,1,null,0,null,0,null,"No"]
["University of Minnesota Transit","Minneapolis","MN",5218,50515,"University","Full Reporter",2650890,24,"MB","PT",21,0,null,0,null,0,null,0,null,0,null,"No"]
["City Utilities of Springfield","Springfield","MO",7003,70003,"City, County or Local Government Unit or Department of Transportation","Full Reporter",273724,24,"MB","DO",20,2,null,0,null,2,null,0,null,0,null,"No"]
["Norwalk Transit System","Norwalk","CA",9022,90022,"City, County or Local Government Unit or Department of Transportation","Full Reporter",12150996,24,"MB","DO",19,0,null,0,null,0,null,0,null,0,null,"No"]
["C-TRAN","Elmira","NY",2005,20005,"City, County or Local Government Unit or Department of Transportation","Reduced Reporter",67983,24,"MB","PT",15,1,null,0,null,1,null,0,null,0,null,"No"]
["Pueblo Transit System","Pueblo","CO",8007,80007,"City, County or Local Government Unit or Department of Transportation","Full Reporter",136550,24,"MB","DO",13,1,null,0,null,1,null,0,null,0,null,"No"]
["County of Lebanon Transit Authority","Lebanon","PA",3095,30095,"Independent Public Agency or Authority of Transit Service","Full Reporter",77086,24,"MB","DO",8,1,null,0,null,1,null,0,null,0,null,"No"]
["Bis-Man Transit Board","Bismarck","ND",8019,80019,"Independent Public Agency or Authority of Transit Service","Reduced Reporter",81955,24,"MB","PT",7,1,null,0,null,1,null,0,null,0,null,"No"]
["County of Lebanon Transit Authority","Lebanon","PA",3095,30095,"Independent Public Agency or Authority of Transit Service","Full Reporter",77086,24,"CB","DO",4,1,null,0,null,1,null,0,null,0,null,"No"]
["Berkeley Charleston Dorchester RTMA","Moncks Corner","SC",4206,40206,"Independent Public Agency or Authority of Transit Service","Reduced Reporter",548404,24,"MB","DO",2,1,null,0,null,1,null,0,null,0,null,"No"]
["Community Transit, Inc.","Paramus","NJ",2160,20160,"Private-For-Profit Corporation","Reduced Reporter",18351295,23,"CB","DO",23,2,null,0,null,2,null,0,null,0,null,"No"]
["Mid Mon Valley Transit Authority","Charleroi","PA",3061,30061,"Independent Public Agency or Authority of Transit Service","Full Reporter",66086,23,"MB","PT",22,3,null,0,null,3,null,0,null,0,null,"No"]
["Municipality of Caguas Mobility Office","Caguas","PR",4115,40115,"City, County or Local Government Unit or Department of Transportation","Reduced Reporter",2148346,23,"MB","DO",21,0,null,0,null,0,null,0,null,0,null,"No"]
["Baltimore City Department of Transportation","Baltimore","MD",null,30201,"City, County or Local Government Unit or Department of Transportation","Full Reporter",2203663,23,"MB","PT",20,0,null,0,null,0,null,0,null,0,null,"No"]
["University of Arkansas, Fayetteville","Fayetteville","AR",6062,60062,"University","Reduced Reporter",295083,23,"MB","DO",19,1,null,0,null,1,null,2,null,0,null,"No"]
["Pee Dee Regional Transportation Authority","Florence","SC",4056,40056,"Independent Public Agency or Authority of Transit Service","Reduced Reporter",89557,23,"MB","DO",19,0,null,0,null,0,null,0,null,0,null,"No"]
["Eastern Panhandle Transit Authority","Martinsburg","WV",3090,30090,"Independent Public Agency or Authority of Transit Service","Reduced Reporter",182696,23,"MB","DO",19,0,null,0,null,0,null,0,null,0,null,"No"]
["Connecticut Department of Transportation - CTTransit New Britain -Dattco.","New Britain","CT",1045,10045,"Private Provider Reporting on Behalf of a Public Entity","Full Reporter",924859,23,"CB","PT",18,0,null,0,null,0,null,0,null,0,null,"No"]
["Southeast Area Transit","Preston","CT",1040,10040,"Independent Public Agency or Authority of Transit Service","Full Reporter",209190,23,"MB","DO",18,1,null,0,null,1,null,0,null,0,null,"No"]
["Shoreline Metro","Sheboygan","WI",5088,50088,"City, County or Local Government Unit or Department of Transportation","Full Reporter",71313,23,"MB","DO",17,1,null,0,null,1,null,0,null,0,null,"No"]
["Metra Transit System (Columbus, GA)","Columbus","GA",4024,40024,"City, County or Local Government Unit or Department of Transportation","Reduced Reporter",253602,23,"MB","DO",16,1,null,0,null,1,null,0,null,0,null,"No"]
["Muskegon Area Transit System","Muskegon Heights","MI",5037,50037,"City, County or Local Government Unit or Department of Transportation","Reduced Reporter",161280,23,"MB","DO",15,1,null,0,null,1,null,0,null,0,null,"No"]
["City of Lompoc - Lompoc Transit","Lompoc","CA",9149,90149,"City, County or Local Government Unit or Department of Transportation","Reduced Reporter",51509,23,"CB","PT",13,0,null,0,null,0,null,0,null,0,null,"No"]
["Roseville Transit","Roseville","CA",9168,90168,"City, County or Local Government Unit or Department of Transportation","Reduced Reporter",1723634,23,"MB","PT",10,0,null,0,null,0,null,0,null,0,null,"No"]
["Citrus County Transit","Lecanto","FL","4R02-035",41157,"City, County or Local Government Unit or Department of Transportation","Reduced Reporter",80962,23,"MB","DO",9,1,null,0,null,1,null,0,null,0,null,"No"]
["RiverCities Transit","Longview","WA",16,16,"City, County or Local Government Unit or Department of Transportation","Full Reporter",63952,23,"MB","DO",9,1,null,0,null,1,null,0,null,0,null,"No"]
["Lima Allen County Regional Transit Authority","Lima","OH",5093,50093,"Independent Public Agency or Authority of Transit Service","Reduced Reporter",72852,23,"MB","DO",8,1,null,0,null,1,null,0,null,0,null,"No"]
["Roseville Transit","Roseville","CA",9168,90168,"City, County or Local Government Unit or Department of Transportation","Reduced Reporter",1723634,23,"CB","PT",8,1,null,0,null,1,null,0,null,0,null,"No"]
["City of Lompoc - Lompoc Transit","Lompoc","CA",9149,90149,"City, County or Local Government Unit or Department of Transportation","Reduced Reporter",51509,23,"MB","PT",8,0,null,0,null,0,null,0,null,0,null,"No"]
["Connecticut Department of Transportation - CTTransit New Britain -Dattco.","New Britain","CT",1045,10045,"Private Provider Reporting on Behalf of a Public Entity","Full Reporter",924859,23,"MB","PT",5,0,null,0,null,0,null,0,null,0,null,"No"]
["Baltimore City Department of Transportation","Baltimore","MD",null,30201,"City, County or Local Government Unit or Department of Transportation","Full Reporter",2203663,23,"FB","PT",3,0,null,5,null,5,null,0,null,0,null,"No"]
["Confederated Salish and Kootenai Tribes","Pablo","MT","8T04",88134,"Tribe","Reduced Reporter",0,23,"CB","DO",2,0,null,0,null,0,null,0,null,0,null,"No"]
["Charlottesville Area Transit","Charlottesville","VA",3036,30036,"City, County or Local Government Unit or Department of Transportation","Reduced Reporter",92359,22,"MB","DO",22,1,null,0,null,1,null,1,null,0,null,"No"]
["Monongalia County Urban Mass Transit Authority","Morgantown","WV",3089,30089,"Independent Public Agency or Authority of Transit Service","Reduced Reporter",70350,22,"MB","DO",21,1,null,0,null,1,null,0,null,0,null,"No"]
["Ulster County Area Transit","Kingston","NY",2178,20178,"City, County or Local Government Unit or Department of Transportation","Full Reporter",423566,22,"MB","DO",18,3,null,0,null,3,null,2,null,0,null,"No"]
["Cache Valley Transit District","Logan","UT",8028,80028,"Independent Public Agency or Authority of Transit Service","Full Reporter",94983,22,"MB","DO",17,1,null,0,null,1,null,0,null,0,null,"No"]
["Midland-Odessa Urban Transit District","Midland","TX",6097,60097,"City, County or Local Government Unit or Department of Transportation","Reduced Reporter",126405,22,"MB","DO",12,1,null,0,null,1,null,0,null,0,null,"No"]
["Huntington Area Rapid Transit","Huntington Station","NY",2071,20071,"City, County or Local Government Unit or Department of Transportation","Full Reporter",18351295,22,"MB","DO",8,0,null,0,null,0,null,0,null,0,null,"No"]
["Tar River Transit","Rocky Mount","NC",4096,40096,"City, County or Local Government Unit or Department of Transportation","Reduced Reporter",68243,22,"MB","PT",7,1,null,0,null,1,null,1,null,0,null,{"$f":"IF(V706&T706&R706&P706&N706<>\"\",\"Yes\",\"No\")","v":"No"}]
["Midland-Odessa Urban Transit District","Midland","TX",6097,60097,"City, County or Local Government Unit or Department of Transportation","Reduced Reporter",126405,22,"CB","DO",2,1,null,0,null,1,null,0,null,0,null,"No"]
["Craven County","New Bern","NC",4210,40210,"City, County or Local Government Unit or Department of Transportation","Reduced Reporter",50503,22,"MB","DO",2,0,null,0,null,0,null,0,null,0,null,"No"]
["Iowa City Transit","Iowa City","IA",7018,70018,"City, County or Local Government Unit or Department of Transportation","Full Reporter",106621,21,"MB","DO",21,2,null,0,null,2,null,2,null,0,null,"No"]
["Fredericksburg Regional Transit","Fredericksburg","VA",3079,30079,"City, County or Local Government Unit or Department of Transportation","Reduced Reporter",141238,21,"MB","DO",21,1,null,0,null,1,null,1,null,0,null,"No"]
["Eastern Band of Cherokee Indians","Cherokee","NC","4T02",44913,"Tribe","Reduced Reporter",0,21,"MB","DO",21,0,null,0,null,0,null,0,null,0,null,"No"]
["Wausau Area Transit System","Wausau","WI",5091,50091,"City, County or Local Government Unit or Department of Transportation","Reduced Reporter",74632,21,"MB","DO",18,1,null,0,null,1,null,0,null,0,null,"No"]
["Municipality of Yauco","Yauco","PR",4174,40174,"City, County or Local Government Unit or Department of Transportation","Reduced Reporter",90899,21,"MB","DO",17,3,null,0,null,3,null,0,null,0,null,"No"]
["Kings County Area Public Transit Agency","Hanford","CA",9200,90200,"Independent Public Agency or Authority of Transit Service","Full Reporter",87941,21,"MB","PT",16,1,null,0,null,1,null,0,null,0,null,"No"]
["The Lawton Area Transit System","Lawton","OK",6094,60094,"City, County or Local Government Unit or Department of Transportation","Reduced Reporter",94457,21,"MB","DO",15,1,null,0,null,1,null,0,null,0,null,"No"]
["City of Greeley - Transit Services","Greeley","CO",8010,80010,"City, County or Local Government Unit or Department of Transportation","Reduced Reporter",117825,21,"MB","DO",14,0,null,0,null,0,null,0,null,0,null,"No"]
["Battle Creek Transit","Battle Creek","MI",5030,50030,"City, County or Local Government Unit or Department of Transportation","Reduced Reporter",78393,21,"MB","DO",14,1,null,0,null,1,null,0,null,0,null,"No"]
["Valley Transit","Walla Walla","WA",64,64,"Independent Public Agency or Authority of Transit Service","Reduced Reporter",55805,21,"MB","DO",11,1,null,0,null,1,null,0,null,0,null,"No"]
["Macatawa Area Express Transportation Authority","Holland","MI",5184,50184,"Independent Public Agency or Authority of Transit Service","Full Reporter",99941,21,"MB","DO",8,1,null,0,null,1,null,0,null,0,null,"No"]
["Benton County","Corvallis","OR",65,65,"City, County or Local Government Unit or Department of Transportation","Reduced Reporter",62433,21,"CB","PT",7,0,null,0,null,0,null,0,null,0,null,"No"]
["County of Hunterdon","Flemington","NJ",2212,20212,"City, County or Local Government Unit or Department of Transportation","Reduced Reporter",18351295,21,"MB","PT",7,0,null,0,null,0,null,0,null,0,null,"No"]
["City of Tyler","Tyler","TX",6089,60089,"City, County or Local Government Unit or Department of Transportation","Reduced Reporter",130247,21,"MB","DO",6,1,null,0,null,1,null,0,null,0,null,"No"]
["City of Radford","Radford","VA",null,30200,"City, County or Local Government Unit or Department of Transportation","Reduced Reporter",88542,20,"MB","DO",20,1,null,0,null,1,null,1,null,0,null,"No"]
["Northern New England Passenger Rail Authority","Portland","ME",1115,10115,"Independent Public Agency or Authority of Transit Service","Full Reporter",203914,20,"CR","PT",20,12,null,0,null,12,null,2,null,1,null,"No"]
["Greenville Transit Authority","Greenville","SC",4053,40053,"Independent Public Agency or Authority of Transit Service","Full Reporter",400492,20,"MB","DO",17,1,null,0,null,1,null,0,null,0,null,"No"]
["Gary Public Transportation Corporation","Gary","IN",5045,50045,"City, County or Local Government Unit or Department of Transportation","Full Reporter",8608208,20,"MB","DO",16,1,null,0,null,1,null,1,null,1,null,"No"]
["Great Falls Transit District","Great Falls","MT",8012,80012,"Independent Public Agency or Authority of Transit Service","Full Reporter",65207,20,"MB","DO",13,1,null,0,null,1,null,0,null,0,null,"No"]
["Amarillo City Transit","Amarillo","TX",6001,60001,"City, County or Local Government Unit or Department of Transportation","Reduced Reporter",196651,20,"MB","DO",12,1,null,0,null,1,null,0,null,0,null,"No"]
["Unified Government Transit Department","Kansas City","KS",7047,70047,"City, County or Local Government Unit or Department of Transportation","Reduced Reporter",1519417,20,"MB","DO",12,1,null,0,null,1,null,0,null,0,null,"No"]
["City of Jackson Transportation Authority","Jackson","MI",5034,50034,"Independent Public Agency or Authority of Transit Service","Full Reporter",90057,20,"MB","DO",10,1,null,0,null,1,null,0,null,0,null,"No"]
["Rapid Transit System","Rapid City","SD",8014,80014,"City, County or Local Government Unit or Department of Transportation","Reduced Reporter",81251,20,"MB","DO",9,0,null,0,null,0,null,0,null,0,null,"No"]
["Goldsboro-Wayne Transportation Authority","Goldsboro","NC",4132,40132,"Independent Public Agency or Authority of Transit Service","Reduced Reporter",61054,20,"MB","DO",5,1,null,0,null,1,null,0,null,0,null,"No"]
["Washington State Ferries","Seattle","WA",35,35,"State Government Unit or Department of Transportation","Full Reporter",3059393,19,"FB","DO",19,20,null,0,null,20,null,0,null,0,null,"No"]
["Mid-Ohio Valley Transit Authority","Parkersburg","WV",3003,30003,"Independent Public Agency or Authority of Transit Service","Reduced Reporter",67229,19,"MB","DO",18,1,null,0,null,1,null,1,null,0,null,"No"]
["City of Union City Transit Division","Union City","CA",9161,90161,"City, County or Local Government Unit or Department of Transportation","Reduced Reporter",3281212,19,"MB","PT",14,1,null,0,null,1,null,0,null,0,null,"No"]
["Lafayette Transit System","Lafayette","LA",6038,60038,"City, County or Local Government Unit or Department of Transportation","Full Reporter",252720,19,"MB","DO",13,1,null,0,null,1,null,1,null,0,null,"No"]
["High Point Transit","High Point","NC",4011,40011,"City, County or Local Government Unit or Department of Transportation","Reduced Reporter",166485,19,"MB","DO",12,1,null,0,null,1,null,0,null,0,null,"No"]
["Augusta Richmond County Transit Department","Augusta","GA",4023,40023,"City, County or Local Government Unit or Department of Transportation","Full Reporter",386787,19,"MB","PT",12,1,null,0,null,1,null,0,null,0,null,"No"]
["City of Dubuque","Dubuque","IA",7011,70011,"City, County or Local Government Unit or Department of Transportation","Reduced Reporter",67818,19,"MB","DO",11,1,null,0,null,1,null,1,null,0,null,"No"]
["Cape Ann Transportation Authority","Gloucester","MA",1053,10053,"Independent Public Agency or Authority of Transit Service","Full Reporter",4181019,19,"MB","PT",11,0,null,0,null,0,null,0,null,0,null,"No"]
["Municipality of Mayaguez","Mayaguez","PR",4194,40194,"City, County or Local Government Unit or Department of Transportation","Reduced Reporter",109572,19,"MB","PT",8,2,null,0,null,2,null,0,null,0,null,"No"]
["Municipality of Mayaguez","Mayaguez","PR",4194,40194,"City, County or Local Government Unit or Department of Transportation","Reduced Reporter",109572,19,"MB","DO",8,2,null,0,null,2,null,0,null,0,null,"No"]
["Targhee Regional Public Transit Authority","Idaho Falls","ID",42,42,"Independent Public Agency or Authority of Transit Service","Reduced Reporter",90733,19,"MB","DO",5,1,null,0,null,1,null,0,null,0,null,"No"]
["Rowan Transit System","Salisbury","NC",4217,40217,"City, County or Local Government Unit or Department of Transportation","Reduced Reporter",214881,19,"MB","PT",2,0,null,0,null,0,null,0,null,0,null,"No"]
["County of Carbon","Jim Thorpe","PA","3R04-002",30167,"City, County or Local Government Unit or Department of Transportation","Reduced Reporter",664651,19,"MB","PT",1,0,null,1,null,1,null,0,null,0,null,"No"]
["Davenport Public Transit","Davenport","IA",7009,70009,"City, County or Local Government Unit or Department of Transportation","Reduced Reporter",280051,18,"MB","DO",18,1,null,0,null,1,null,0,null,0,null,"No"]
["Central Florida Commuter Rail","Sanford","FL",4232,40232,"State Government Unit or Department of Transportation","Full Reporter",1510516,18,"CR","PT",18,12,null,0,null,12,null,0,null,0,null,"No"]
["Cooperative Alliance for Seacoast Transportation","Dover","NH",1086,10086,"Independent Public Agency or Authority of Transit Service","Full Reporter",88087,18,"MB","DO",14,3,null,0,null,3,null,0,null,0,null,"No"]
["Petersburg Area Transit","Petersburg","VA",3009,30009,"City, County or Local Government Unit or Department of Transportation","Reduced Reporter",953556,18,"MB","DO",13,1,null,0,null,1,null,1,null,0,null,"No"]
["South Metro Area Regional Transit","Wilsonville","OR",46,46,"City, County or Local Government Unit or Department of Transportation","Reduced Reporter",1849898,18,"MB","DO",13,2,null,0,null,2,null,0,null,0,null,"No"]
["Waccamaw Regional Transportation Authority","Conway","SC",4102,40102,"Independent Public Agency or Authority of Transit Service","Reduced Reporter",215304,18,"MB","DO",13,1,null,0,null,1,null,0,null,0,null,"No"]
["Delaware County Transit Board","Delaware","OH",5199,50199,"Independent Public Agency or Authority of Transit Service","Full Reporter",1368035,18,"MB","DO",12,0,null,0,null,0,null,0,null,0,null,"No"]
["Beaumont Municipal Transit System","Beaumont","TX",6016,60016,"City, County or Local Government Unit or Department of Transportation","Full Reporter",147922,18,"MB","PT",12,0,null,0,null,0,null,0,null,0,null,"No"]
["Southeast Tennessee Human Resource Agency -Cleveland Urban Area Transit System Division","Cleveland","TN",4170,40170,"Other Publicly-Owned or Privately Chartered Corporation","Reduced Reporter",66777,18,"MB","DO",9,1,null,0,null,1,null,0,null,0,null,"No"]
["Cities Area Transit","Grand Forks","ND",8008,80008,"City, County or Local Government Unit or Department of Transportation","Full Reporter",61270,18,"MB","DO",8,1,null,0,null,1,null,0,null,0,null,"No"]
["Davidson County Transportation","Lexington","NC",4131,40131,"City, County or Local Government Unit or Department of Transportation","Reduced Reporter",166485,18,"MB","DO",3,1,null,0,null,1,null,0,null,0,null,"No"]
["City of Glendale Transit","Glendale","AZ",9034,90034,"City, County or Local Government Unit or Department of Transportation","Full Reporter",3629114,18,"MB","DO",3,1,null,0,null,1,null,0,null,0,null,"No"]
["New River Transit Authority","Beckley","WV",null,30199,"Independent Public Agency or Authority of Transit Service","Reduced Reporter",64022,17,"MB","PT",17,0,null,0,null,0,null,0,null,0,null,"No"]
["Plymouth & Brockton Street Railway Company","Plymouth","MA",1117,10117,"Private-For-Profit Corporation","Reduced Reporter",4181019,17,"CB","DO",17,2,null,0,null,2,null,1,null,1,null,"No"]
["Greater Mankato Transit System","Mankato ","MN",5205,50205,"City, County or Local Government Unit or Department of Transportation","Reduced Reporter",57584,17,"MB","DO",14,0,null,0,null,0,null,0,null,0,null,"No"]
["River Valley Metro Mass Transit District","Bourbonnais","IL",5159,50159,"City, County or Local Government Unit or Department of Transportation","Full Reporter",81926,17,"MB","PT",13,1,null,0,null,1,null,0,null,0,null,"No"]
["Manchester Transit Authority","Manchester","NH",1002,10002,"Independent Public Agency or Authority of Transit Service","Reduced Reporter",158377,17,"MB","DO",13,0,null,0,null,0,null,0,null,0,null,"No"]
["Mesa County","Grand Junction","CO",8016,80016,"City, County or Local Government Unit or Department of Transportation","Reduced Reporter",128124,17,"MB","PT",12,2,null,0,null,2,null,1,null,0,null,"No"]
["City of Jefferson","Jefferson City","MO",7043,70043,"City, County or Local Government Unit or Department of Transportation","Reduced Reporter",58533,17,"MB","DO",9,1,null,0,null,1,null,0,null,0,null,"No"]
["St. Mary's Transit System -Dept. of Public Works and Transit","California ","MD",3109,30109,"City, County or Local Government Unit or Department of Transportation","Reduced Reporter",58875,17,"MB","DO",9,0,null,0,null,0,null,0,null,0,null,"No"]
["City of Alhambra","Alhambra","CA",null,90247,"City, County or Local Government Unit or Department of Transportation","Reduced Reporter",12150996,17,"MB","PT",9,0,null,0,null,0,null,0,null,0,null,"No"]
["City of Huntington Park","Huntington Park","CA",null,90267,"City, County or Local Government Unit or Department of Transportation","Reduced Reporter",12150996,17,"MB","PT",5,0,null,0,null,0,null,0,null,0,null,"No"]
["Medina County Public Transit","Medina","OH",5198,50198,"City, County or Local Government Unit or Department of Transportation","Full Reporter",1780673,17,"MB","DO",5,0,null,0,null,0,null,0,null,0,null,"No"]
["River Valley Metro Mass Transit District","Bourbonnais","IL",5159,50159,"City, County or Local Government Unit or Department of Transportation","Full Reporter",81926,17,"CB","PT",2,1,null,0,null,1,null,0,null,0,null,"No"]
["City of Avalon","Avalon","CA",null,90249,"City, County or Local Government Unit or Department of Transportation","Reduced Reporter",12150996,17,"MB","PT",2,1,null,0,null,1,null,0,null,0,null,{"$f":"IF(V770&T770&R770&P770&N770<>\"\",\"Yes\",\"No\")","v":"No"}]
["City of Inglewood","Inglewood","CA",null,90268,"City, County or Local Government Unit or Department of Transportation","Reduced Reporter",12150996,17,"MB","DO",1,0,null,0,null,0,null,0,null,0,null,"No"]
["St. Joseph Transit","St. Joseph","MO",7032,70032,"City, County or Local Government Unit or Department of Transportation","Reduced Reporter",81176,16,"MB","DO",16,3,null,0,null,3,null,0,null,0,null,"No"]
["City of Clemson/ Clemson Area Transit","Clemson","SC",4208,40208,"City, County or Local Government Unit or Department of Transportation","Full Reporter",400492,16,"MB","DO",16,1,null,0,null,1,null,0,null,0,null,"No"]
["ART (Asheville Redefines Transit)","Asheville","NC",4005,40005,"City, County or Local Government Unit or Department of Transportation","Full Reporter",280648,16,"MB","DO",16,1,null,0,null,1,null,0,null,0,null,"No"]
["County of Burlington","Mt. Holly","NJ",2208,20208,"City, County or Local Government Unit or Department of Transportation","Reduced Reporter",5441567,16,"MB","PT",16,0,null,0,null,0,null,0,null,0,null,"No"]
["City of Fort Lauderdale","Fort Lauderdale","FL",null,44929,"City, County or Local Government Unit or Department of Transportation","Full Reporter",5502379,16,"MB","PT",15,3,null,0,null,3,null,2,null,1,null,"No"]
["City of Portland","Portland","OR",58,58,"City, County or Local Government Unit or Department of Transportation","Full Reporter",1849898,16,"SR","PT",14,2,null,0,null,2,null,0,null,0,null,"No"]
["Janesville Transit System","Janesville","WI",5108,50108,"City, County or Local Government Unit or Department of Transportation","Reduced Reporter",69658,16,"MB","DO",14,1,null,0,null,1,null,0,null,0,null,"No"]
["Ohio Valley Regional Transportation Authority","Wheeling","WV",3035,30035,"Independent Public Agency or Authority of Transit Service","Full Reporter",81249,16,"MB","DO",14,1,null,0,null,1,null,2,null,0,null,"No"]
["City of Monroe Transit System","Monroe","LA",6026,60026,"City, County or Local Government Unit or Department of Transportation","Reduced Reporter",116533,16,"MB","DO",13,1,null,0,null,1,null,0,null,0,null,"No"]
["Richland County Transit","Mansfield","OH",5090,50090,"Independent Public Agency or Authority of Transit Service","Reduced Reporter",75250,16,"MB","PT",10,1,null,0,null,1,null,0,null,0,null,"No"]
["Fairbanks North Star Borough Transit","Fairbanks","AK",45,45,"City, County or Local Government Unit or Department of Transportation","Reduced Reporter",64513,16,"MB","DO",10,1,null,0,null,1,null,0,null,0,null,"No"]
["City of Petaluma","Petaluma","CA",9213,90213,"City, County or Local Government Unit or Department of Transportation","Full Reporter",64078,16,"MB","PT",9,0,null,0,null,0,null,0,null,0,null,"No"]
["Middletown Transit District","Middletown","CT",1063,10063,"Independent Public Agency or Authority of Transit Service","Full Reporter",924859,16,"MB","DO",9,1,null,0,null,1,null,0,null,0,null,"No"]
["Michiana Area Council of Governments","South Bend","IN",5149,50149,"MPO, COG or Other Planning Agency","Full Reporter",143592,16,"MB","PT",8,0,null,0,null,0,null,0,null,0,null,"No"]
["City of Lodi - Transit Division","Lodi","CA",9175,90175,"City, County or Local Government Unit or Department of Transportation","Full Reporter",68738,16,"MB","PT",8,1,null,0,null,1,null,2,null,0,null,"No"]
["St Johns County, Florida, Board of County Commissioners","St. Augustine","FL",4155,40155,"City, County or Local Government Unit or Department of Transportation","Reduced Reporter",69173,16,"MB","PT",8,0,null,0,null,0,null,0,null,0,null,"No"]
["Putnam County Transit","Carmel","NY",2096,20096,"City, County or Local Government Unit or Department of Transportation","Full Reporter",18351295,16,"MB","PT",8,0,null,0,null,0,null,0,null,0,null,"No"]
["Hall Area Transit","Gainesville","GA",4144,40144,"City, County or Local Government Unit or Department of Transportation","Reduced Reporter",130846,16,"MB","DO",7,1,null,0,null,1,null,0,null,0,null,"No"]
["Josephine County","Grants Pass","OR",59,59,"City, County or Local Government Unit or Department of Transportation","Reduced Reporter",50520,16,"CB","DO",7,0,null,0,null,0,null,0,null,0,null,"No"]
["City of Madera","Madera","CA",9199,90199,"City, County or Local Government Unit or Department of Transportation","Reduced Reporter",78413,16,"MB","PT",7,1,null,0,null,1,null,0,null,0,null,"No"]
["City of Downey","Downey","CA",null,90263,"City, County or Local Government Unit or Department of Transportation","Reduced Reporter",12150996,16,"MB","PT",6,1,null,0,null,1,null,0,null,0,null,"No"]
["Simi Valley Transit","Simi Valley","CA",9050,90050,"City, County or Local Government Unit or Department of Transportation","Reduced Reporter",125206,16,"MB","DO",6,0,null,0,null,0,null,0,null,0,null,"No"]
["Josephine County","Grants Pass","OR",59,59,"City, County or Local Government Unit or Department of Transportation","Reduced Reporter",50520,16,"MB","DO",4,0,null,0,null,0,null,0,null,0,null,"No"]
["City of Cleburne","Cleburne","TX",6113,60113,"City, County or Local Government Unit or Department of Transportation","Reduced Reporter",5121892,16,"CB","DO",2,2,null,0,null,2,null,1,null,0,null,"No"]
["City of Portland","Portland","OR",58,58,"City, County or Local Government Unit or Department of Transportation","Full Reporter",1849898,16,"TR","PT",2,2,null,0,null,2,null,1,null,0,null,"No"]
["City of Fort Lauderdale","Fort Lauderdale","FL",null,44929,"City, County or Local Government Unit or Department of Transportation","Full Reporter",5502379,16,"FB","PT",1,0,null,0,null,0,null,0,null,0,null,"No"]
["Fairbanks North Star Borough Transit","Fairbanks","AK",45,45,"City, County or Local Government Unit or Department of Transportation","Reduced Reporter",64513,16,"CB","DO",1,0,null,0,null,0,null,0,null,0,null,"No"]
["City of Vacaville","Vacaville","CA",9155,90155,"City, County or Local Government Unit or Department of Transportation","Reduced Reporter",93141,15,"MB","PT",12,1,null,0,null,1,null,0,null,0,null,"No"]
["Jackson Transit Authority","Jackson","TN",4057,40057,"Independent Public Agency or Authority of Transit Service","Full Reporter",71880,15,"MB","DO",9,1,null,0,null,1,null,0,null,0,null,"No"]
["Nashua Transit System","Nashua","NH",1087,10087,"City, County or Local Government Unit or Department of Transportation","Full Reporter",226400,15,"MB","PT",9,1,null,0,null,1,null,0,null,0,null,"No"]
["City of Anderson Transportation System","Anderson","IN",5041,50041,"City, County or Local Government Unit or Department of Transportation","Reduced Reporter",88133,15,"MB","DO",7,1,null,0,null,1,null,0,null,0,null,"No"]
["City of Carson","Carson","CA",null,90258,"City, County or Local Government Unit or Department of Transportation","Reduced Reporter",12150996,15,"MB","PT",7,0,null,0,null,0,null,0,null,0,null,"No"]
["City of Corona","Corona","CA",9052,90052,"City, County or Local Government Unit or Department of Transportation","Reduced Reporter",1932666,15,"MB","PT",6,1,null,0,null,1,null,2,null,0,null,"No"]
["City of Cerritos","Cerritos","CA",null,90259,"City, County or Local Government Unit or Department of Transportation","Reduced Reporter",12150996,15,"MB","PT",5,0,null,0,null,0,null,0,null,0,null,"No"]
["Camarillo Area Transit","Camarillo","CA",9163,90163,"City, County or Local Government Unit or Department of Transportation","Reduced Reporter",71772,15,"MB","PT",3,0,null,0,null,0,null,0,null,0,null,"No"]
["Olympia Trails Bus Company, Inc.","Elizabeth","NJ",2165,20165,"Private-For-Profit Corporation","Reduced Reporter",18351295,14,"CB","DO",14,5,null,2,null,7,null,3,null,3,null,"No"]
["City of Irvine","Irvine","CA",9231,90231,"City, County or Local Government Unit or Department of Transportation","Reduced Reporter",12150996,14,"MB","PT",14,2,null,0,null,2,null,9,null,0,null,"No"]
["City of Scottsdale - Scottsdale Trolley","Scottsdale","AZ",9131,90131,"City, County or Local Government Unit or Department of Transportation","Full Reporter",3629114,14,"MB","PT",14,3,null,0,null,3,null,0,null,0,null,"No"]
["City of Burbank","Burbank","CA",null,90256,"City, County or Local Government Unit or Department of Transportation","Reduced Reporter",12150996,14,"MB","PT",14,0,null,0,null,0,null,0,null,0,null,"No"]
["City of Bangor - BAT Community Connector","Bangor","ME",1096,10096,"City, County or Local Government Unit or Department of Transportation","Reduced Reporter",61210,14,"MB","DO",14,1,null,0,null,1,null,0,null,0,null,"No"]
["City of McAllen - McAllen Express Transit","McAllen","TX",6099,60099,"City, County or Local Government Unit or Department of Transportation","Reduced Reporter",728825,14,"MB","DO",11,1,null,0,null,1,null,0,null,0,null,"No"]
["Municipality of Guaynabo","Guaynabo","PR",4201,40201,"City, County or Local Government Unit or Department of Transportation","Reduced Reporter",2148346,14,"MB","DO",11,1,null,0,null,1,null,0,null,0,null,"No"]
["City of Commerce Municipal Buslines","Commerce","CA",9043,90043,"City, County or Local Government Unit or Department of Transportation","Full Reporter",12150996,14,"MB","DO",10,1,null,0,null,1,null,0,null,0,null,"No"]
["Bettendorf Transit System","Bettendorf","IA",7007,70007,"City, County or Local Government Unit or Department of Transportation","Reduced Reporter",280051,14,"MB","DO",10,0,null,0,null,0,null,0,null,0,null,"No"]
["City of Redondo Beach - Beach Cities Transit","Redondo Beach","CA",9214,90214,"City, County or Local Government Unit or Department of Transportation","Full Reporter",12150996,14,"MB","PT",10,1,null,0,null,1,null,0,null,0,null,"No"]
["Albany Transit System","Albany","GA",4021,40021,"City, County or Local Government Unit or Department of Transportation","Full Reporter",95779,14,"MB","DO",8,1,null,0,null,1,null,0,null,0,null,"No"]
["The City of Cheyenne Transit Program","Cheyenne","WY",8020,80020,"City, County or Local Government Unit or Department of Transportation","Reduced Reporter",73588,14,"MB","DO",8,0,null,0,null,0,null,0,null,0,null,"No"]
["City of Casper","Casper","WY",8013,80013,"City, County or Local Government Unit or Department of Transportation","Reduced Reporter",64548,14,"MB","PT",7,0,null,0,null,0,null,0,null,0,null,"No"]
["City of Arcadia Transit","Arcadia","CA",9044,90044,"City, County or Local Government Unit or Department of Transportation","Reduced Reporter",12150996,14,"MB","PT",6,0,null,0,null,0,null,0,null,0,null,"No"]
["Milford Transit District","Milford","CT",1107,10107,"Independent Public Agency or Authority of Transit Service","Full Reporter",923311,14,"MB","DO",6,0,null,0,null,0,null,0,null,0,null,"No"]
["City of South Gate","South Gate","CA",null,90291,"City, County or Local Government Unit or Department of Transportation","Reduced Reporter",12150996,14,"MB","PT",5,0,null,0,null,0,null,0,null,0,null,"No"]
["Bettendorf Transit System","Bettendorf","IA",7007,70007,"City, County or Local Government Unit or Department of Transportation","Reduced Reporter",280051,14,"MB","PT",3,0,null,0,null,0,null,0,null,0,null,"No"]
["Cherokee County Board of Commissioners","Canton","GA",4161,40161,"City, County or Local Government Unit or Department of Transportation","Reduced Reporter",4515419,14,"MB","DO",2,0,null,0,null,0,null,0,null,0,null,"No"]
["Connecticut Department of Transportation -CTTRANSIT New Britain","Berlin","CT",1130,10130,"Private Provider Reporting on Behalf of a Public Entity","Full Reporter",924859,13,"MB","PT",13,0,null,0,null,0,null,0,null,0,null,"No"]
["Southeast Missouri State University","Cape Girardeau","MO",7050,70050,"University","Reduced Reporter",52900,13,"MB","DO",13,1,null,0,null,1,null,0,null,0,null,"No"]
["Annapolis Department of Transportation","Annapolis","MD",3040,30040,"City, County or Local Government Unit or Department of Transportation","Reduced Reporter",2203663,13,"MB","DO",12,1,null,0,null,1,null,1,null,0,null,"No"]
["City of Danville/Danville Mass Transit","Danville","IL",5174,50174,"City, County or Local Government Unit or Department of Transportation","Reduced Reporter",50996,13,"MB","DO",11,1,null,0,null,1,null,0,null,0,null,"No"]
["City of Tracy","Tracy","CA",9197,90197,"City, County or Local Government Unit or Department of Transportation","Reduced Reporter",87569,13,"MB","PT",9,1,null,0,null,1,null,0,null,0,null,"No"]
["Board of County Commissioners of Calvert County, Maryland","Prince Frederick","MD","3R03-005",30131,"City, County or Local Government Unit or Department of Transportation","Reduced Reporter",58875,13,"MB","DO",8,0,null,0,null,0,null,0,null,0,null,"No"]
["Kingsport Area Transit System","Kingsport","TN",4080,40080,"City, County or Local Government Unit or Department of Transportation","Reduced Reporter",106571,13,"MB","DO",7,1,null,0,null,1,null,0,null,0,null,"No"]
["Los Angeles County Department of Public Works - East L.A.","Alhambra","CA",null,90271,"City, County or Local Government Unit or Department of Transportation","Reduced Reporter",12150996,13,"MB","PT",6,0,null,0,null,0,null,0,null,0,null,"No"]
["Mashantucket Pequot Tribal Nation","Mashantucket","CT","1T03",11152,"Tribe","Reduced Reporter",0,13,"MB","DO",5,0,null,0,null,0,null,0,null,0,null,"No"]
["City of El Monte Transportation Division","El Monte","CA",null,90265,"City, County or Local Government Unit or Department of Transportation","Reduced Reporter",12150996,13,"MB","PT",5,2,null,0,null,2,null,0,null,0,null,{"$f":"IF(V834&T834&R834&P834&N834<>\"\",\"Yes\",\"No\")","v":"No"}]
["City of Albany","Albany","OR",61,61,"City, County or Local Government Unit or Department of Transportation","Reduced Reporter",56997,13,"MB","DO",4,2,null,0,null,2,null,0,null,0,null,"No"]
["City of Glendora","Glendora","CA",null,90266,"City, County or Local Government Unit or Department of Transportation","Reduced Reporter",12150996,13,"MB","PT",3,0,null,0,null,0,null,0,null,0,null,"No"]
["Asotin County PTBA","Clarkston","WA",51,51,"City, County or Local Government Unit or Department of Transportation","Reduced Reporter",51924,13,"MB","DO",3,0,null,0,null,0,null,0,null,0,null,"No"]
["City of El Monte Transportation Division","El Monte","CA",null,90265,"City, County or Local Government Unit or Department of Transportation","Reduced Reporter",12150996,13,"MB","DO",2,2,null,0,null,2,null,0,null,0,null,"No"]
["Navajo Nation","Window Rock","AZ","9T05",90005,"Tribe","Reduced Reporter",0,12,"CB","DO",12,0,null,0,null,0,null,0,null,0,null,"No"]
["Shoshone-Bannock Tribes","Fort Hall","ID","0T31",31,"Tribe","Reduced Reporter",0,12,"MB","DO",12,0,null,0,null,0,null,0,null,0,null,"No"]
["Monroe Bus Corporation","Brooklyn","NY",2137,20137,"Private-For-Profit Corporation","Full Reporter",423566,12,"CB","DO",12,0,null,0,null,0,null,0,null,0,null,"No"]
["City of Calabasas","Calabasas","CA",null,90257,"City, County or Local Government Unit or Department of Transportation","Reduced Reporter",12150996,12,"MB","PT",11,1,null,0,null,1,null,0,null,0,null,"No"]
["Springfield City Area Transit","Springfield","OH",5020,50020,"City, County or Local Government Unit or Department of Transportation","Reduced Reporter",85256,12,"MB","PT",9,1,null,0,null,1,null,0,null,0,null,"No"]
["City of Porterville","Porterville","CA",9198,90198,"City, County or Local Government Unit or Department of Transportation","Reduced Reporter",70272,12,"MB","PT",9,1,null,0,null,1,null,0,null,0,null,"No"]
["Jonesboro Economical Transportation System","Jonesboro","AR",6104,60104,"City, County or Local Government Unit or Department of Transportation","Reduced Reporter",65419,12,"MB","DO",8,1,null,0,null,1,null,0,null,0,null,"No"]
["City of Hazleton -- Hazleton Public Transit","Hazleton","PA",3093,30093,"City, County or Local Government Unit or Department of Transportation","Reduced Reporter",56827,12,"MB","PT",8,1,null,0,null,1,null,0,null,0,null,"No"]
["Hernando County Board of County Commissioners","Brooksville","FL",4146,40146,"City, County or Local Government Unit or Department of Transportation","Reduced Reporter",148220,12,"MB","PT",7,0,null,0,null,0,null,0,null,0,null,"No"]
["Tuscaloosa County Parking and Transit Authority","Tuscaloosa","AL",4045,40045,"Independent Public Agency or Authority of Transit Service","Reduced Reporter",139114,12,"MB","DO",7,1,null,0,null,1,null,1,null,0,null,"No"]
["The City of Bowling Green/Community Action of Southern Kentucky","Bowling Green","KY",4184,40184,"City, County or Local Government Unit or Department of Transportation","Reduced Reporter",78306,12,"MB","DO",6,0,null,0,null,0,null,0,null,0,null,"No"]
["Gadsden Transportation Services - City of Gadsden","Gadsden","AL",4049,40049,"City, County or Local Government Unit or Department of Transportation","Reduced Reporter",64172,12,"MB","DO",5,0,null,0,null,0,null,0,null,0,null,"No"]
["City of Independence","Independence","MO",7046,70046,"City, County or Local Government Unit or Department of Transportation","Reduced Reporter",1519417,12,"MB","PT",5,1,null,0,null,1,null,0,null,0,null,"No"]
["Confederated Tribes of the Umatilla Indian Reservation","Pendleton","OR","0T06",119,"Tribe","Reduced Reporter",0,12,"CB","DO",5,0,null,0,null,0,null,0,null,0,null,"No"]
["Confederated Tribes of the Umatilla Indian Reservation","Pendleton","OR","0T06",119,"Tribe","Reduced Reporter",0,12,"MB","DO",2,0,null,0,null,0,null,0,null,0,null,"No"]
["Lorain County Transit","Elyria","OH",5095,50095,"City, County or Local Government Unit or Department of Transportation","Reduced Reporter",180956,12,"MB","PT",2,0,null,0,null,0,null,0,null,0,null,"No"]
["Oglala Sioux Tribe","Pine Ridge","SD","8T08",88122,"Tribe","Reduced Reporter",0,11,"MB","DO",11,1,null,0,null,1,null,0,null,0,null,"No"]
["Biddeford-Saco-Old Orchard Beach Transit Committee Shuttle Bus","Biddeford","ME",1114,10114,"Independent Public Agency or Authority of Transit Service","Reduced Reporter",203914,11,"MB","DO",11,0,null,0,null,0,null,0,null,0,null,"No"]
["City of Corvallis","Corvallis","OR",47,47,"City, County or Local Government Unit or Department of Transportation","Full Reporter",62433,11,"MB","PT",11,1,null,0,null,1,null,0,null,0,null,"No"]
["Clarkstown Mini-Trans","Nanuet","NY",2085,20085,"City, County or Local Government Unit or Department of Transportation","Reduced Reporter",18351295,11,"MB","DO",11,0,null,0,null,0,null,0,null,0,null,"No"]
["Municipality of Lares","Lares","PR",4197,40197,"City, County or Local Government Unit or Department of Transportation","Reduced Reporter",306196,11,"MB","DO",9,0,null,0,null,0,null,0,null,0,null,"No"]
["City of Jacksonville","Jacksonville","NC",4166,40166,"City, County or Local Government Unit or Department of Transportation","Reduced Reporter",105419,11,"MB","PT",9,0,null,0,null,0,null,0,null,0,null,"No"]
["Terre Haute Transit Utility","Terre Haute","IN",5053,50053,"City, County or Local Government Unit or Department of Transportation","Full Reporter",92742,11,"MB","DO",8,2,null,0,null,2,null,0,null,0,null,"No"]
["City of Moorhead, DBA: Metropolitan Area Transit","Moorhead","MN",5026,50026,"City, County or Local Government Unit or Department of Transportation","Full Reporter",176676,11,"MB","PT",8,1,null,0,null,1,null,0,null,0,null,"No"]
["City of Long Beach","Long Beach","NY",2006,20006,"City, County or Local Government Unit or Department of Transportation","Full Reporter",18351295,11,"MB","DO",8,1,null,0,null,1,null,0,null,0,null,"No"]
["Allegany County Transit","Cumberland","MD",3041,30041,"City, County or Local Government Unit or Department of Transportation","Reduced Reporter",51899,11,"MB","DO",6,0,null,0,null,0,null,0,null,0,null,"No"]
["Greenville Area Transit","Greenville","NC",4095,40095,"City, County or Local Government Unit or Department of Transportation","Reduced Reporter",117798,11,"MB","DO",6,0,null,0,null,0,null,0,null,0,null,"No"]
["City of Folsom","Folsom","CA",9220,90220,"City, County or Local Government Unit or Department of Transportation","Reduced Reporter",1723634,11,"MB","DO",5,0,null,0,null,0,null,0,null,0,null,"No"]
["Martin County","Stuart","FL",4192,40192,"City, County or Local Government Unit or Department of Transportation","Full Reporter",376047,11,"MB","PT",5,0,null,0,null,0,null,0,null,0,null,"No"]
["Cecil County Government - SSCT","Elkton","MD",3108,30108,"City, County or Local Government Unit or Department of Transportation","Reduced Reporter",5441567,11,"MB","DO",4,0,null,0,null,0,null,0,null,0,null,"No"]
["Martin County","Stuart","FL",4192,40192,"City, County or Local Government Unit or Department of Transportation","Full Reporter",376047,11,"CB","PT",2,0,null,0,null,0,null,0,null,0,null,"No"]
["Broadway Bus Corporation","Bayonne","NJ",2220,20220,"Private-For-Profit Corporation","Reduced Reporter",18351295,10,"MB","DO",10,0,null,0,null,0,null,0,null,0,null,"No"]
["Puerto Rico Maritime Transport Authority","Puerto Real","PR",4175,40175,"State Government Unit or Department of Transportation","Full Reporter",2148346,10,"FB","DO",10,5,null,0,null,5,null,0,null,0,null,"No"]
["City of San Luis Obispo","San Luis Obispo","CA",9156,90156,"City, County or Local Government Unit or Department of Transportation","Full Reporter",59219,10,"MB","PT",10,0,null,0,null,0,null,0,null,0,null,"No"]
["County of Cumberland","Bridgeton","NJ",2201,20201,"City, County or Local Government Unit or Department of Transportation","Reduced Reporter",5441567,10,"MB","DO",10,0,null,0,null,0,null,0,null,0,null,"No"]
["San Francisco Bay Area Water Emergency Transportation Authority","San Francisco","CA",9225,90225,"Independent Public Agency or Authority of Transit Service","Full Reporter",3281212,10,"FB","PT",10,9,null,0,null,9,null,0,null,0,null,"No"]
["Detroit Transportation Corporation","Detroit","MI",5141,50141,"Independent Public Agency or Authority of Transit Service","Full Reporter",3734090,10,"MG","DO",10,13,null,0,null,13,null,11,null,15,null,"No"]
["Terrebonne Parish Consolidated Government","Houma","LA",6080,60080,"City, County or Local Government Unit or Department of Transportation","Reduced Reporter",144875,10,"MB","DO",8,1,null,0,null,1,null,0,null,0,null,"No"]
["City of Farmington dba: Red Apple Transit","Farmington","NM",6100,60100,"City, County or Local Government Unit or Department of Transportation","Reduced Reporter",53049,10,"MB","PT",8,0,null,0,null,0,null,0,null,0,null,"No"]
["Municipality of Bayamon","Bayamon","PR",4137,40137,"City, County or Local Government Unit or Department of Transportation","Reduced Reporter",2148346,10,"MB","DO",8,3,null,0,null,3,null,2,null,0,null,"No"]
["City of Alexandria","Alexandria","LA",6025,60025,"City, County or Local Government Unit or Department of Transportation","Reduced Reporter",82804,10,"MB","DO",8,1,null,0,null,1,null,0,null,0,null,"No"]
["Washington County Transit","Hagerstown","MD",3042,30042,"City, County or Local Government Unit or Department of Transportation","Reduced Reporter",182696,10,"MB","DO",8,1,null,0,null,1,null,0,null,0,null,"No"]
["City of Tulare","Tulare","CA",9244,90244,"City, County or Local Government Unit or Department of Transportation","Full Reporter",219454,10,"MB","PT",7,1,null,0,null,1,null,0,null,0,null,"No"]
["San Marcos Urban Transit District","Austin","TX",6131,60131,"Independent Public Agency or Authority of Transit Service","Reduced Reporter",52826,10,"MB","DO",7,1,null,0,null,1,null,0,null,0,null,"No"]
["Fort Smith Transit","Fort Smith","AR",6086,60086,"City, County or Local Government Unit or Department of Transportation","Reduced Reporter",122947,10,"MB","DO",7,1,null,0,null,1,null,0,null,0,null,"No"]
["City of St. George","St. George","UT",8026,80026,"City, County or Local Government Unit or Department of Transportation","Reduced Reporter",98370,10,"MB","DO",6,1,null,0,null,1,null,0,null,0,null,"No"]
["Ashland Bus System","Ashland","KY",4016,40016,"City, County or Local Government Unit or Department of Transportation","Reduced Reporter",202637,10,"MB","DO",6,0,null,0,null,0,null,0,null,0,null,"No"]
["Port Arthur Transit","Port Arthur","TX",6013,60013,"City, County or Local Government Unit or Department of Transportation","Reduced Reporter",153150,10,"MB","DO",5,1,null,0,null,1,null,0,null,0,null,"No"]
["Municipality of Toa Baja","Toa Baja","PR",4182,40182,"City, County or Local Government Unit or Department of Transportation","Reduced Reporter",2148346,10,"MB","DO",4,1,null,0,null,1,null,0,null,0,null,"No"]
["Orange Public Transportation","Hillsborough","NC",4231,40231,"City, County or Local Government Unit or Department of Transportation","Reduced Reporter",347602,10,"MB","DO",3,0,null,0,null,0,null,0,null,0,null,"No"]
["City of Margate","Margate","FL",null,40256,"City, County or Local Government Unit or Department of Transportation","Reduced Reporter",5502379,10,"MB","PT",3,0,null,0,null,0,null,0,null,0,null,"No"]
["Spokane Tribe of Indians","Wellpinit","WA","0T24",207,"Tribe","Reduced Reporter",0,10,"MB","DO",3,0,null,0,null,0,null,0,null,0,null,"No"]
["Owensboro Transit System","Owensboro","KY",4020,40020,"City, County or Local Government Unit or Department of Transportation","Reduced Reporter",70543,9,"MB","DO",9,1,null,0,null,1,null,0,null,0,null,"No"]
["Wichita Falls Transit System","Wichita Falls","TX",6035,60035,"City, County or Local Government Unit or Department of Transportation","Reduced Reporter",99437,9,"MB","DO",9,1,null,0,null,1,null,0,null,0,null,"No"]
["San Carlos Apache Tribe","Peridot","AZ","9T07",99286,"Tribe","Reduced Reporter",0,9,"MB","DO",9,0,null,0,null,0,null,0,null,0,null,"No"]
["Lewiston-Auburn Transit Committee","Auburn","ME",1015,10015,"City, County or Local Government Unit or Department of Transportation","Reduced Reporter",59397,9,"MB","PT",7,1,null,0,null,1,null,0,null,0,null,"No"]
["Pine Bluff Transit","Pine Bluff","AR",6034,60034,"City, County or Local Government Unit or Department of Transportation","Reduced Reporter",53495,9,"MB","DO",7,0,null,0,null,0,null,0,null,0,null,"No"]
["Municipality of San Lorenzo","San Lorenzo","PR",4195,40195,"City, County or Local Government Unit or Department of Transportation","Reduced Reporter",2148346,9,"MB","DO",6,1,null,0,null,1,null,0,null,0,null,"No"]
["Texarkana Urban Transit District","Texarkana","TX",6093,60093,"Independent Public Agency or Authority of Transit Service","Reduced Reporter",78162,9,"MB","DO",6,1,null,0,null,1,null,0,null,0,null,"No"]
["City of Monterey Park","Monterey Park","CA",null,90286,"City, County or Local Government Unit or Department of Transportation","Reduced Reporter",12150996,9,"MB","PT",6,1,null,0,null,1,null,0,null,0,null,{"$f":"IF(V898&T898&R898&P898&N898<>\"\",\"Yes\",\"No\")","v":"No"}]
["City of Gastonia","Gastonia","NC",4010,40010,"City, County or Local Government Unit or Department of Transportation","Reduced Reporter",169495,9,"MB","DO",6,1,null,0,null,1,null,0,null,0,null,"No"]
["Municipality of Barceloneta","Barceloneta","PR",4150,40150,"City, County or Local Government Unit or Department of Transportation","Reduced Reporter",71747,9,"MB","DO",6,1,null,0,null,1,null,0,null,0,null,"No"]
["ColumBUS Transit","Columbus","IN",5177,50177,"City, County or Local Government Unit or Department of Transportation","Reduced Reporter",54933,9,"MB","DO",5,1,null,0,null,1,null,0,null,0,null,"No"]
["City of West Hollywood","West Hollywood","CA",null,90294,"City, County or Local Government Unit or Department of Transportation","Reduced Reporter",12150996,9,"MB","PT",4,0,null,0,null,0,null,0,null,0,null,"No"]
["City of Delano","Delano","CA",9238,90238,"City, County or Local Government Unit or Department of Transportation","Reduced Reporter",54372,9,"MB","DO",4,1,null,0,null,1,null,0,null,0,null,"No"]
["City of Edmond","Edmond","OK",6118,60118,"City, County or Local Government Unit or Department of Transportation","Reduced Reporter",861505,9,"MB","PT",4,0,null,0,null,0,null,0,null,0,null,"No"]
["City of Joplin Metro Area Public","Joplin","MO",7040,70040,"City, County or Local Government Unit or Department of Transportation","Reduced Reporter",82775,9,"MB","DO",3,0,null,0,null,0,null,0,null,0,null,"No"]
["City of Edmond","Edmond","OK",6118,60118,"City, County or Local Government Unit or Department of Transportation","Reduced Reporter",861505,9,"CB","PT",3,0,null,0,null,0,null,0,null,0,null,"No"]
["Center for Pan Asian Community Services, Inc.","Chamblee","GA",null,40246,"Private-Non-Profit Corporation","Reduced Reporter",4515419,9,"MB","DO",2,0,null,0,null,0,null,0,null,0,null,"No"]
["City of Bell","Bell","CA",null,90252,"City, County or Local Government Unit or Department of Transportation","Reduced Reporter",12150996,9,"MB","PT",1,0,null,0,null,0,null,0,null,0,null,"No"]
["City of Delano","Delano","CA",9238,90238,"City, County or Local Government Unit or Department of Transportation","Reduced Reporter",54372,9,"CB","DO",1,1,null,0,null,1,null,0,null,0,null,"No"]
["Spartanburg Transit System","Spartanburg","SC",4101,40101,"Independent Public Agency or Authority of Transit Service","Reduced Reporter",180786,8,"MB","DO",8,1,null,0,null,1,null,1,null,0,null,"No"]
["City of Fairfax CUE Bus","Fairfax","VA",3058,30058,"City, County or Local Government Unit or Department of Transportation","Full Reporter",4586770,8,"MB","DO",8,0,null,0,null,0,null,0,null,0,null,"No"]
["City of Seattle - Seattle Center Monorail Transit","Seattle","WA",23,23,"City, County or Local Government Unit or Department of Transportation","Full Reporter",3059393,8,"MG","PT",8,2,null,0,null,2,null,1,null,0,null,"No"]
["St. Bernard Urban Rapid Transit","Chalmette","LA",6058,60058,"City, County or Local Government Unit or Department of Transportation","Reduced Reporter",899703,8,"MB","DO",8,0,null,0,null,0,null,0,null,0,null,"No"]
["White Earth Band of Chippewa","White Earth","MN","5T10",55270,"Tribe","Reduced Reporter",0,8,"MB","DO",8,0,null,0,null,0,null,0,null,0,null,"No"]
["South Portland Bus Service","South Portland","ME",1112,10112,"City, County or Local Government Unit or Department of Transportation","Reduced Reporter",203914,8,"MB","DO",8,1,null,0,null,1,null,0,null,0,null,"No"]
["Jolley Trolley Transportation of Clearwater, Inc.","Clearwater","FL",null,40259,"Private-Non-Profit Corporation","Full Reporter",2441770,8,"MB","DO",8,0,null,0,null,0,null,0,null,0,null,"No"]
["Suffolk Transit","Suffolk","VA",null,30198,"City, County or Local Government Unit or Department of Transportation","Reduced Reporter",1439666,8,"MB","PT",7,1,null,0,null,1,null,0,null,0,null,"No"]
["Autonomous Municipality of Ponce","Ponce","PR",4234,40234,"City, County or Local Government Unit or Department of Transportation","Reduced Reporter",149539,8,"MB","DO",7,1,null,0,null,1,null,0,null,1,null,"No"]
["City of Baldwin Park, Baldwin Park Transit","Baldwin Park","CA",null,90251,"City, County or Local Government Unit or Department of Transportation","Reduced Reporter",12150996,8,"MB","PT",6,1,null,0,null,1,null,2,null,0,null,"No"]
["City of Beloit Transit System","Beloit","WI",5109,50109,"City, County or Local Government Unit or Department of Transportation","Reduced Reporter",63835,8,"MB","DO",6,1,null,0,null,1,null,0,null,0,null,"No"]
["City of Ocala, Florida","Ocala","FL",4120,40120,"City, County or Local Government Unit or Department of Transportation","Full Reporter",156909,8,"MB","PT",6,1,null,0,null,1,null,0,null,0,null,"No"]
["Longview Transit","Longview","TX",6081,60081,"City, County or Local Government Unit or Department of Transportation","Reduced Reporter",98884,8,"MB","DO",5,0,null,0,null,0,null,0,null,0,null,"No"]
["City of Sierra Vista","Sierra Vista","AZ",9239,90239,"City, County or Local Government Unit or Department of Transportation","Reduced Reporter",52745,8,"MB","DO",5,1,null,0,null,1,null,0,null,0,null,"No"]
["Municipality of Hormigueros","Hormigueros","PR",4121,40121,"City, County or Local Government Unit or Department of Transportation","Reduced Reporter",109572,8,"MB","DO",4,0,null,0,null,0,null,0,null,0,null,"No"]
["City of Turlock","Turlock","CA",9201,90201,"City, County or Local Government Unit or Department of Transportation","Full Reporter",99904,8,"MB","PT",4,1,null,0,null,1,null,0,null,0,null,"No"]
["City of Valparaiso","Valparaiso","IN",5183,50183,"City, County or Local Government Unit or Department of Transportation","Full Reporter",8608208,8,"CB","PT",4,0,null,0,null,0,null,0,null,0,null,"No"]
["Carson Area Metropolitan Planning Organization","Carson City","NV",9215,90215,"MPO, COG or Other Planning Agency","Reduced Reporter",58079,8,"MB","PT",4,1,null,0,null,1,null,0,null,0,null,"No"]
["Kalispel Tribe of Indians","Usk","WA","0T09",9,"Tribe","Reduced Reporter",0,8,"MB","DO",4,0,null,0,null,0,null,0,null,0,null,"No"]
["Michigan City Transit","Michigan City","IN",5098,50098,"City, County or Local Government Unit or Department of Transportation","Reduced Reporter",66025,8,"MB","DO",4,0,null,0,null,0,null,0,null,0,null,"No"]
["City of West Covina","West Covina","CA",null,90293,"City, County or Local Government Unit or Department of Transportation","Reduced Reporter",12150996,8,"MB","PT",4,0,null,0,null,0,null,0,null,0,null,"No"]
["City of Valparaiso","Valparaiso","IN",5183,50183,"City, County or Local Government Unit or Department of Transportation","Full Reporter",8608208,8,"MB","PT",4,0,null,0,null,0,null,0,null,0,null,"No"]
["Michigan City Transit","Michigan City","IN",5098,50098,"City, County or Local Government Unit or Department of Transportation","Reduced Reporter",66025,8,"CB","DO",2,0,null,0,null,0,null,0,null,0,null,"No"]
["Fort Peck Tribes","Poplar ","MT","8T18",80018,"Tribe","Reduced Reporter",0,8,"MB","DO",2,0,null,0,null,0,null,0,null,0,null,"No"]
["Greater Derry Salem Cooperative Alliance for Regional Transportation","Salem","NH",1123,10123,"Independent Public Agency or Authority of Transit Service","Reduced Reporter",4181019,8,"MB","PT",1,0,null,0,null,0,null,0,null,0,null,"No"]
["Municipality of San Sebastian","San Sebastian","PR",4183,40183,"City, County or Local Government Unit or Department of Transportation","Reduced Reporter",306196,8,"MB","DO",1,1,null,0,null,1,null,0,null,0,null,"No"]
["Newburgh Beacon Bus Corporation","New Windsor","NY",2148,20148,"Private Provider Reporting on Behalf of a Public Entity","Reduced Reporter",423566,7,"MB","DO",7,0,null,0,null,0,null,0,null,0,null,"No"]
["City of Pembroke Pines","Pembrokes Pines","FL",null,40251,"City, County or Local Government Unit or Department of Transportation","Reduced Reporter",5502379,7,"MB","PT",7,0,null,0,null,0,null,0,null,0,null,"No"]
["City of Murfreesboro","Murfreesboro","TN",4186,40186,"City, County or Local Government Unit or Department of Transportation","Reduced Reporter",133228,7,"MB","DO",7,0,null,0,null,0,null,0,null,0,null,"No"]
["Concord Kannapolis Area Transit","Concord","NC",4167,40167,"City, County or Local Government Unit or Department of Transportation","Reduced Reporter",214881,7,"MB","PT",7,1,null,0,null,1,null,1,null,0,null,"No"]
["Coralville Transit System","Coralville","IA",7030,70030,"City, County or Local Government Unit or Department of Transportation","Full Reporter",106621,7,"MB","DO",7,1,null,0,null,1,null,2,null,0,null,"No"]
["Saddle River Trail, Inc.","Wallington","NJ",2222,20222,"Private-For-Profit Corporation","Reduced Reporter",18351295,7,"CB","DO",7,0,null,0,null,0,null,0,null,0,null,"No"]
["Martz Group, National Coach Works of Virginia","Fredericksburg","VA",3103,30103,"Private-For-Profit Corporation","Full Reporter",4586770,7,"CB","DO",7,0,null,0,null,0,null,0,null,0,null,"No"]
["City of Lauderhill","Lauderhill","FL",null,40254,"City, County or Local Government Unit or Department of Transportation","Reduced Reporter",5502379,7,"MB","PT",7,1,null,0,null,1,null,0,null,0,null,"No"]
["Steel Valley Regional Transit Authority","Steubenville","OH",5142,50142,"Independent Public Agency or Authority of Transit Service","Reduced Reporter",70889,7,"MB","DO",6,0,null,0,null,0,null,0,null,0,null,"No"]
["Central Shenandoah Planning District Commission","Staunton","VA",3113,30989,"MPO, COG or Other Planning Agency","Reduced Reporter",56611,7,"MB","PT",6,0,null,0,null,0,null,0,null,0,null,"No"]
["Lake Charles Transit System","Lake Charles","LA",6023,60023,"City, County or Local Government Unit or Department of Transportation","Reduced Reporter",143440,7,"MB","DO",5,1,null,0,null,1,null,1,null,0,null,"No"]
["Link Transit - Burlington","Burlington","NC",null,40252,"City, County or Local Government Unit or Department of Transportation","Reduced Reporter",119911,7,"MB","PT",5,0,null,0,null,0,null,0,null,0,null,"No"]
["Confederated Tribes and Bands of The Yakama Nation","Toppenish","WA","0T03",111,"Tribe","Reduced Reporter",0,7,"MB","DO",5,0,null,0,null,0,null,0,null,0,null,"No"]
["Compton Renaissance Transit Service","Compton","CA",null,90260,"City, County or Local Government Unit or Department of Transportation","Reduced Reporter",12150996,7,"MB","PT",5,1,null,0,null,1,null,1,null,0,null,"No"]
["City of Manteca","Manteca","CA",9217,90217,"City, County or Local Government Unit or Department of Transportation","Reduced Reporter",83578,7,"MB","PT",4,1,null,0,null,1,null,0,null,0,null,"No"]
["City of Miramar - Public Works Department","Miramar","FL",null,40241,"City, County or Local Government Unit or Department of Transportation","Reduced Reporter",5502379,7,"MB","DO",4,1,null,0,null,1,null,0,null,0,null,"No"]
["City of Winchester","Winchester","VA",3099,30099,"City, County or Local Government Unit or Department of Transportation","Reduced Reporter",69449,7,"MB","DO",4,0,null,0,null,0,null,0,null,0,null,"No"]
["Hub City Transit","Hattiesburg","MS",4060,40060,"City, County or Local Government Unit or Department of Transportation","Reduced Reporter",80358,7,"MB","DO",4,1,null,0,null,1,null,0,null,0,null,"No"]
["Municipality of Camuy","Camuy","PR",4160,40160,"City, County or Local Government Unit or Department of Transportation","Reduced Reporter",139171,7,"MB","DO",4,0,null,0,null,0,null,0,null,0,null,"No"]
["Franklin Transit Authority","Franklin","TN",4162,40162,"City, County or Local Government Unit or Department of Transportation","Reduced Reporter",969587,7,"MB","PT",3,1,null,0,null,1,null,1,null,0,null,"No"]
["Lower Savannah COG","Aiken","SC",4156,40156,"MPO, COG or Other Planning Agency","Reduced Reporter",386787,7,"MB","PT",3,1,null,0,null,1,null,0,null,0,null,"No"]
["Municipality of Fajardo","Fajardo","PR",4164,40164,"City, County or Local Government Unit or Department of Transportation","Reduced Reporter",85225,7,"MB","DO",3,1,null,0,null,1,null,0,null,0,null,"No"]
["Bristol Tennessee Transit System","Bristol","TN",4055,40055,"City, County or Local Government Unit or Department of Transportation","Reduced Reporter",69501,7,"MB","DO",3,1,null,0,null,1,null,0,null,0,null,"No"]
["City of Deerfield Beach/ North East Focal Point Senior Center","Deerfield Beach","FL",null,40239,"City, County or Local Government Unit or Department of Transportation","Reduced Reporter",5502379,7,"MB","DO",2,0,null,0,null,0,null,0,null,0,null,"No"]
["Kootenai County","Coeur d'Alene","ID",55,55,"City, County or Local Government Unit or Department of Transportation","Reduced Reporter",98378,7,"MB","PT",2,1,null,0,null,1,null,0,null,0,null,"No"]
["City of Maple Grove","Maple Grove","MN",5220,50517,"City, County or Local Government Unit or Department of Transportation","Full Reporter",2650890,7,"MB","PT",1,2,null,0,null,2,null,0,null,0,null,"No"]
["BillyBey Ferry Company, LLC","New York","NY",2189,20189,"Private-For-Profit Corporation","Full Reporter",18351295,6,"FB","DO",6,6,null,0,null,6,null,0,null,0,null,{"$f":"IF(V962&T962&R962&P962&N962<>\"\",\"Yes\",\"No\")","v":"No"}]
["Leprechaun Lines, Inc.","Newburgh","NY",2179,20179,"Private Provider Reporting on Behalf of a Public Entity","Reduced Reporter",423566,6,"CB","DO",6,0,null,0,null,0,null,0,null,0,null,"No"]
["Private Transportation Corporation","Brooklyn","NY",2175,20175,"Private-For-Profit Corporation","Full Reporter",18351295,6,"MB","PT",6,0,null,0,null,0,null,0,null,0,null,"No"]
["City of Poughkeepsie","Poughkeepsie","NY",2009,20009,"City, County or Local Government Unit or Department of Transportation","Reduced Reporter",423566,6,"MB","DO",6,0,null,0,null,0,null,0,null,0,null,"No"]
["Confederated Tribes of the Colville Indian Reservation","Nespelem","WA","0T04",4,"Tribe","Reduced Reporter",0,6,"MB","DO",5,0,null,0,null,0,null,0,null,0,null,"No"]
["Autonomous Municipality of Vega Alta","Vega Alta","PR",4199,40199,"City, County or Local Government Unit or Department of Transportation","Reduced Reporter",2148346,6,"MB","DO",5,1,null,0,null,1,null,0,null,0,null,"No"]
["Borough of Pottstown - Pottstown Area Rapid Transit","Pottstown","PA",3077,30077,"City, County or Local Government Unit or Department of Transportation","Full Reporter",107682,6,"MB","PT",5,1,null,0,null,1,null,0,null,0,null,"No"]
["Greater Glens Falls Transit System","Queensbury","NY",2120,20120,"City, County or Local Government Unit or Department of Transportation","Reduced Reporter",65443,6,"MB","DO",5,0,null,0,null,0,null,0,null,0,null,"No"]
["Municipality of Juncos","Juncos","PR",4165,40165,"City, County or Local Government Unit or Department of Transportation","Reduced Reporter",2148346,6,"MB","DO",4,1,null,0,null,1,null,0,null,0,null,"No"]
["Chippewa Cree Tribe","Box Elder","MT","8T03",88164,"Tribe","Reduced Reporter",0,6,"MB","DO",4,0,null,0,null,0,null,0,null,0,null,"No"]
["Crow Tribe of Indians","Crow Agency","MT","8T14",88188,"Tribe","Reduced Reporter",0,6,"MB","DO",4,0,null,0,null,0,null,0,null,0,null,"No"]
["Cheyenne & Arapaho Tribes","Concho","OK","6T14",66194,"Tribe","Reduced Reporter",0,6,"MB","DO",4,0,null,0,null,0,null,0,null,0,null,"No"]
["County of Ventura","Ventura","CA",null,90298,"City, County or Local Government Unit or Department of Transportation","Reduced Reporter",214811,6,"MB","PT",4,0,null,0,null,0,null,0,null,0,null,"No"]
["Henderson Area Rapid Transit","Henderson","KY",5107,50107,"City, County or Local Government Unit or Department of Transportation","Reduced Reporter",229351,6,"MB","DO",4,0,null,0,null,0,null,0,null,0,null,"No"]
["City of Bell Gardens","Bell Gardens","CA",null,90253,"City, County or Local Government Unit or Department of Transportation","Reduced Reporter",12150996,6,"MB","PT",3,0,null,0,null,0,null,0,null,0,null,"No"]
["Intracity Transit","Hot Springs","AR",6105,60105,"City, County or Local Government Unit or Department of Transportation","Reduced Reporter",55121,6,"MB","DO",3,1,null,0,null,1,null,0,null,0,null,"No"]
["Bois Forte Reservation Tribal Council","Nett Lake","MN","5T06",55252,"Tribe","Reduced Reporter",0,6,"CB","DO",2,0,null,0,null,0,null,0,null,0,null,"No"]
["Klamath Tribes","Chiloquin","OR","0T10",10,"Tribe","Reduced Reporter",0,6,"CB","DO",2,0,null,0,null,0,null,0,null,0,null,"No"]
["Plaquemines Parish Government","Belle Chasse","LA",6127,60127,"City, County or Local Government Unit or Department of Transportation","Full Reporter",899703,6,"FB","DO",2,4,null,0,null,4,null,0,null,0,null,"No"]
["Municipality of Cidra","Cidra","PR",4124,40124,"City, County or Local Government Unit or Department of Transportation","Reduced Reporter",2148346,6,"MB","DO",2,0,null,0,null,0,null,0,null,0,null,"No"]
["Pueblo of Laguna","Laguna","NM","6T15",60620,"Tribe","Reduced Reporter",0,6,"MB","DO",1,0,null,0,null,0,null,0,null,0,null,"No"]
["Town of Warwick Dial A Bus","Warwick","NY",2214,20214,"City, County or Local Government Unit or Department of Transportation","Reduced Reporter",423566,6,"MB","DO",1,0,null,0,null,0,null,0,null,0,null,"No"]
["City of Cudahy","Cudahy","CA",null,90262,"City, County or Local Government Unit or Department of Transportation","Reduced Reporter",12150996,6,"MB","PT",1,0,null,0,null,0,null,0,null,0,null,"No"]
["Confederated Tribes of the Colville Indian Reservation","Nespelem","WA","0T04",4,"Tribe","Reduced Reporter",0,6,"FB","DO",1,0,null,0,null,0,null,0,null,0,null,"No"]
["Town of Davie","Davie","FL",null,40262,"City, County or Local Government Unit or Department of Transportation","Reduced Reporter",5502379,5,"MB","PT",5,1,null,0,null,1,null,0,null,0,null,"No"]
["Pueblo of Santa Ana","Santa Ana Pueblo","NM","6T11",66152,"Tribe","Reduced Reporter",0,5,"MB","DO",5,0,null,0,null,0,null,0,null,0,null,"No"]
["The University of Montana - ASUM Transportation","Missoula","MT",8107,80107,"University","Full Reporter",82157,5,"MB","DO",5,0,null,0,null,0,null,0,null,0,null,"No"]
["Anderson Transit Authority","Anderson","SC",4081,40081,"City, County or Local Government Unit or Department of Transportation","Reduced Reporter",75702,5,"MB","DO",5,0,null,0,null,0,null,0,null,0,null,"No"]
["Municipality of Cayey","Cayey","PR",4122,40122,"City, County or Local Government Unit or Department of Transportation","Reduced Reporter",2148346,5,"MB","DO",4,2,null,0,null,2,null,0,null,0,null,"No"]
["City of Middletown - Middletown Transit System","Middletown","OH",5019,50019,"City, County or Local Government Unit or Department of Transportation","Reduced Reporter",97503,5,"MB","DO",4,1,null,0,null,1,null,0,null,0,null,"No"]
["Municipality of Hatillo","Hatillo","PR",4151,40151,"City, County or Local Government Unit or Department of Transportation","Reduced Reporter",139171,5,"MB","DO",3,2,null,0,null,2,null,0,null,0,null,"No"]
["Watertown CitiBus","Watertown","NY",2215,20215,"City, County or Local Government Unit or Department of Transportation","Reduced Reporter",57840,5,"MB","DO",3,0,null,0,null,0,null,0,null,0,null,"No"]
["City of Kingston Citibus","Kingston","NY",2191,20191,"City, County or Local Government Unit or Department of Transportation","Reduced Reporter",57442,5,"MB","DO",3,0,null,0,null,0,null,0,null,0,null,"No"]
["City of Loveland Transit","Loveland","CO",8025,80025,"City, County or Local Government Unit or Department of Transportation","Full Reporter",264465,5,"MB","DO",3,0,null,0,null,0,null,0,null,0,null,"No"]
["Municipality of Vega Baja","Vega Baja","PR",4117,40117,"City, County or Local Government Unit or Department of Transportation","Reduced Reporter",2148346,5,"MB","DO",2,3,null,0,null,3,null,1,null,1,null,"No"]
["Municipality of Dorado","Dorado","PR",4198,40198,"City, County or Local Government Unit or Department of Transportation","Reduced Reporter",2148346,5,"MB","DO",2,1,null,0,null,1,null,0,null,0,null,"No"]
["City of Rosemead","Rosemead","CA",null,90289,"City, County or Local Government Unit or Department of Transportation","Reduced Reporter",12150996,5,"MB","PT",2,0,null,0,null,0,null,0,null,0,null,"No"]
["Niles Dial-A-Ride","Niles","MI",5038,50038,"City, County or Local Government Unit or Department of Transportation","Reduced Reporter",278165,5,"MB","DO",1,1,null,0,null,1,null,0,null,0,null,"No"]
["Fond du Lac Reservation","Cloquet","MN","5T05",55246,"Tribe","Reduced Reporter",0,5,"MB","DO",1,0,null,0,null,0,null,0,null,0,null,"No"]
["Municipality of Dorado","Dorado","PR",4198,40198,"City, County or Local Government Unit or Department of Transportation","Reduced Reporter",2148346,5,"MB","PT",1,0,null,0,null,0,null,0,null,0,null,"No"]
["Hopi Tribe","Kykotsmovi","AZ","9T24",99382,"Tribe","Reduced Reporter",0,4,"MB","DO",4,0,null,0,null,0,null,0,null,0,null,"No"]
["State of Connecticut - CTTransit - Nason - Torrington-Winsted","Torrington","CT",1132,10132,"Private-For-Profit Corporation","Reduced Reporter",924859,4,"CB","PT",4,0,null,0,null,0,null,0,null,0,null,"No"]
["City of Lynwood","Lynwood","CA",null,90281,"City, County or Local Government Unit or Department of Transportation","Reduced Reporter",12150996,4,"MB","PT",4,0,null,0,null,0,null,0,null,0,null,"No"]
["Village of Kiryas Joel","Monroe","NY",2187,20187,"City, County or Local Government Unit or Department of Transportation","Reduced Reporter",423566,4,"MB","DO",4,0,null,0,null,0,null,0,null,0,null,"No"]
["Los Angeles County Department of Public Works - South Whittier","Alhambra","CA",null,90276,"City, County or Local Government Unit or Department of Transportation","Reduced Reporter",12150996,4,"MB","PT",4,1,null,0,null,1,null,0,null,0,null,"No"]
["City of Coconut Creek","Coconut Creek","FL",null,40238,"City, County or Local Government Unit or Department of Transportation","Reduced Reporter",5502379,4,"MB","DO",4,0,null,0,null,0,null,0,null,0,null,"No"]
["Weirton Transit Corporation","Weirton","WV",3066,30066,"Other Publicly-Owned or Privately Chartered Corporation","Reduced Reporter",70889,4,"MB","DO",4,1,null,0,null,1,null,1,null,0,null,"No"]
["City of Pompano Beach","Pompano Beach","FL",null,40257,"City, County or Local Government Unit or Department of Transportation","Reduced Reporter",5502379,4,"MB","PT",4,1,null,0,null,1,null,0,null,0,null,"No"]
["Casco Bay Island Transit District","Portland","ME",1088,10088,"Independent Public Agency or Authority of Transit Service","Full Reporter",203914,4,"FB","DO",4,1,null,0,null,1,null,0,null,0,null,"No"]
["City of Hallandale Beach","Hallandale Beach","FL",null,40249,"City, County or Local Government Unit or Department of Transportation","Reduced Reporter",5502379,4,"MB","PT",4,0,null,0,null,0,null,0,null,0,null,"No"]
["Yankton Sioux Tribe","Wagner","SD","8T16",88194,"Tribe","Reduced Reporter",0,4,"MB","DO",3,0,null,0,null,0,null,0,null,0,null,"No"]
["East Chicago Transit","East Chicago","IN",5042,50042,"City, County or Local Government Unit or Department of Transportation","Full Reporter",8608208,4,"MB","DO",3,0,null,0,null,0,null,0,null,0,null,"No"]
["Bristol Virginia Transit","Bristol","VA",3053,30053,"City, County or Local Government Unit or Department of Transportation","Reduced Reporter",69501,4,"MB","DO",3,1,null,0,null,1,null,0,null,0,null,"No"]
["Henderson County/ Apple Country Public Transit","Hendersonville","NC",4229,40229,"City, County or Local Government Unit or Department of Transportation","Reduced Reporter",280648,4,"MB","PT",3,0,null,0,null,0,null,0,null,0,null,"No"]
["Susanville Indian Rancheria","Susanville","CA","9T08",99256,"Tribe","Reduced Reporter",0,4,"MB","DO",3,0,null,0,null,0,null,0,null,0,null,"No"]
["Nez Perce Tribe","Lapwai","ID","0T12",135,"Tribe","Reduced Reporter",0,4,"MB","DO",3,0,null,0,null,0,null,0,null,0,null,"No"]
["Winnebago Tribe of Nebraska","Winnebago","NE","7T04",70004,"Tribe","Reduced Reporter",0,4,"MB","DO",3,0,null,0,null,0,null,0,null,0,null,"No"]
["City of Conroe","Conroe","TX",6129,60129,"City, County or Local Government Unit or Department of Transportation","Reduced Reporter",239938,4,"MB","PT",2,0,null,0,null,0,null,0,null,0,null,"No"]
["Coeur d'Alene Tribe dba Citylink Transit","Worley","ID",53,53,"Tribe","Reduced Reporter",98378,4,"MB","DO",2,0,null,0,null,0,null,0,null,0,null,"No"]
["City of Maywood","Maywood","CA",null,90284,"City, County or Local Government Unit or Department of Transportation","Reduced Reporter",12150996,4,"MB","PT",2,0,null,0,null,0,null,0,null,0,null,"No"]
["Municipality of Manati","Manati","PR",4145,40145,"City, County or Local Government Unit or Department of Transportation","Reduced Reporter",2148346,4,"MB","DO",2,2,null,0,null,2,null,1,null,0,null,"No"]
["Municipality of Humacao","Humacao","PR",4126,40126,"City, County or Local Government Unit or Department of Transportation","Reduced Reporter",2148346,4,"MB","DO",2,2,null,0,null,2,null,1,null,0,null,"No"]
["City of Bellflower","Bellflower","CA",null,90254,"City, County or Local Government Unit or Department of Transportation","Reduced Reporter",12150996,4,"MB","PT",2,0,null,0,null,0,null,0,null,0,null,"No"]
["Lewiston Transit System","Lewiston","ID",48,48,"City, County or Local Government Unit or Department of Transportation","Reduced Reporter",51924,4,"MB","DO",2,0,null,0,null,0,null,0,null,0,null,"No"]
["Yurok Tribe","Klamath","CA","9T09",99262,"Tribe","Reduced Reporter",0,4,"FB","DO",1,0,null,2,null,2,null,0,null,0,null,{"$f":"IF(V1026&T1026&R1026&P1026&N1026<>\"\",\"Yes\",\"No\")","v":"No"}]
["Municipality of Aguada","Aguada","PR",4114,40114,"City, County or Local Government Unit or Department of Transportation","Reduced Reporter",306196,4,"MB","DO",1,1,null,0,null,1,null,0,null,0,null,"No"]
["Town of Lexington","Lexington","MA",1159,10181,"City, County or Local Government Unit or Department of Transportation","Reduced Reporter",4181019,3,"MB","PT",3,0,null,0,null,0,null,0,null,0,null,"No"]
["Squaxin Island Tribe","Shelton","WA","0T16",103,"Tribe","Reduced Reporter",0,3,"MB","DO",3,0,null,0,null,0,null,0,null,0,null,"No"]
["City of Salisbury - Salisbury","Salisbury","NC",4233,40233,"City, County or Local Government Unit or Department of Transportation","Reduced Reporter",214881,3,"MB","DO",3,0,null,0,null,0,null,0,null,0,null,"No"]
["Liberty Transit","Hinesville","GA",4193,40193,"City, County or Local Government Unit or Department of Transportation","Reduced Reporter",51456,3,"MB","PT",3,0,null,0,null,0,null,0,null,0,null,"No"]
["Blue Lake Rancheria","Blue Lake","CA","9T02",99292,"Tribe","Reduced Reporter",0,3,"MB","DO",3,2,null,0,null,2,null,0,null,0,null,"No"]
["McKinney Avenue Transit Authority","Dallas","TX",6133,60133,"Private-Non-Profit Corporation","Full Reporter",5121892,3,"SR","DO",3,0,null,0,null,0,null,0,null,0,null,"No"]
["City of Burlington","Burlington","MA",1158,10180,"City, County or Local Government Unit or Department of Transportation","Reduced Reporter",4181019,3,"MB","PT",3,0,null,0,null,0,null,0,null,0,null,"No"]
["Zuni Pueblo","Zuni","NM","6T22",66242,"Tribe","Reduced Reporter",0,3,"MB","DO",3,0,null,0,null,0,null,0,null,0,null,"No"]
["City of Hollywood","Hollywood","FL",null,40255,"City, County or Local Government Unit or Department of Transportation","Reduced Reporter",5502379,3,"MB","PT",3,0,null,0,null,0,null,0,null,0,null,"No"]
["Ute Tribe","Fort Duchesne","UT","8T19",88200,"Tribe","Reduced Reporter",0,3,"MB","DO",3,0,null,0,null,0,null,0,null,0,null,"No"]
["New York City Economic Development Corporation","New York","NY",null,22930,"Private-Non-Profit Corporation","Full Reporter",18351295,3,"FB","PT",3,5,null,2,null,7,null,0,null,0,null,"No"]
["City of Atlanta - Department of Public Works - Transit Division","Atlanta","GA",4230,40230,"City, County or Local Government Unit or Department of Transportation","Full Reporter",4515419,3,"SR","DO",3,0,null,0,null,0,null,0,null,0,null,"No"]
["Gulkana Village Council","Gakona","AK","0T08",85,"Tribe","Reduced Reporter",0,3,"MB","DO",2,0,null,0,null,0,null,0,null,0,null,"No"]
["Northern Cheyenne Tribe","Lame Deer","MT","8T07",88116,"Tribe","Reduced Reporter",0,3,"MB","DO",2,0,null,0,null,0,null,0,null,0,null,"No"]
["Reno-Sparks Indian Colony","Reno","NV","9T11",90011,"Tribe","Reduced Reporter",0,3,"MB","DO",2,0,null,0,null,0,null,0,null,0,null,"No"]
["Municipality of Catano","Catano","PR",4163,40163,"City, County or Local Government Unit or Department of Transportation","Reduced Reporter",2148346,3,"MB","DO",2,1,null,0,null,1,null,1,null,0,null,"No"]
["Lac du Flambeau Band of Lake Superior Chippewa Indians","Lac Du Flambeau","WI","5T17",55300,"Tribe","Reduced Reporter",0,3,"MB","PT",1,0,null,0,null,0,null,0,null,0,null,"No"]
["City of Moorpark","Moorpark","CA",9227,90227,"City, County or Local Government Unit or Department of Transportation","Reduced Reporter",214811,2,"MB","PT",2,0,null,0,null,0,null,0,null,0,null,"No"]
["City of Dania Beach","Dania Beach","FL",null,40261,"City, County or Local Government Unit or Department of Transportation","Reduced Reporter",5502379,2,"MB","PT",2,0,null,0,null,0,null,0,null,0,null,"No"]
["Seneca Nation of Indians","Salamanca","NY","2T02",22929,"Tribe","Reduced Reporter",0,2,"MB","PT",2,0,null,0,null,0,null,0,null,0,null,"No"]
["Turtle Mountain Band of Chippewa Indian","Belcourt","ND","8T13",88146,"Tribe","Reduced Reporter",0,2,"MB","DO",2,0,null,0,null,0,null,0,null,0,null,"No"]
["Bad River Band of Lake Superior Tribe of Chippewa","Odanah","WI","5T12",55282,"Tribe","Reduced Reporter",0,2,"MB","DO",2,0,null,0,null,0,null,0,null,0,null,"No"]
["The Looper Group, Inc.","St. Petersburg","FL",null,40258,"Private-Non-Profit Corporation","Full Reporter",2441770,2,"MB","DO",2,0,null,0,null,0,null,0,null,0,null,"No"]
["City of Coral Springs","Coral Springs","FL",null,40253,"City, County or Local Government Unit or Department of Transportation","Reduced Reporter",5502379,2,"MB","PT",2,0,null,0,null,0,null,0,null,0,null,"No"]
["Quinault Tribe of the Quinault Reservation","Taholah","WA","0T21",183,"Tribe","Reduced Reporter",0,2,"MB","DO",2,0,null,0,null,0,null,0,null,0,null,"No"]
["Kaser Bus Service","Monsey","NY",2176,20176,"Independent Public Agency or Authority of Transit Service","Reduced Reporter",18351295,2,"MB","PT",2,0,null,0,null,0,null,0,null,0,null,"No"]
["Yavapai-Apache Nation","Camp Verde","AZ","9T14",99328,"Tribe","Reduced Reporter",0,2,"MB","DO",2,0,null,0,null,0,null,0,null,0,null,"No"]
["Brunswick Transit Alternative","Brunswick","OH",5143,50143,"City, County or Local Government Unit or Department of Transportation","Full Reporter",1780673,2,"MB","DO",2,0,null,0,null,0,null,0,null,0,null,"No"]
["City of Lauderdale Lakes","Lauderdale Lakes","FL",null,40250,"City, County or Local Government Unit or Department of Transportation","Reduced Reporter",5502379,2,"MB","PT",2,1,null,0,null,1,null,0,null,0,null,"No"]
["City of Mechanicville","Mechanicville","NY",2213,20213,"City, County or Local Government Unit or Department of Transportation","Reduced Reporter",594962,2,"MB","DO",2,0,null,0,null,0,null,0,null,0,null,"No"]
["City of Lawndale","Lawndale","CA",null,90280,"City, County or Local Government Unit or Department of Transportation","Reduced Reporter",12150996,2,"MB","PT",2,1,null,0,null,1,null,1,null,0,null,"No"]
["Lummi Nation","Bellingham","WA","0T11",95,"Tribe","Reduced Reporter",0,2,"MB","DO",2,0,null,0,null,0,null,0,null,0,null,"No"]
["Los Angeles County Dept. of Public Works - Florence-Firestone","Alhambra","CA",null,90273,"City, County or Local Government Unit or Department of Transportation","Reduced Reporter",12150996,2,"MB","PT",2,0,null,0,null,0,null,0,null,0,null,"No"]
["Pyramid Lake Paiute Tribe","Nixon","NV","9T31",99406,"Tribe","Reduced Reporter",0,2,"MB","DO",2,0,null,0,null,0,null,0,null,0,null,"No"]
["Oldham's Public Bus","LaGrange","KY",4218,40218,"City, County or Local Government Unit or Department of Transportation","Reduced Reporter",972546,2,"MB","DO",2,0,null,0,null,0,null,0,null,0,null,"No"]
["City of Duarte","Duarte","CA",null,90264,"City, County or Local Government Unit or Department of Transportation","Reduced Reporter",12150996,2,"MB","DO",2,0,null,0,null,0,null,0,null,0,null,"No"]
["City of Tamarac","Taramac","FL",null,44932,"City, County or Local Government Unit or Department of Transportation","Reduced Reporter",5502379,2,"MB","DO",2,0,null,0,null,0,null,0,null,0,null,"No"]
["Flight Line, Inc.","Salem","NH",1135,11154,"Private-For-Profit Corporation","Reduced Reporter",158377,2,"CB","DO",2,0,null,0,null,0,null,0,null,0,null,"No"]
["Fort Belknap Indian Community","Harlem","MT","8T05",88170,"Tribe","Reduced Reporter",0,2,"MB","DO",2,0,null,0,null,0,null,0,null,0,null,"No"]
["City of Beverly","Beverly","MA",1157,10179,"City, County or Local Government Unit or Department of Transportation","Reduced Reporter",4181019,2,"MB","PT",2,0,null,0,null,0,null,0,null,0,null,"No"]
["Chemehuevi Indian Tribe","Havasu Lake ","CA","9T27",99316,"Tribe","Reduced Reporter",0,2,"FB","DO",2,2,null,0,null,2,null,0,null,0,null,"No"]
["Pierce County Ferry Operations","Tacoma","WA",28,28,"City, County or Local Government Unit or Department of Transportation","Full Reporter",3059393,2,"FB","PT",2,3,null,0,null,3,null,1,null,0,null,"No"]
["Bay Mills Indian Community","Brimley","MI","5T07",50007,"Tribe","Reduced Reporter",0,2,"MB","DO",2,0,null,0,null,0,null,0,null,0,null,"No"]
["Los Angeles County Dept. of Public Works - Willowbrook Shuttle","Alhambra","CA",null,90278,"City, County or Local Government Unit or Department of Transportation","Reduced Reporter",12150996,2,"MB","PT",2,0,null,0,null,0,null,0,null,0,null,"No"]
["Federal Programs Municipality of Gurabo","Gurabo","PR",4123,40123,"City, County or Local Government Unit or Department of Transportation","Reduced Reporter",2148346,2,"MB","DO",1,0,null,0,null,0,null,0,null,0,null,"No"]
["City of Milton-Freewater","MiltonFreewater","OR",63,63,"City, County or Local Government Unit or Department of Transportation","Reduced Reporter",55805,2,"MB","PT",1,1,null,0,null,1,null,0,null,0,null,"No"]
["East Windsor Township","East Windsor","NJ",2194,20194,"City, County or Local Government Unit or Department of Transportation","Reduced Reporter",64037,2,"MB","PT",1,0,null,0,null,0,null,0,null,0,null,"No"]
["East Windsor Township","East Windsor","NJ",2194,20194,"City, County or Local Government Unit or Department of Transportation","Reduced Reporter",64037,2,"MB","DO",1,0,null,0,null,0,null,0,null,0,null,"No"]
["Los Angeles County Department of Public Works - East Valinda","Alhambra","CA",null,90272,"City, County or Local Government Unit or Department of Transportation","Reduced Reporter",12150996,1,"MB","PT",1,0,null,0,null,0,null,0,null,0,null,"No"]
["Makah Tribal Council","Neah Bay ","WA","0T36",36,"Tribe","Reduced Reporter",0,1,"MB","DO",1,0,null,0,null,0,null,0,null,0,null,"No"]
["The Tulalip Tribes of Washington","Tulalip","WA",60,60,"Tribe","Reduced Reporter",145140,1,"MB","DO",1,0,null,0,null,0,null,0,null,0,null,"No"]
["Nome Eskimo Community","Nome","AK","0T41",271,"Tribe","Reduced Reporter",0,1,"MB","DO",1,0,null,0,null,0,null,0,null,0,null,"No"]
["Tetlin Village Council","Tok","AK","0T18",159,"Tribe","Reduced Reporter",0,1,"MB","DO",1,0,null,0,null,0,null,0,null,0,null,"No"]
["Los Angeles County Dept. of Public Works - King Medical Center Shuttle Service","Alhambra","CA",null,90274,"City, County or Local Government Unit or Department of Transportation","Reduced Reporter",12150996,1,"MB","PT",1,0,null,0,null,0,null,0,null,0,null,"No"]
["Los Angeles County Dept. of Public Works - Athens Shuttle Service","Alhambra","CA",null,90269,"City, County or Local Government Unit or Department of Transportation","Reduced Reporter",12150996,1,"MB","PT",1,0,null,0,null,0,null,0,null,0,null,"No"]
["Sitka Tribe of Alaska","Sitka","AK","0T14",14,"Tribe","Reduced Reporter",0,1,"MB","DO",1,0,null,0,null,0,null,0,null,0,null,"No"]
["Town of Bedford","Bedford","MA",1156,10178,"City, County or Local Government Unit or Department of Transportation","Reduced Reporter",4181019,1,"MB","DO",1,0,null,0,null,0,null,0,null,0,null,"No"]
["City of West Park","West Park","FL",null,40263,"City, County or Local Government Unit or Department of Transportation","Reduced Reporter",5502379,1,"MB","PT",1,0,null,0,null,0,null,0,null,0,null,"No"]
["Lower Elwha Klallam Tribe","Port Angeles","WA",null,401,"Tribe","Reduced Reporter",0,1,"MB","DO",1,0,null,0,null,0,null,0,null,0,null,"No"]
["Village of Spring Valley Bus","Spring Valley","NY",2089,20089,"City, County or Local Government Unit or Department of Transportation","Reduced Reporter",18351295,1,"MB","DO",1,0,null,0,null,0,null,0,null,0,null,"No"]
["Town of Hillsboro Beach","Hillsboro Beach","FL",null,40248,"City, County or Local Government Unit or Department of Transportation","Reduced Reporter",5502379,1,"MB","PT",1,0,null,0,null,0,null,0,null,0,null,"No"]
["Town of Lauderdale-By-The-Sea","Lauderdale-By-The-Sea","FL",null,40260,"City, County or Local Government Unit or Department of Transportation","Reduced Reporter",5502379,1,"MB","PT",1,0,null,0,null,0,null,0,null,0,null,"No"]
["City of Lighthouse Point","Lighthouse Point","FL",null,40240,"City, County or Local Government Unit or Department of Transportation","Reduced Reporter",5502379,1,"MB","DO",1,0,null,0,null,0,null,0,null,0,null,{"$f":"IF(V1090&T1090&R1090&P1090&N1090<>\"\",\"Yes\",\"No\")","v":"No"}]
["Mission Hill Link, Inc.","Boston","MA",1160,10182,"Private-Non-Profit Corporation","Reduced Reporter",4181019,1,"MB","PT",1,0,null,0,null,0,null,0,null,0,null,"No"]
["Gwichyaa Zhee Tribal Transit Service","Fort Yukon","AK",null,400,"Tribe","Reduced Reporter",0,1,"MB","DO",1,0,null,0,null,0,null,0,null,0,null,"No"]
["Manley Village Council","Manley Hot Springs","AK","0T20",175,"Tribe","Reduced Reporter",0,1,"MB","DO",1,0,null,0,null,0,null,0,null,0,null,"No"]
["Los Angeles County Dept. of Public Works - Lennox Shuttle","Alhambra","CA",null,90275,"City, County or Local Government Unit or Department of Transportation","Reduced Reporter",12150996,1,"MB","PT",1,0,null,0,null,0,null,0,null,0,null,"No"]
["Los Angeles County Department of Public Works - Avocado Heights","Alhambra","CA",null,90270,"City, County or Local Government Unit or Department of Transportation","Reduced Reporter",12150996,1,"MB","PT",1,0,null,0,null,0,null,0,null,0,null,"No"]
["Seldovia Village Tribe","Seldovia","AK","0T23",199,"Tribe","Reduced Reporter",0,1,"FB","DO",1,2,null,0,null,2,null,0,null,0,null,"No"]

{"sheet":"Agency Totals","index":3,"n_rows":842,"n_cols":23,"rows_kept":842,"cut":false,"hidden":false,"merged":[]}
["Name","City","State","Legacy NTD ID","NTD ID","Organization Type","Reporter Type","Primary UZA Population","Agency VOMS","ADA Accessible Stations","ADA Accessible Stations Questionable","Non-ADA Accessible Stations","Non-ADA Accessible Stations Questionable","Total Stations","Total Stations Questionable","Elevators","Elevators Questionable","Escalators","Escalators Questionable","Any data questionable?",null,null,{"$f":"IF(W4=1,1,0)","v":1}]
["MTA New York City Transit","New York","NY",2008,20008,"Subsidiary Unit of a Transit Agency, Reporting Separately","Full Reporter",18351295,11004,113,null,358,null,471,null,264,null,209,null,{"$f":"IF(S2&Q2&O2&M2&K2<>\"\",\"Yes\",\"No\")","v":"No"},null,null,"Hide questionable data tags"]
["New Jersey Transit Corporation","Newark","NJ",2080,20080,"Other Publicly-Owned or Privately Chartered Corporation","Full Reporter",18351295,4056,164,null,93,null,257,null,129,null,77,null,{"$f":"IF(S3&Q3&O3&M3&K3<>\"\",\"Yes\",\"No\")","v":"No"},null,null,"Show questionable data tags"]
["Los Angeles County Metropolitan Transportation Authority dba: Metro","Los Angeles","CA",9154,90154,"Independent Public Agency or Authority of Transit Service","Full Reporter",12150996,3544,151,null,0,null,151,null,195,null,190,null,"No",null,null,1]
["Washington Metropolitan Area Transit Authority","Washington","DC",3030,30030,"Independent Public Agency or Authority of Transit Service","Full Reporter",4586770,3172,94,null,0,null,94,null,278,null,618,null,"No"]
["King County Department of Transportation","Seattle","WA",1,1,"City, County or Local Government Unit or Department of Transportation","Full Reporter",3059393,2818,37,null,3,null,40,null,34,null,40,null,"No"]
["Chicago Transit Authority","Chicago","IL",5066,50066,"Independent Public Agency or Authority of Transit Service","Full Reporter",8608208,2712,98,null,47,null,145,null,147,null,158,null,"No"]
["Massachusetts Bay Transportation Authority","Boston","MA",1003,10003,"Independent Public Agency or Authority of Transit Service","Full Reporter",4181019,2374,270,null,73,null,343,null,181,null,198,null,"No"]
["Southeastern Pennsylvania Transportation Authority","Philadelphia","PA",3019,30019,"Independent Public Agency or Authority of Transit Service","Full Reporter",5441567,2339,109,null,169,null,278,null,113,null,59,null,"No"]
["Metropolitan Transit Authority of Harris County, Texas","Houston","TX",6008,60008,"Independent Public Agency or Authority of Transit Service","Full Reporter",4944332,2206,143,null,0,null,143,null,14,null,8,null,"No"]
["Maryland Transit Administration","Baltimore","MD",3034,30034,"State Government Unit or Department of Transportation","Full Reporter",2203663,1634,71,null,18,null,89,null,38,null,84,null,"No"]
["Pace - Suburban Bus Division","Arlington Heights","IL",5113,50113,"Independent Public Agency or Authority of Transit Service","Full Reporter",8608208,1619,152,null,33,null,185,null,23,null,23,null,"No"]
["Orange County Transportation Authority","Orange","CA",9036,90036,"Independent Public Agency or Authority of Transit Service","Full Reporter",12150996,1558,34,null,0,null,34,null,23,null,4,null,"No"]
["Denver Regional Transportation District","Denver","CO",8006,80006,"Independent Public Agency or Authority of Transit Service","Full Reporter",2374203,1435,59,null,0,null,59,null,67,null,10,null,"No"]
["Miami-Dade Transit","Miami","FL",4034,40034,"City, County or Local Government Unit or Department of Transportation","Full Reporter",5502379,1181,44,null,0,null,44,null,86,null,86,null,"No"]
["Metro-North Commuter Railroad Company, dba: MTA Metro-North Railroad","New York","NY",2078,20078,"Subsidiary Unit of a Transit Agency, Reporting Separately","Full Reporter",18351295,1175,51,null,67,null,118,null,148,null,32,null,"No"]
["MTA Bus Company","New York","NY",2188,20188,"Subsidiary Unit of a Transit Agency, Reporting Separately","Full Reporter",18351295,1093,1,null,1,null,2,null,0,null,0,null,"No"]
["Utah Transit Authority","Salt Lake City","UT",8001,80001,"Independent Public Agency or Authority of Transit Service","Full Reporter",1021243,1087,101,null,0,null,101,null,12,null,2,null,"No"]
["Dallas Area Rapid Transit","Dallas","TX",6056,60056,"Independent Public Agency or Authority of Transit Service","Full Reporter",5121892,1069,96,null,0,null,96,null,32,null,8,null,"No"]
["Northeast Illinois Regional Commuter Railroad Corporation dba: Metra Rail","Chicago","IL",5118,50118,"Independent Public Agency or Authority of Transit Service","Full Reporter",8608208,1061,184,null,57,null,241,null,36,null,24,null,"No"]
["MTA Long Island Rail Road","Jamaica","NY",2100,20100,"Subsidiary Unit of a Transit Agency, Reporting Separately","Full Reporter",18351295,1020,103,null,21,null,124,null,37,null,19,null,"No"]
["Metropolitan Atlanta Rapid Transit Authority","Atlanta","GA",4022,40022,"Independent Public Agency or Authority of Transit Service","Full Reporter",4515419,1011,39,null,0,null,39,null,97,null,149,null,"No"]
["San Francisco Municipal Railway","San Francisco","CA",9015,90015,"City, County or Local Government Unit or Department of Transportation","Full Reporter",3281212,985,9,null,0,null,9,null,28,null,11,null,"No"]
["Tri-County Metropolitan Transportation District of Oregon","Portland","OR",8,8,"Independent Public Agency or Authority of Transit Service","Full Reporter",1849898,950,55,null,0,null,55,null,16,null,0,null,"No"]
["Port Authority of Allegheny County","Pittsburgh","PA",3022,30022,"Independent Public Agency or Authority of Transit Service","Full Reporter",1733853,939,44,null,0,null,44,null,17,null,19,null,"No"]
["Metro Transit","Minneapolis","MN",5027,50027,"Subsidiary Unit of a Transit Agency, Reporting Separately","Full Reporter",2650890,843,71,null,0,null,71,null,56,null,25,null,"No"]
["VIA Metropolitan Transit","San Antonio","TX",6011,60011,"Independent Public Agency or Authority of Transit Service","Full Reporter",1758210,816,10,null,0,null,10,null,0,null,0,null,"No"]
["City and County of Honolulu Department of Transportation Services","Honolulu","HI",9002,90002,"City, County or Local Government Unit or Department of Transportation","Full Reporter",802459,812,1,null,0,null,1,null,0,null,0,null,"No"]
["San Diego Metropolitan Transit System","San Diego","CA",9026,90026,"Independent Public Agency or Authority of Transit Service","Full Reporter",2956746,765,57,null,0,null,57,null,11,null,4,null,"No"]
["Capital Metropolitan Transportation Authority","Austin","TX",6048,60048,"Independent Public Agency or Authority of Transit Service","Full Reporter",1362416,732,17,null,0,null,17,null,0,null,0,null,"No"]
["Alameda-Contra Costa Transit District","Oakland","CA",9014,90014,"Independent Public Agency or Authority of Transit Service","Full Reporter",3281212,702,6,null,0,null,6,null,22,null,0,null,"No"]
["Santa Clara Valley Transportation Authority","San Jose","CA",9013,90013,"Independent Public Agency or Authority of Transit Service","Full Reporter",1664496,686,77,null,0,null,77,null,11,null,28,null,"No"]
["Regional Transportation Commission of Southern Nevada","Las Vegas","NV",9045,90045,"Independent Public Agency or Authority of Transit Service","Full Reporter",1886011,612,5,null,0,null,5,null,0,null,0,null,"No"]
["Snohomish County Public Transportation Benefit Area Corporation","Everett","WA",29,29,"Independent Public Agency or Authority of Transit Service","Full Reporter",3059393,609,3,null,0,null,3,null,0,null,0,null,"No"]
["Central Florida Regional Transportation Authority","Orlando","FL",4035,40035,"Independent Public Agency or Authority of Transit Service","Full Reporter",1510516,581,3,null,0,null,3,null,0,null,0,null,"No"]
["City of Phoenix Public Transit Department dba Valley Metro","Phoenix","AZ",9032,90032,"City, County or Local Government Unit or Department of Transportation","Full Reporter",3629114,565,4,null,0,null,4,null,0,null,0,null,"No"]
["The Greater Cleveland Regional Transit Authority","Cleveland","OH",5015,50015,"Independent Public Agency or Authority of Transit Service","Full Reporter",1780673,545,40,null,24,null,64,null,23,null,12,null,"No"]
["San Francisco Bay Area Rapid Transit District","Oakland","CA",9003,90003,"Independent Public Agency or Authority of Transit Service","Full Reporter",3281212,545,46,null,0,null,46,null,128,null,181,null,"No"]
["Pierce County Transportation Benefit Area Authority","Tacoma","WA",3,3,"Independent Public Agency or Authority of Transit Service","Full Reporter",3059393,533,28,null,0,null,28,null,5,null,0,null,"No"]
["Potomac and Rappahannock Transportation Commission","Woodbridge","VA",3070,30070,"Independent Public Agency or Authority of Transit Service","Full Reporter",4586770,532,2,null,0,null,2,null,0,null,0,null,"No"]
["Delaware Transit Corporation","Dover","DE",3075,30075,"Independent Public Agency or Authority of Transit Service","Full Reporter",5441567,481,7,null,0,null,7,null,2,null,2,null,"No"]
["Bi-State Development Agency of the Missouri-Illinois Metropolitan District, d.b.a.(St. Louis) Metro","St. Louis","MO",7006,70006,"Independent Public Agency or Authority of Transit Service","Full Reporter",2150706,480,62,null,0,null,62,null,8,null,19,null,"No"]
["Broward County Transit Division","Plantation","FL",4029,40029,"City, County or Local Government Unit or Department of Transportation","Full Reporter",5502379,471,4,null,0,null,4,null,0,null,0,null,"No"]
["City of Detroit Department of Transportation","Detroit","MI",5119,50119,"City, County or Local Government Unit or Department of Transportation","Full Reporter",3734090,456,1,null,0,null,1,null,1,null,1,null,"No"]
["Ben Franklin Transit","Richland","WA",18,18,"Independent Public Agency or Authority of Transit Service","Full Reporter",210975,431,1,null,0,null,1,null,0,null,0,null,"No"]
["Board of County Commissioners, Palm Beach County, PalmTran, Inc.","West Palm Beach","FL",4037,40037,"City, County or Local Government Unit or Department of Transportation","Full Reporter",5502379,424,1,null,0,null,1,null,1,null,0,null,"No"]
["Charlotte Area Transit System","Charlotte","NC",4008,40008,"City, County or Local Government Unit or Department of Transportation","Full Reporter",1249442,421,23,null,0,null,23,null,9,null,0,null,"No"]
["Milwaukee County Transit System","Milwaukee","WI",5008,50008,"City, County or Local Government Unit or Department of Transportation","Full Reporter",1376476,421,1,null,0,null,1,null,1,null,2,null,"No"]
["Regional Public Transportation Authority, dba: Valley Metro","Phoenix","AZ",9136,90136,"Independent Public Agency or Authority of Transit Service","Full Reporter",3629114,384,2,null,0,null,2,null,0,null,0,null,"No"]
["San Mateo County Transit District","San Carlos","CA",9009,90009,"Independent Public Agency or Authority of Transit Service","Full Reporter",3281212,371,16,null,1,null,17,null,5,null,3,null,"No"]
["Central Puget Sound Regional Transit Authority","Seattle","WA",40,40,"Independent Public Agency or Authority of Transit Service","Full Reporter",3059393,371,54,null,0,null,54,null,75,null,74,null,"No"]
["Transportation District Commission of Hampton Roads","Hampton","VA",3083,30083,"Independent Public Agency or Authority of Transit Service","Full Reporter",1439666,369,21,null,0,null,21,null,1,null,0,null,"No"]
["Central Ohio Transit Authority","Columbus","OH",5016,50016,"Independent Public Agency or Authority of Transit Service","Full Reporter",1368035,359,5,null,0,null,5,null,1,null,1,null,"No"]
["City of Los Angeles Department of Transportation","Los Angeles","CA",9147,90147,"City, County or Local Government Unit or Department of Transportation","Full Reporter",12150996,355,4,null,0,null,4,null,0,null,0,null,"No"]
["Niagara Frontier Transportation Authority","Buffalo","NY",2004,20004,"Independent Public Agency or Authority of Transit Service","Full Reporter",935906,352,24,null,0,null,24,null,19,null,24,null,"No"]
["Nassau Inter County Express","Garden City","NY",2206,20206,"City, County or Local Government Unit or Department of Transportation","Full Reporter",18351295,352,1,null,0,null,1,null,0,null,0,null,"No"]
["Southwest Ohio Regional Transit Authority","Cincinnati","OH",5012,50012,"City, County or Local Government Unit or Department of Transportation","Full Reporter",1624827,350,21,null,0,null,21,null,2,null,0,null,"No"]
["Lane Transit District","Eugene","OR",7,7,"Independent Public Agency or Authority of Transit Service","Full Reporter",247421,342,15,null,0,null,15,null,0,null,0,null,"No"]
["Westchester County Bee-Line System","Mount Vernon","NY",2076,20076,"City, County or Local Government Unit or Department of Transportation","Full Reporter",18351295,340,2,null,0,null,2,null,0,null,0,null,"No"]
["City of Tuscon","Tucson   ","AZ",9033,90033,"City, County or Local Government Unit or Department of Transportation","Full Reporter",843168,336,3,null,0,null,3,null,0,null,0,null,"No"]
["Cape Cod Regional Transit Authority","Hyannis","MA",1105,10105,"Independent Public Agency or Authority of Transit Service","Full Reporter",246695,335,1,null,0,null,1,null,1,null,0,null,"No"]
["Greater Richmond Transit Company","Richmond","VA",3006,30006,"Other Publicly-Owned or Privately Chartered Corporation","Full Reporter",953556,330,0,null,0,null,0,null,0,null,0,null,"No"]
["Foothill Transit","West Covina","CA",9146,90146,"Independent Public Agency or Authority of Transit Service","Full Reporter",12150996,318,2,null,0,null,2,null,0,null,0,null,"No"]
["Suburban Mobility Authority for Regional Transportation","Detroit","MI",5031,50031,"Independent Public Agency or Authority of Transit Service","Full Reporter",3734090,317,2,null,0,null,2,null,0,null,0,null,"No"]
["Transit Authority of River City","Louisville","KY",4018,40018,"Independent Public Agency or Authority of Transit Service","Full Reporter",972546,316,2,null,0,null,2,null,0,null,0,null,"No"]
["Spokane Transit Authority","Spokane","WA",2,2,"Independent Public Agency or Authority of Transit Service","Full Reporter",387847,307,1,null,0,null,1,null,2,null,1,null,"No"]
["Port Authority Trans-Hudson Corporation","Jersey City","NJ",2098,20098,"Independent Public Agency or Authority of Transit Service","Full Reporter",18351295,303,9,null,6,null,15,null,24,null,34,null,{"$f":"IF(S67&Q67&O67&M67&K67<>\"\",\"Yes\",\"No\")","v":"No"}]
["Suffolk County Department of Public Works - Transportation Division","Yaphank","NY",2072,20072,"City, County or Local Government Unit or Department of Transportation","Full Reporter",18351295,300,0,null,0,null,0,null,0,null,0,null,"No"]
["Kansas City Area Transportation Authority","Kansas City","MO",7005,70005,"Independent Public Agency or Authority of Transit Service","Full Reporter",1519417,298,0,null,0,null,0,null,0,null,0,null,"No"]
["Capital Area Transit","Raleigh","NC",4007,40007,"City, County or Local Government Unit or Department of Transportation","Full Reporter",884891,298,1,null,0,null,1,null,1,null,0,null,"No"]
["Pinellas Suncoast Transit Authority","St. Petersburg","FL",4027,40027,"Independent Public Agency or Authority of Transit Service","Full Reporter",2441770,295,4,null,0,null,4,null,0,null,0,null,"No"]
["Rhode Island Public Transit Authority","Providence","RI",1001,10001,"Independent Public Agency or Authority of Transit Service","Full Reporter",1190956,291,1,null,0,null,1,null,0,null,0,null,"No"]
["Intercity Transit","Olympia","WA",19,19,"Independent Public Agency or Authority of Transit Service","Full Reporter",176617,286,4,null,0,null,4,null,0,null,0,null,"No"]
["Ride-On Montgomery County Transit","Rockville","MD",3051,30051,"City, County or Local Government Unit or Department of Transportation","Full Reporter",4586770,282,3,null,0,null,3,null,2,null,0,null,"No"]
["Capital District Transportation Authority","Albany","NY",2002,20002,"Independent Public Agency or Authority of Transit Service","Full Reporter",594962,277,0,null,0,null,0,null,0,null,0,null,"No"]
["Victor Valley Transit Authority","Hesperia","CA",9148,90148,"Independent Public Agency or Authority of Transit Service","Full Reporter",328454,276,0,null,0,null,0,null,0,null,0,null,"No"]
["Salem Area Mass Transit District","Salem","OR",25,25,"Independent Public Agency or Authority of Transit Service","Full Reporter",236632,276,3,null,0,null,3,null,0,null,0,null,"No"]
["Riverside Transit Agency","Riverside","CA",9031,90031,"Independent Public Agency or Authority of Transit Service","Full Reporter",1932666,274,22,null,0,null,22,null,7,null,0,null,"No"]
["Omnitrans","San Bernardino","CA",9029,90029,"Independent Public Agency or Authority of Transit Service","Full Reporter",1932666,266,10,null,0,null,10,null,2,null,0,null,"No"]
["Pioneer Valley Transit Authority","Springfield","MA",1008,10008,"Independent Public Agency or Authority of Transit Service","Full Reporter",621300,264,2,null,0,null,2,null,0,null,0,null,"No"]
["Toledo Area Regional Transit Authority","Toledo","OH",5022,50022,"Independent Public Agency or Authority of Transit Service","Full Reporter",507643,261,5,null,0,null,5,null,2,null,1,null,"No"]
["Metropolitan Transit Authority","Nashville","TN",4004,40004,"Independent Public Agency or Authority of Transit Service","Full Reporter",969587,260,2,null,0,null,2,null,2,null,4,null,"No"]
["Kitsap Transit","Bremerton","WA",20,20,"Independent Public Agency or Authority of Transit Service","Full Reporter",198979,257,15,null,1,null,16,null,2,null,0,null,"No"]
["RTS - Monroe County","Rochester","NY",2113,20113,"Independent Public Agency or Authority of Transit Service","Full Reporter",720572,257,3,null,0,null,3,null,0,null,0,null,"No"]
["Metro Transit System","Madison","WI",5005,50005,"City, County or Local Government Unit or Department of Transportation","Full Reporter",401661,254,0,null,0,null,0,null,0,null,0,null,"No"]
["Jacksonville Transportation Authority","Jacksonville","FL",4040,40040,"Independent Public Agency or Authority of Transit Service","Full Reporter",1065219,244,13,null,0,null,13,null,10,null,18,null,"No"]
["Interurban Transit Partnership","Grand Rapids","MI",5033,50033,"Independent Public Agency or Authority of Transit Service","Full Reporter",569935,241,3,null,0,null,3,null,2,null,0,null,"No"]
["Connecticut Department of Transportation - CTTRANSIT - Hartford Division","Hartford","CT",1048,10048,"State Government Unit or Department of Transportation","Full Reporter",924859,232,0,null,0,null,0,null,0,null,0,null,"No"]
["Sacramento Regional Transit District","Sacramento","CA",9019,90019,"Independent Public Agency or Authority of Transit Service","Full Reporter",1723634,232,73,null,0,null,73,null,8,null,0,null,"No"]
["North County Transit District","Oceanside","CA",9030,90030,"Independent Public Agency or Authority of Transit Service","Full Reporter",2956746,230,27,null,0,null,27,null,2,null,0,null,"No"]
["Fairfax Connector Bus System","Fairfax","VA",3068,30068,"City, County or Local Government Unit or Department of Transportation","Full Reporter",4586770,226,16,null,0,null,16,null,5,null,2,null,"No"]
["Des Moines Area Regional Transit Authority","Des Moines","IA",7010,70010,"Independent Public Agency or Authority of Transit Service","Full Reporter",450070,226,1,null,0,null,1,null,1,null,0,null,"No"]
["Academy Lines, Inc.","Hoboken","NJ",2122,20122,"Private-For-Profit Corporation","Full Reporter",18351295,225,2,null,0,null,2,null,2,null,0,null,"No"]
["Metropolitan Council","St. Paul","MN",5154,50154,"City, County or Local Government Unit or Department of Transportation","Full Reporter",2650890,219,14,null,0,null,14,null,14,null,5,null,"No"]
["Central New York Regional Transportation Authority","Syracuse","NY",2018,20018,"Independent Public Agency or Authority of Transit Service","Full Reporter",412317,208,1,null,0,null,1,null,0,null,0,null,"No"]
["METRO Regional Transit Authority","Akron","OH",5010,50010,"Independent Public Agency or Authority of Transit Service","Full Reporter",569499,208,2,null,0,null,2,null,0,null,0,null,"No"]
["Blue Water Area Transportation Commission","Port Huron","MI",5148,50148,"Independent Public Agency or Authority of Transit Service","Full Reporter",87106,205,2,null,0,null,2,null,0,null,0,null,"No"]
["Regional Transportation Commission of Washoe County","Reno","NV",9001,90001,"Independent Public Agency or Authority of Transit Service","Full Reporter",392141,204,2,null,0,null,2,null,0,null,0,null,"No"]
["Mass Transportation Authority","Flint","MI",5032,50032,"Independent Public Agency or Authority of Transit Service","Full Reporter",356218,202,1,null,0,null,1,null,0,null,0,null,"No"]
["Indianapolis and Marion County Public Transportation","Indianapolis","IN",5050,50050,"Independent Public Agency or Authority of Transit Service","Full Reporter",1487483,202,1,null,0,null,1,null,0,null,0,null,"No"]
["Hillsborough Area Regional Transit Authority","Tampa","FL",4041,40041,"Independent Public Agency or Authority of Transit Service","Full Reporter",2441770,201,14,null,0,null,14,null,1,null,0,null,"No"]
["Long Beach Transit","Long Beach","CA",9023,90023,"Other Publicly-Owned or Privately Chartered Corporation","Full Reporter",12150996,197,0,null,0,null,0,null,0,null,0,null,"No"]
["Southern California Regional Rail Authority dba: Metrolink","Los Angeles","CA",9151,90151,"Independent Public Agency or Authority of Transit Service","Full Reporter",12150996,195,59,null,0,null,59,null,25,null,0,null,"No"]
["City of Albuquerque Transit Department","Albuquerque","NM",6019,60019,"City, County or Local Government Unit or Department of Transportation","Full Reporter",741318,193,1,null,0,null,1,null,0,null,0,null,"No"]
["Fort Worth Transportation Authority","Fort Worth","TX",6007,60007,"Independent Public Agency or Authority of Transit Service","Full Reporter",5121892,192,5,null,0,null,5,null,3,null,0,null,"No"]
["Mass Transit Department - City of El Paso","El Paso","TX",6006,60006,"City, County or Local Government Unit or Department of Transportation","Full Reporter",803086,186,8,null,0,null,8,null,5,null,0,null,"No"]
["Greater Dayton Regional Transit Authority","Dayton","OH",5017,50017,"Independent Public Agency or Authority of Transit Service","Full Reporter",724091,178,9,null,0,null,9,null,0,null,0,null,"No"]
["York County Transportation Authority","York","PA",3027,30027,"Independent Public Agency or Authority of Transit Service","Full Reporter",232045,178,3,null,0,null,3,null,0,null,0,null,"No"]
["Clark County Public Transportation Benefit Area Authority","Vancouver","WA",24,24,"Independent Public Agency or Authority of Transit Service","Full Reporter",1849898,176,6,null,0,null,6,null,0,null,0,null,"No"]
["Capital Area Transportation Authority","Lansing","MI",5036,50036,"Independent Public Agency or Authority of Transit Service","Full Reporter",313532,176,3,null,0,null,3,null,0,null,0,null,"No"]
["Lehigh and Northampton Transportation Authority","Allentown","PA",3010,30010,"Independent Public Agency or Authority of Transit Service","Full Reporter",664651,175,3,null,0,null,3,null,4,null,0,null,"No"]
["Santa Monica's Big Blue Bus","Santa Monica","CA",9008,90008,"City, County or Local Government Unit or Department of Transportation","Full Reporter",12150996,173,1,null,0,null,1,null,0,null,0,null,"No"]
["Wichita Transit","Wichita","KS",7015,70015,"City, County or Local Government Unit or Department of Transportation","Full Reporter",472870,170,1,null,0,null,1,null,0,null,0,null,"No"]
["Mountain Metropolitan Transit","Colorado Springs","CO",8005,80005,"City, County or Local Government Unit or Department of Transportation","Full Reporter",559409,170,1,null,0,null,1,null,0,null,0,null,"No"]
["Montachusett Regional Transit Authority","Fitchburg","MA",1061,10061,"Independent Public Agency or Authority of Transit Service","Full Reporter",116960,170,2,null,0,null,2,null,3,null,0,null,"No"]
["New Orleans Regional Transit Authority","New Orleans","LA",6032,60032,"Independent Public Agency or Authority of Transit Service","Full Reporter",899703,163,20,null,0,null,20,null,0,null,0,null,"No"]
["Hudson Transit Lines, Inc.","Mahwah","NJ",2126,20126,"Private-For-Profit Corporation","Full Reporter",18351295,161,4,null,0,null,4,null,12,null,0,null,"No"]
["Ann Arbor Area Transportation Authority","Ann Arbor","MI",5040,50040,"Independent Public Agency or Authority of Transit Service","Full Reporter",306022,160,2,null,0,null,2,null,1,null,0,null,"No"]
["Research Triangle Regional Public Transportation Authority","Research Triangle Park","NC",4108,40108,"Independent Public Agency or Authority of Transit Service","Full Reporter",347602,153,8,null,0,null,8,null,0,null,0,null,"No"]
["Golden Gate Bridge, Highway and Transportation District","San Francisco","CA",9016,90016,"Independent Public Agency or Authority of Transit Service","Full Reporter",3281212,152,6,null,0,null,6,null,0,null,0,null,"No"]
["Municipality of Anchorage - Public Transportation Department","Anchorage","AK",12,12,"City, County or Local Government Unit or Department of Transportation","Full Reporter",251243,152,2,null,0,null,2,null,0,null,0,null,"No"]
["Space Coast Area Transit","Cocoa","FL",4063,40063,"City, County or Local Government Unit or Department of Transportation","Full Reporter",452791,152,0,null,0,null,0,null,0,null,0,null,"No"]
["Memphis Area Transit Authority","Memphis","TN",4003,40003,"City, County or Local Government Unit or Department of Transportation","Full Reporter",1060061,150,11,null,0,null,11,null,2,null,0,null,"No"]
["Madison County Transit District","Granite City","IL",5146,50146,"Independent Public Agency or Authority of Transit Service","Full Reporter",2150706,145,5,null,0,null,5,null,0,null,0,null,"No"]
["Gainesville Regional Transit System","Gainesville","FL",4030,40030,"City, County or Local Government Unit or Department of Transportation","Full Reporter",187781,143,2,null,0,null,2,null,0,null,0,null,"No"]
["Central Contra Costa Transit Authority","Concord","CA",9078,90078,"Independent Public Agency or Authority of Transit Service","Full Reporter",615968,143,1,null,0,null,1,null,3,null,0,null,"No"]
["Peninsula Corridor Joint Powers Board dba: Caltrain","San Carlos","CA",9134,90134,"Independent Public Agency or Authority of Transit Service","Full Reporter",3281212,135,26,null,6,null,32,null,11,null,4,null,"No"]
["Minnesota Valley Transit Authority","Burnsville","MN",5222,50519,"Independent Public Agency or Authority of Transit Service","Full Reporter",2650890,134,7,null,0,null,7,null,2,null,6,null,"No"]
["County of Volusia, dba: VOTRAN","South Daytona","FL",4032,40032,"City, County or Local Government Unit or Department of Transportation","Full Reporter",349064,133,2,null,0,null,2,null,0,null,0,null,"No"]
["Fresno Area Express","Fresno","CA",9027,90027,"City, County or Local Government Unit or Department of Transportation","Full Reporter",654628,129,1,null,0,null,1,null,0,null,0,null,"No"]
["Prince George's County Transit","Largo","MD",3085,30085,"City, County or Local Government Unit or Department of Transportation","Full Reporter",4586770,128,0,null,0,null,0,null,0,null,0,null,{"$f":"IF(S131&Q131&O131&M131&K131<>\"\",\"Yes\",\"No\")","v":"No"}]
["Hill Country Transit District","San Saba","TX",6091,60091,"Independent Public Agency or Authority of Transit Service","Full Reporter",217630,122,0,null,0,null,0,null,0,null,0,null,"No"]
["Champaign-Urbana Mass Transit District","Urbana","IL",5060,50060,"Independent Public Agency or Authority of Transit Service","Full Reporter",145361,120,1,null,0,null,1,null,2,null,0,null,"No"]
["Rides Mass Transit District","Harrisburg","IL",5211,50211,"Independent Public Agency or Authority of Transit Service","Full Reporter",67821,119,4,null,0,null,4,null,0,null,0,null,"No"]
["Metropolitan Bus Authority","San Juan","PR",4086,40086,"Independent Public Agency or Authority of Transit Service","Full Reporter",2148346,118,8,null,0,null,8,null,0,null,0,null,"No"]
["Santa Cruz Metropolitan Transit District","Santa Cruz","CA",9006,90006,"Independent Public Agency or Authority of Transit Service","Full Reporter",163703,117,7,null,0,null,7,null,0,null,0,null,"No"]
["Erie Metropolitan Transit Authority","Erie","PA",3013,30013,"Independent Public Agency or Authority of Transit Service","Full Reporter",196611,116,1,null,0,null,1,null,0,null,0,null,"No"]
["Denton County Transportation Authority","Lewisville","TX",6101,60101,"Independent Public Agency or Authority of Transit Service","Full Reporter",366174,114,5,null,0,null,5,null,0,null,0,null,"No"]
["Centre Area Transportation Authority","State College","PA",3054,30054,"Independent Public Agency or Authority of Transit Service","Full Reporter",87454,114,1,null,0,null,1,null,0,null,0,null,"No"]
["Greater Attleboro-Taunton Regional Transit Authority","Taunton","MA",1064,10064,"Independent Public Agency or Authority of Transit Service","Full Reporter",1190956,114,2,null,0,null,2,null,0,null,0,null,"No"]
["Transit Authority of Northern Kentucky","Fort Wright","KY",4019,40019,"Independent Public Agency or Authority of Transit Service","Full Reporter",1624827,113,1,null,0,null,1,null,0,null,0,null,"No"]
["Transit Authority of Omaha","Omaha","NE",7002,70002,"Independent Public Agency or Authority of Transit Service","Full Reporter",725008,112,1,null,0,null,1,null,1,null,0,null,"No"]
["Cumberland Dauphin-Harrisburg Transit Authority","Harrisburg","PA",3014,30014,"Independent Public Agency or Authority of Transit Service","Full Reporter",444474,111,1,null,0,null,1,null,0,null,0,null,"No"]
["Lexington Transit Authority","Lexington","KY",4017,40017,"Independent Public Agency or Authority of Transit Service","Full Reporter",290263,108,1,null,0,null,1,null,1,null,0,null,"No"]
["Montebello Bus Lines","Montebello","CA",9041,90041,"City, County or Local Government Unit or Department of Transportation","Full Reporter",12150996,107,2,null,0,null,2,null,0,null,0,null,"No"]
["Monterey-Salinas Transit","Monterey","CA",9062,90062,"Independent Public Agency or Authority of Transit Service","Full Reporter",114237,105,16,null,0,null,16,null,1,null,1,null,"No"]
["San Joaquin Regional Transit District","Stockton","CA",9012,90012,"Independent Public Agency or Authority of Transit Service","Full Reporter",370583,104,1,null,0,null,1,null,0,null,0,null,"No"]
["Sarasota County Area Transit","Sarasota","FL",4046,40046,"City, County or Local Government Unit or Department of Transportation","Full Reporter",643260,104,5,null,0,null,5,null,0,null,0,null,"No"]
["Cobb County Department of Transportation","Marietta","GA",4078,40078,"City, County or Local Government Unit or Department of Transportation","Full Reporter",4515419,103,4,null,0,null,4,null,0,null,0,null,"No"]
["Worcester Regional Transit Authority","Worcester","MA",1014,10014,"Independent Public Agency or Authority of Transit Service","Full Reporter",486514,103,1,null,0,null,1,null,0,null,0,null,"No"]
["Suburban Transit Corporation","New Brunswick","NJ",2128,20128,"Private-For-Profit Corporation","Full Reporter",18351295,102,3,null,0,null,3,null,2,null,0,null,"No"]
["Corpus Christi Regional Transportation Authority","Corpus Christi","TX",6051,60051,"Independent Public Agency or Authority of Transit Service","Full Reporter",320069,102,6,null,0,null,6,null,0,null,0,null,"No"]
["Georgia Regional Transportation Authority","Atlanta","GA",4135,40135,"State Government Unit or Department of Transportation","Full Reporter",4515419,101,10,null,0,null,10,null,31,null,76,null,"No"]
["Whatcom Transportation Authority","Bellingham","WA",21,21,"Independent Public Agency or Authority of Transit Service","Full Reporter",114473,101,4,null,0,null,4,null,0,null,0,null,"No"]
["Birmingham-Jefferson County Transit Authority","Birmingham","AL",4042,40042,"Independent Public Agency or Authority of Transit Service","Full Reporter",749495,100,1,null,0,null,1,null,0,null,0,null,"No"]
["City of Alexandria","Alexandria","VA",3071,30071,"City, County or Local Government Unit or Department of Transportation","Full Reporter",4586770,99,7,null,0,null,7,null,0,null,0,null,"No"]
["Lee County Transit","Fort Myers","FL",4028,40028,"City, County or Local Government Unit or Department of Transportation","Full Reporter",530290,98,3,null,0,null,3,null,0,null,0,null,"No"]
["Connecticut Department of Transportation - CTTRANSIT New Haven Division","Hartford","CT",1055,10055,"State Government Unit or Department of Transportation","Full Reporter",562839,98,0,null,0,null,0,null,0,null,0,null,"No"]
["Virginia Railway Express","Alexandria","VA",3073,30073,"Independent Public Agency or Authority of Transit Service","Full Reporter",4586770,97,19,null,0,null,19,null,5,null,0,null,"No"]
["Charleston Area Regional Transportation Authority","Charleston","SC",4110,40110,"Independent Public Agency or Authority of Transit Service","Full Reporter",548404,97,1,null,0,null,1,null,0,null,0,null,"No"]
["Berks Area Regional Transportation Authority","Reading","PA",3024,30024,"Independent Public Agency or Authority of Transit Service","Full Reporter",266254,97,2,null,0,null,2,null,1,null,0,null,"No"]
["Chapel Hill Transit","Chapel Hill","NC",4051,40051,"City, County or Local Government Unit or Department of Transportation","Full Reporter",347602,96,0,null,0,null,0,null,0,null,0,null,"No"]
["Red Rose Transit Authority","Lancaster","PA",3018,30018,"Independent Public Agency or Authority of Transit Service","Full Reporter",402004,96,1,null,0,null,1,null,0,null,0,null,"No"]
["Westmoreland County Transit Authority","Greensburg","PA",3044,30044,"City, County or Local Government Unit or Department of Transportation","Full Reporter",1733853,95,1,null,0,null,1,null,0,null,0,null,"No"]
["Laketran","Grand River","OH",5117,50117,"Independent Public Agency or Authority of Transit Service","Full Reporter",1780673,95,5,null,0,null,5,null,0,null,0,null,"No"]
["Metropolitan Tulsa Transit Authority","Tulsa","OK",6018,60018,"City, County or Local Government Unit or Department of Transportation","Full Reporter",655479,93,4,null,0,null,4,null,0,null,0,null,"No"]
["Loudoun County Commuter Bus Service - Office of Transportation Services","Leesburg","VA",3081,30081,"City, County or Local Government Unit or Department of Transportation","Full Reporter",4586770,92,0,null,0,null,0,null,0,null,0,null,"No"]
["Norwalk Transit District","Norwalk","CT",1057,10057,"Independent Public Agency or Authority of Transit Service","Full Reporter",923311,92,1,null,0,null,1,null,0,null,0,null,"No"]
["Durham Area Transit Authority","Durham","NC",4087,40087,"City, County or Local Government Unit or Department of Transportation","Full Reporter",347602,91,1,null,0,null,1,null,1,null,0,null,"No"]
["Skagit Transit","Burlington","WA",44,44,"Independent Public Agency or Authority of Transit Service","Full Reporter",62966,90,4,null,0,null,4,null,2,null,0,null,"No"]
["Santa Clarita Transit","Santa Clarita","CA",9171,90171,"City, County or Local Government Unit or Department of Transportation","Full Reporter",258653,90,6,null,0,null,6,null,0,null,0,null,"No"]
["Pasco County Public Transportation","Port Richey","FL",4074,40074,"City, County or Local Government Unit or Department of Transportation","Full Reporter",2441770,89,0,null,0,null,0,null,0,null,0,null,"No"]
["City Transit Management Company, Inc.","Lubbock","TX",6010,60010,"City, County or Local Government Unit or Department of Transportation","Full Reporter",237356,89,1,null,0,null,1,null,0,null,0,null,"No"]
["Middlesex County Area Transit","New Brunswick","NJ",2196,20196,"City, County or Local Government Unit or Department of Transportation","Full Reporter",18351295,88,0,null,0,null,0,null,0,null,0,null,"No"]
["SunLine Transit Agency","Thousand Palms","CA",9079,90079,"Independent Public Agency or Authority of Transit Service","Full Reporter",345580,88,1,null,0,null,1,null,0,null,0,null,"No"]
["Johnson County Kansas, aka: Johnson County Transit","Olathe","KS",7035,70035,"City, County or Local Government Unit or Department of Transportation","Full Reporter",1519417,88,0,null,0,null,0,null,0,null,0,null,"No"]
["Rio Metro Regional Transit District","Albuquerque","NM",6111,60111,"Independent Public Agency or Authority of Transit Service","Full Reporter",741318,87,16,null,0,null,16,null,0,null,0,null,"No"]
["Santa Barbara Metropolitan Transit District","Santa Barbara","CA",9020,90020,"Independent Public Agency or Authority of Transit Service","Full Reporter",195861,87,1,null,0,null,1,null,0,null,0,null,"No"]
["City of Tallahassee","Tallahassee","FL",4036,40036,"City, County or Local Government Unit or Department of Transportation","Full Reporter",240223,86,1,null,0,null,1,null,0,null,0,null,"No"]
["Brockton Area Transit Authority","Brockton","MA",1004,10004,"Independent Public Agency or Authority of Transit Service","Full Reporter",4181019,86,1,null,0,null,1,null,0,null,0,null,"No"]
["Arlington Transit - Arlington County","Arlington","VA",3080,30080,"City, County or Local Government Unit or Department of Transportation","Full Reporter",4586770,85,11,null,0,null,11,null,0,null,0,null,"No"]
["Ames Transit Agency dba CyRide","Ames","IA",7041,70041,"City, County or Local Government Unit or Department of Transportation","Full Reporter",60438,84,1,null,0,null,1,null,0,null,0,null,"No"]
["Torrance Transit System","Torrance","CA",9010,90010,"City, County or Local Government Unit or Department of Transportation","Full Reporter",12150996,84,2,null,0,null,2,null,1,null,0,null,"No"]
["MetroWest Regional Transit Authority","Framingham","MA",1118,10118,"Independent Public Agency or Authority of Transit Service","Full Reporter",4181019,83,1,null,0,null,1,null,0,null,0,null,"No"]
["Greensboro Transit Authority","Greensboro","NC",4093,40093,"City, County or Local Government Unit or Department of Transportation","Full Reporter",311810,83,1,null,0,null,1,null,2,null,1,null,"No"]
["The Greater New Haven Transit District","Hamden","CT",1049,10049,"Independent Public Agency or Authority of Transit Service","Full Reporter",562839,82,0,null,0,null,0,null,0,null,0,null,"No"]
["Golden Empire Transit District","Bakersfield","CA",9004,90004,"Independent Public Agency or Authority of Transit Service","Full Reporter",523994,82,3,null,0,null,3,null,0,null,0,null,"No"]
["Marin County Transit District","San Rafael","CA",9234,90234,"Independent Public Agency or Authority of Transit Service","Full Reporter",3281212,82,1,null,0,null,1,null,0,null,0,null,"No"]
["Greater Peoria Mass Transit District","Peoria","IL",5056,50056,"Independent Public Agency or Authority of Transit Service","Full Reporter",266921,82,1,null,0,null,1,null,1,null,0,null,"No"]
["Piedmont Authority for Regional Transportation","Greensboro","NC",4173,40173,"Independent Public Agency or Authority of Transit Service","Full Reporter",311810,80,1,null,0,null,1,null,0,null,0,null,"No"]
["Hampton Jitney, Inc.","Southampton","NY",2217,20217,"Private-For-Profit Corporation","Full Reporter",18351295,80,2,null,0,null,2,null,1,null,0,null,"No"]
["Chattanooga Area Regional Transportation Authority","Chattanooga","TN",4001,40001,"City, County or Local Government Unit or Department of Transportation","Full Reporter",381112,80,3,null,0,null,3,null,1,null,0,null,"No"]
["Chatham Area Transit Authority","Savannah","GA",4025,40025,"Independent Public Agency or Authority of Transit Service","Full Reporter",260677,80,4,null,0,null,4,null,0,null,0,null,"No"]
["County of Maui - Dept. of Transportation","Wailuku","HI",9241,90241,"City, County or Local Government Unit or Department of Transportation","Full Reporter",55934,79,1,null,0,null,1,null,0,null,0,null,"No"]
["Lowell Regional Transit Authority","Lowell","MA",1005,10005,"Independent Public Agency or Authority of Transit Service","Full Reporter",4181019,78,1,null,0,null,1,null,2,null,0,null,{"$f":"IF(S195&Q195&O195&M195&K195<>\"\",\"Yes\",\"No\")","v":"No"}]
["StarTran","Lincoln","NE",7001,70001,"City, County or Local Government Unit or Department of Transportation","Full Reporter",258719,78,1,null,0,null,1,null,0,null,0,null,"No"]
["Knoxville Area Transit","Knoxville","TN",4002,40002,"City, County or Local Government Unit or Department of Transportation","Full Reporter",558696,78,1,null,0,null,1,null,2,null,1,null,"No"]
["Port Authority Transit Corporation","Lindenwold","NJ",2075,20075,"Independent Public Agency or Authority of Transit Service","Full Reporter",5441567,78,7,null,6,null,13,null,11,null,14,null,"No"]
["Capital Area Transit System","Baton Rouge","LA",6022,60022,"Independent Public Agency or Authority of Transit Service","Full Reporter",594309,78,1,null,0,null,1,null,0,null,0,null,"No"]
["Luzerne County Transportation Authority","Kingston","PA",3015,30015,"Independent Public Agency or Authority of Transit Service","Full Reporter",381502,77,1,null,0,null,1,null,0,null,0,null,"No"]
["Central Oklahoma Transportation and Parking Authority","Oklahoma City","OK",6017,60017,"City, County or Local Government Unit or Department of Transportation","Full Reporter",861505,77,5,null,0,null,5,null,0,null,0,null,"No"]
["Antelope Valley Transit Authority","Lancaster","CA",9121,90121,"Independent Public Agency or Authority of Transit Service","Full Reporter",341219,75,0,null,0,null,0,null,0,null,0,null,"No"]
["Brazos Transit District","Bryan","TX",6059,60059,"Independent Public Agency or Authority of Transit Service","Full Reporter",171345,75,3,null,0,null,3,null,0,null,0,null,"No"]
["Rockland Coaches, Inc.","Westwood","NJ",2149,20149,"Private-For-Profit Corporation","Full Reporter",18351295,75,2,null,0,null,2,null,0,null,0,null,"No"]
["Chittenden County Transportation Authority","Burlington","VT",1066,10066,"Independent Public Agency or Authority of Transit Service","Full Reporter",108740,74,2,null,0,null,2,null,0,null,0,null,"No"]
["Port Imperial Ferry Corporation dba NY Waterway","Weehawken","NJ",2190,20190,"Private-For-Profit Corporation","Full Reporter",18351295,74,8,null,0,null,8,null,0,null,0,null,"No"]
["City of Appleton - Valley Transit","Appleton","WI",5001,50001,"City, County or Local Government Unit or Department of Transportation","Full Reporter",216154,74,1,null,0,null,1,null,0,null,0,null,"No"]
["Southeastern Regional Transit Authority","New Bedford","MA",1006,10006,"Independent Public Agency or Authority of Transit Service","Full Reporter",149443,73,2,null,0,null,2,null,2,null,0,null,"No"]
["The Eastern Contra Costa Transit Authority","Antioch","CA",9162,90162,"Independent Public Agency or Authority of Transit Service","Full Reporter",277634,73,0,null,0,null,0,null,0,null,0,null,"No"]
["Ms Coast Transportation Authority","Gulfport","MS",4014,40014,"Independent Public Agency or Authority of Transit Service","Full Reporter",208948,72,8,null,0,null,8,null,1,null,0,null,"No"]
["Transport of Rockland","Pomona","NY",2084,20084,"City, County or Local Government Unit or Department of Transportation","Full Reporter",18351295,71,0,null,0,null,0,null,0,null,0,null,"No"]
["Gwinnett County Board of Commissioners","Lawrenceville","GA",4138,40138,"City, County or Local Government Unit or Department of Transportation","Full Reporter",4515419,71,4,null,0,null,4,null,5,null,5,null,"No"]
["STAR Transit","Terrell","TX",6114,60114,"City, County or Local Government Unit or Department of Transportation","Full Reporter",5121892,71,3,null,0,null,3,null,0,null,0,null,"No"]
["Central Arkansas Transit Authority","North Little Rock","AR",6033,60033,"Independent Public Agency or Authority of Transit Service","Full Reporter",431388,71,1,null,0,null,1,null,0,null,0,null,"No"]
["Connecticut Department of Transportation- CTTransit Waterbury- NET","Waterbury","CT",1128,10128,"Subsidiary Unit of a Transit Agency, Reporting Separately","Full Reporter",194535,70,0,null,0,null,0,null,0,null,0,null,"No"]
["Northern Indiana Commuter Transportation District","Chesterton","IN",5104,50104,"Independent Public Agency or Authority of Transit Service","Full Reporter",8608208,70,13,null,6,null,19,null,7,null,1,null,"No"]
["Somerset County Transportation","Somerville","NJ",2209,20209,"City, County or Local Government Unit or Department of Transportation","Full Reporter",18351295,70,0,null,0,null,0,null,0,null,0,null,"No"]
["Kalamazoo Metro Transit System","Kalamazoo","MI",5035,50035,"City, County or Local Government Unit or Department of Transportation","Full Reporter",209703,69,1,null,0,null,1,null,0,null,0,null,"No"]
["Bergen County Community Transportation","Lodi","NJ",2192,20192,"City, County or Local Government Unit or Department of Transportation","Full Reporter",18351295,69,0,null,0,null,0,null,0,null,0,null,"No"]
["Washington County Transportation Authority","Washington","PA",3111,30111,"Independent Public Agency or Authority of Transit Service","Full Reporter",1733853,68,1,null,0,null,1,null,1,null,0,null,"No"]
["Regional Transportation Authority","Nashville","TN",4159,40159,"Independent Public Agency or Authority of Transit Service","Full Reporter",969587,67,6,null,0,null,6,null,0,null,0,null,"No"]
["Merrimack Valley Regional Transit Authority","Haverhill","MA",1013,10013,"Independent Public Agency or Authority of Transit Service","Full Reporter",4181019,67,4,null,0,null,4,null,7,null,0,null,"No"]
["Gold Coast Transit","Oxnard","CA",9035,90035,"Independent Public Agency or Authority of Transit Service","Full Reporter",367260,67,0,null,0,null,0,null,0,null,0,null,"No"]
["South Florida Regional Transportation Authority","Pompano Beach","FL",4077,40077,"Independent Public Agency or Authority of Transit Service","Full Reporter",5502379,66,18,null,0,null,18,null,27,null,2,null,"No"]
["SouthWest Transit","Eden Prairie","MN",5221,50518,"City, County or Local Government Unit or Department of Transportation","Full Reporter",2650890,66,4,null,0,null,4,null,7,null,0,null,"No"]
["Winston-Salem Transit Authority - Trans-Aid of Forsyth County","Winston-Salem","NC",4012,40012,"Independent Public Agency or Authority of Transit Service","Full Reporter",391024,66,1,null,0,null,1,null,0,null,0,null,"No"]
["Sonoma County Transit","Santa Rosa","CA",9089,90089,"City, County or Local Government Unit or Department of Transportation","Full Reporter",308231,66,3,null,0,null,3,null,2,null,0,null,"No"]
["Escambia County Area Transit","Pensacola","FL",4038,40038,"City, County or Local Government Unit or Department of Transportation","Full Reporter",340067,66,1,null,0,null,1,null,0,null,0,null,"No"]
["Greater Bridgeport Transit Authority","Bridgeport","CT",1050,10050,"Independent Public Agency or Authority of Transit Service","Full Reporter",923311,64,1,null,0,null,1,null,1,null,0,null,"No"]
["Livermore / Amador Valley Transit Authority","Livermore","CA",9144,90144,"Independent Public Agency or Authority of Transit Service","Full Reporter",615968,64,5,null,0,null,5,null,6,null,13,null,"No"]
["Yakima Transit","Yakima","WA",6,6,"City, County or Local Government Unit or Department of Transportation","Full Reporter",129534,63,1,null,0,null,1,null,0,null,0,null,"No"]
["Anaheim Transportation Network","Anaheim","CA",9211,90211,"Private-Non-Profit Corporation","Full Reporter",12150996,63,4,null,0,null,4,null,2,null,3,null,"No"]
["Modesto Area Express","Modesto","CA",9007,90007,"City, County or Local Government Unit or Department of Transportation","Full Reporter",358172,63,1,null,0,null,1,null,0,null,0,null,"No"]
["Stark Area Regional Transit Authority","Canton","OH",5011,50011,"Independent Public Agency or Authority of Transit Service","Full Reporter",279245,63,4,null,0,null,4,null,0,null,0,null,"No"]
["County of Lackawanna Transit System","Scranton","PA",3025,30025,"Independent Public Agency or Authority of Transit Service","Full Reporter",381502,62,1,null,0,null,1,null,0,null,0,null,"No"]
["Rock Island County Metropolitan Mass Transit District","Moline ","IL",5057,50057,"Independent Public Agency or Authority of Transit Service","Full Reporter",280051,62,7,null,0,null,7,null,1,null,0,null,"No"]
["Tompkins Consolidated Area Transit","Ithaca","NY",2145,20145,"Private-Non-Profit Corporation","Full Reporter",53661,62,1,null,0,null,1,null,0,null,0,null,"No"]
["Greater Lafayette Public Transportation Corporation","Lafayette","IN",5051,50051,"Independent Public Agency or Authority of Transit Service","Full Reporter",147725,61,1,null,0,null,1,null,0,null,0,null,"No"]
["Lakeland Area Mass Transit District","Lakeland","FL",4031,40031,"Independent Public Agency or Authority of Transit Service","Full Reporter",262596,61,2,null,0,null,2,null,0,null,0,null,"No"]
["Valley Regional Transit","Meridian","ID",11,11,"Independent Public Agency or Authority of Transit Service","Full Reporter",349684,60,0,null,0,null,0,null,0,null,0,null,"No"]
["Springfield Mass Transit District","Springfield","IL",5059,50059,"Independent Public Agency or Authority of Transit Service","Full Reporter",161316,60,0,null,0,null,0,null,0,null,0,null,"No"]
["Lakeland Bus Lines, Inc.","Dover","NJ",2163,20163,"Private-For-Profit Corporation","Full Reporter",18351295,59,1,null,0,null,1,null,0,null,0,null,"No"]
["Transit Authority of Central Kentucky","Elizabethtown","KY",4191,40191,"Independent Public Agency or Authority of Transit Service","Full Reporter",73467,59,0,null,0,null,0,null,0,null,0,null,"No"]
["Everett Transit","Everett","WA",5,5,"City, County or Local Government Unit or Department of Transportation","Full Reporter",3059393,58,3,null,0,null,3,null,0,null,0,null,"No"]
["Alternativa de Transporte Integrado -ATI","San Juan","PR",4094,40094,"State Government Unit or Department of Transportation","Full Reporter",2148346,58,20,null,0,null,20,null,33,null,51,null,"No"]
["DeCamp Bus Lines","Montclair","NJ",2161,20161,"Private-For-Profit Corporation","Full Reporter",18351295,57,0,null,0,null,0,null,0,null,0,null,"No"]
["DDOT - Progressive Transportation Services Administration","Washington","DC",3112,30112,"State Government Unit or Department of Transportation","Full Reporter",4586770,57,0,null,0,null,0,null,0,null,0,null,"No"]
["Duluth Transit Authority","Duluth","MN",5025,50025,"Independent Public Agency or Authority of Transit Service","Full Reporter",120378,57,2,null,0,null,2,null,4,null,0,null,"No"]
["Kanawha Valley Regional Transportation Authority","Charleston","WV",3001,30001,"Independent Public Agency or Authority of Transit Service","Full Reporter",153199,54,3,null,0,null,3,null,1,null,0,null,"No"]
["Cambria County Transit Authority","Johnstown","PA",3012,30012,"Independent Public Agency or Authority of Transit Service","Full Reporter",69014,54,3,null,0,null,3,null,2,null,0,null,"No"]
["Shreveport Area Transit System","Shreveport","LA",6024,60024,"City, County or Local Government Unit or Department of Transportation","Full Reporter",298317,54,1,null,0,null,1,null,0,null,0,null,"No"]
["Broome County Department of Public Transportation","Vestal","NY",2003,20003,"City, County or Local Government Unit or Department of Transportation","Full Reporter",158084,54,1,null,0,null,1,null,1,null,0,null,"No"]
["Transfort","Fort Collins","CO",8011,80011,"City, County or Local Government Unit or Department of Transportation","Full Reporter",264465,54,5,null,0,null,5,null,0,null,0,null,"No"]
["Laredo Transit Management, Inc.","Laredo","TX",6009,60009,"City, County or Local Government Unit or Department of Transportation","Full Reporter",235730,54,2,null,0,null,2,null,0,null,0,null,"No"]
["Yuma County Intergovernmental Public Transportation Authority","Yuma","AZ",9233,90233,"Independent Public Agency or Authority of Transit Service","Full Reporter",135267,54,1,null,0,null,1,null,0,null,0,null,"No"]
["Central Midlands Transit","Columbia","SC",4141,40141,"Independent Public Agency or Authority of Transit Service","Full Reporter",549777,54,1,null,0,null,1,null,0,null,0,null,"No"]
["Greater Roanoke Transit Company","Roanoke","VA",3007,30007,"Other Publicly-Owned or Privately Chartered Corporation","Full Reporter",210111,53,1,null,0,null,1,null,1,null,0,null,"No"]
["City of Elk Grove","Elk Grove","CA",9205,90205,"City, County or Local Government Unit or Department of Transportation","Full Reporter",1723634,53,2,null,0,null,2,null,0,null,0,null,"No"]
["Kenosha Transit","Kenosha","WI",5003,50003,"City, County or Local Government Unit or Department of Transportation","Full Reporter",124064,52,1,null,0,null,1,null,0,null,0,null,{"$f":"IF(S259&Q259&O259&M259&K259<>\"\",\"Yes\",\"No\")","v":"No"}]
["St. Cloud Metropolitan Transit Commission","St. Cloud","MN",5028,50028,"Independent Public Agency or Authority of Transit Service","Full Reporter",110621,52,3,null,0,null,3,null,0,null,0,null,"No"]
["Bay Metropolitan Transit Authority","Bay City","MI",5029,50029,"Independent Public Agency or Authority of Transit Service","Full Reporter",70585,52,1,null,0,null,1,null,0,null,0,null,"No"]
["Portage Area Regional Transportation Authority","Kent","OH",5021,50021,"Independent Public Agency or Authority of Transit Service","Full Reporter",569499,52,2,null,0,null,2,null,2,null,0,null,"No"]
["Rockford Mass Transit District","Rockford","IL",5058,50058,"Independent Public Agency or Authority of Transit Service","Full Reporter",296863,51,2,null,0,null,2,null,0,null,0,null,"No"]
["Transit Joint Powers Authority for Merced County","Merced","CA",9173,90173,"Independent Public Agency or Authority of Transit Service","Full Reporter",136969,51,3,null,0,null,3,null,0,null,0,null,"No"]
["University of Georgia Transit System","Athens","GA",4180,40180,"University","Full Reporter",128754,51,0,null,0,null,0,null,0,null,0,null,"No"]
["Western Reserve Transit Authority","Youngstown","OH",5024,50024,"Independent Public Agency or Authority of Transit Service","Full Reporter",387550,51,1,null,0,null,1,null,0,null,0,null,"No"]
["Eau Claire Transit","Eau Claire","WI",5099,50099,"City, County or Local Government Unit or Department of Transportation","Full Reporter",102852,50,1,null,0,null,1,null,0,null,0,null,"No"]
["Trans-Bridge Lines, Inc.","Bethlehem","PA",2169,20169,"Private-For-Profit Corporation","Full Reporter",18351295,50,5,null,0,null,5,null,0,null,0,null,"No"]
["Western Piedmont Regional Transit Authority","Conover","NC",4172,40172,"Independent Public Agency or Authority of Transit Service","Full Reporter",212195,49,1,null,0,null,1,null,0,null,0,null,"No"]
["Concho Valley Transit District","San Angelo","TX",6102,60102,"Independent Public Agency or Authority of Transit Service","Full Reporter",92984,49,1,null,0,null,1,null,0,null,0,null,"No"]
["City of Gardena Transportation Department","Gardena","CA",9042,90042,"City, County or Local Government Unit or Department of Transportation","Full Reporter",12150996,49,1,null,0,null,1,null,0,null,0,null,"No"]
["Orange-Newark-Elizabeth, Inc.","Elizabeth","NJ",2166,20166,"Private-For-Profit Corporation","Full Reporter",18351295,49,1,null,0,null,1,null,3,null,1,null,"No"]
["The Wave Transit System","Mobile","AL",4043,40043,"City, County or Local Government Unit or Department of Transportation","Full Reporter",326183,48,1,null,0,null,1,null,0,null,0,null,"No"]
["Yolo County Transportation District","Woodland","CA",9090,90090,"Independent Public Agency or Authority of Transit Service","Full Reporter",1723634,48,0,null,0,null,0,null,0,null,0,null,"No"]
["West Virginia University - Morgantown Personal Rapid Transit","Morgantown","WV",3107,30107,"University","Full Reporter",70350,48,7,null,0,null,7,null,7,null,0,null,"No"]
["Lower Rio Grande Valley Development Council","Weslaco","TX",6090,60090,"MPO, COG or Other Planning Agency","Full Reporter",728825,48,6,null,2,null,8,null,0,null,0,null,"No"]
["Central Oregon Intergovernmental Council","Bend","OR",57,57,"MPO, COG or Other Planning Agency","Full Reporter",83794,47,2,null,0,null,2,null,0,null,0,null,"No"]
["Butte County Association of Governments","Chico","CA",9208,90208,"MPO, COG or Other Planning Agency","Full Reporter",98176,47,0,null,0,null,0,null,0,null,0,null,"No"]
["Western Contra Costa Transit Authority","Pinole","CA",9159,90159,"Independent Public Agency or Authority of Transit Service","Full Reporter",3281212,47,5,null,0,null,5,null,2,null,2,null,"No"]
["Culver City Municipal Bus Lines","Culver City","CA",9039,90039,"City, County or Local Government Unit or Department of Transportation","Full Reporter",12150996,46,0,null,0,null,0,null,0,null,0,null,"No"]
["South Bend Public Transportation Corporation","South Bend","IN",5052,50052,"Independent Public Agency or Authority of Transit Service","Full Reporter",278165,46,2,null,0,null,2,null,2,null,0,null,"No"]
["Okaloosa County Board of County Commissioners","Fort Walton Beach","FL",4128,40128,"City, County or Local Government Unit or Department of Transportation","Full Reporter",191917,46,0,null,0,null,0,null,0,null,0,null,"No"]
["Fort Bend County Public Transportation","Sugar Land","TX",6103,60103,"City, County or Local Government Unit or Department of Transportation","Full Reporter",4944332,46,0,null,0,null,0,null,0,null,0,null,"No"]
["Manatee County Area Transit","Bradenton","FL",4026,40026,"City, County or Local Government Unit or Department of Transportation","Full Reporter",643260,45,3,null,0,null,3,null,0,null,0,null,"No"]
["Ventura Intercity Service Transit Authority","Ventura","CA",9164,90164,"Independent Public Agency or Authority of Transit Service","Full Reporter",367260,44,0,null,0,null,0,null,0,null,0,null,"No"]
["Jefferson Parish Department of Transit Administration","Gretna","LA",6088,60088,"City, County or Local Government Unit or Department of Transportation","Full Reporter",899703,44,2,null,0,null,2,null,0,null,0,null,"No"]
["The Tri-County Council for the Lower Eastern Shore of Maryland","Salisbury","MD",3096,30096,"Independent Public Agency or Authority of Transit Service","Full Reporter",98081,44,1,null,0,null,1,null,0,null,0,null,"No"]
["Staten Island Rapid Transit Operating Authority, dba: MTA Staten Island Railway","Staten Island","NY",2099,20099,"Independent Public Agency or Authority of Transit Service","Full Reporter",18351295,44,4,null,18,null,22,null,1,null,0,null,"No"]
["Link Transit","Wenatchee","WA",43,43,"Independent Public Agency or Authority of Transit Service","Full Reporter",67227,44,1,null,0,null,1,null,1,null,0,null,"No"]
["Santee Wateree Regional Transportation Authority","Sumter","SC",4100,40100,"Independent Public Agency or Authority of Transit Service","Full Reporter",73107,43,2,null,0,null,2,null,0,null,0,null,"No"]
["Housatonic Area Regional Transit","Danbury","CT",1051,10051,"Independent Public Agency or Authority of Transit Service","Full Reporter",168136,43,0,null,0,null,0,null,0,null,0,null,"No"]
["Napa Valley Transportation Authority","Napa","CA",9088,90088,"Independent Public Agency or Authority of Transit Service","Full Reporter",83913,43,4,null,0,null,4,null,0,null,0,null,"No"]
["Clermont Transportation Connection","Batavia","OH",5166,50166,"City, County or Local Government Unit or Department of Transportation","Full Reporter",1624827,43,0,null,0,null,0,null,0,null,0,null,"No"]
["Connecticut Department of Transportation","Newington","CT",1102,10102,"State Government Unit or Department of Transportation","Full Reporter",924859,43,8,null,1,null,9,null,4,null,1,null,"No"]
["Clay County Council on Aging, Inc., dba Clay Transit","Green Cove Springs","FL",null,40245,"Private-Non-Profit Corporation","Full Reporter",1065219,43,0,null,0,null,0,null,0,null,0,null,"No"]
["San Luis Obispo Regional Transit Authority","San Luis Obispo","CA",9206,90206,"Independent Public Agency or Authority of Transit Service","Full Reporter",59219,43,0,null,0,null,0,null,0,null,0,null,"No"]
["Cape Fear Public Transportation Authority","Wilmington","NC",4006,40006,"Independent Public Agency or Authority of Transit Service","Full Reporter",219957,43,1,null,0,null,1,null,0,null,0,null,"No"]
["Blacksburg Transit","Blacksburg","VA",3091,30091,"City, County or Local Government Unit or Department of Transportation","Full Reporter",88542,42,0,null,0,null,0,null,0,null,0,null,"No"]
["Howard Transit","Ellicott City","MD",3048,30048,"City, County or Local Government Unit or Department of Transportation","Full Reporter",2203663,42,1,null,0,null,1,null,0,null,0,null,"No"]
["City of Rochester Public Transportation","Rochester","MN",5092,50092,"City, County or Local Government Unit or Department of Transportation","Full Reporter",107677,42,1,null,0,null,1,null,0,null,0,null,"No"]
["Su Tran LLC dba: Sioux Area Metro","Sioux Falls","SD",8002,80002,"Private Provider Reporting on Behalf of a Public Entity","Full Reporter",156777,42,2,null,0,null,2,null,0,null,0,null,"No"]
["Menominee Indian Tribe of Wisconsin","Keshena","WI","5T03",55228,"Tribe","Reduced Reporter",0,42,0,null,0,null,0,null,0,null,0,null,"No"]
["Connecticut Department of Transportation - CTTRANSIT Stamford Division","Hartford","CT",1056,10056,"State Government Unit or Department of Transportation","Full Reporter",923311,42,0,null,0,null,0,null,0,null,0,null,"No"]
["Monroe County Transportation Authority","Scotrun","PA","3R04-012",30137,"Independent Public Agency or Authority of Transit Service","Full Reporter",54316,42,1,null,0,null,1,null,1,null,0,null,"No"]
["Lake County Board of County Commissioners","Tavares","FL",4158,40158,"City, County or Local Government Unit or Department of Transportation","Full Reporter",131337,42,0,null,0,null,0,null,0,null,0,null,"No"]
["City of Fairfield - Fairfield and Suisun Transit","Fairfield","CA",9092,90092,"City, County or Local Government Unit or Department of Transportation","Full Reporter",133683,42,2,null,0,null,2,null,4,null,0,null,"No"]
["Fort Wayne Public Transportation Corporation","Fort Wayne","IN",5044,50044,"Independent Public Agency or Authority of Transit Service","Full Reporter",313492,42,2,null,0,null,2,null,0,null,0,null,"No"]
["Dutchess County Division of Mass Transportation","Poughkeepsie","NY",2010,20010,"City, County or Local Government Unit or Department of Transportation","Full Reporter",423566,41,1,null,0,null,1,null,0,null,0,null,"No"]
["Butler County Regional Transit Authority","Hamilton","OH",5157,50157,"Independent Public Agency or Authority of Transit Service","Full Reporter",1624827,41,0,null,0,null,0,null,0,null,0,null,"No"]
["City of Waukesha Transit Commission","Waukesha","WI",5096,50096,"City, County or Local Government Unit or Department of Transportation","Full Reporter",1376476,41,2,null,0,null,2,null,3,null,2,null,"No"]
["Martz Trailways","Wilkes Barre","PA",3102,30102,"Private-For-Profit Corporation","Full Reporter",18351295,41,5,null,0,null,5,null,1,null,1,null,"No"]
["River Bend Transit","Davenport","IA",7049,70049,"Private-Non-Profit Corporation","Full Reporter",280051,41,0,null,0,null,0,null,0,null,0,null,"No"]
["Baldwin County Commission","Bay Minette ","AL","4R01-005",40928,"City, County or Local Government Unit or Department of Transportation","Full Reporter",57383,40,2,null,0,null,2,null,0,null,0,null,"No"]
["Pennsylvania Department of Transportation","Harrisburg","PA",3057,30057,"State Government Unit or Department of Transportation","Full Reporter",5441567,40,5,null,7,null,12,null,10,null,11,null,"No"]
["Solano County Transit","Vallejo","CA",9232,90232,"City, County or Local Government Unit or Department of Transportation","Full Reporter",165074,40,4,null,0,null,4,null,0,null,0,null,"No"]
["Fayetteville Area System of Transit","Fayetteville","NC",4009,40009,"City, County or Local Government Unit or Department of Transportation","Full Reporter",310282,40,1,null,0,null,1,null,0,null,0,null,"No"]
["Belle Urban System - Racine","Racine","WI",5006,50006,"City, County or Local Government Unit or Department of Transportation","Full Reporter",133700,39,2,null,0,null,2,null,0,null,0,null,"No"]
["City of Harrisonburg Department of Public Transportation","Harrisonburg","VA",3094,30094,"City, County or Local Government Unit or Department of Transportation","Full Reporter",66784,39,0,null,0,null,0,null,0,null,0,null,"No"]
["Anne Arundel County","Annapolis","MD","3R03-018",30129,"City, County or Local Government Unit or Department of Transportation","Full Reporter",2203663,39,0,null,0,null,0,null,0,null,0,null,"No"]
["Alaska Railroad Corporation","Anchorage","AK",41,41,"State Government Unit or Department of Transportation","Full Reporter",251243,39,11,null,0,null,11,null,2,null,2,null,"No"]
["Collier Area Transit","Naples","FL",4140,40140,"City, County or Local Government Unit or Department of Transportation","Full Reporter",310298,39,2,null,0,null,2,null,1,null,0,null,"No"]
["City of Visalia - Visalia City Coach","Visalia","CA",9091,90091,"City, County or Local Government Unit or Department of Transportation","Full Reporter",219454,39,1,null,0,null,1,null,0,null,0,null,"No"]
["Green Bay Metro","Green Bay","WI",5002,50002,"City, County or Local Government Unit or Department of Transportation","Full Reporter",206520,38,1,null,0,null,1,null,0,null,0,null,{"$f":"IF(S323&Q323&O323&M323&K323<>\"\",\"Yes\",\"No\")","v":"No"}]
["Santa Fe Trails - City of Santa Fe","Santa Fe","NM",6077,60077,"City, County or Local Government Unit or Department of Transportation","Full Reporter",89284,38,2,null,0,null,2,null,0,null,0,null,"No"]
["Placer County Department of Public Works and Facilities","Auburn","CA",9196,90196,"City, County or Local Government Unit or Department of Transportation","Full Reporter",1723634,38,1,null,0,null,1,null,0,null,0,null,"No"]
["Rogue Valley Transportation District","Medford","OR",34,34,"Independent Public Agency or Authority of Transit Service","Full Reporter",154081,38,1,null,0,null,1,null,0,null,0,null,"No"]
["Valley Metro Rail, Inc.","Phoenix","AZ",9209,90209,"Other Publicly-Owned or Privately Chartered Corporation","Full Reporter",3629114,38,40,null,0,null,40,null,1,null,1,null,"No"]
["University of Michigan Parking and Transportation Services","Ann Arbor","MI",5158,50158,"University","Full Reporter",306022,38,0,null,0,null,0,null,0,null,0,null,"No"]
["Buncombe County","Asheville ","NC",4224,40224,"City, County or Local Government Unit or Department of Transportation","Full Reporter",280648,38,0,null,0,null,0,null,0,null,0,null,"No"]
["Bloomington Public Transportation Corporation","Bloomington","IN",5110,50110,"Independent Public Agency or Authority of Transit Service","Full Reporter",108657,38,1,null,0,null,1,null,0,null,0,null,"No"]
["Beaver County Transit Authority","Rochester","PA",3023,30023,"Independent Public Agency or Authority of Transit Service","Full Reporter",1733853,38,2,null,0,null,2,null,2,null,0,null,"No"]
["City of Plymouth","City of Plymouth","MN",5219,50516,"City, County or Local Government Unit or Department of Transportation","Full Reporter",2650890,37,2,null,0,null,2,null,1,null,0,null,"No"]
["Williamsburg Area Transit Authority","Williamsburg","VA",3076,30076,"Independent Public Agency or Authority of Transit Service","Full Reporter",75689,37,1,null,0,null,1,null,0,null,0,null,"No"]
["Topeka Metropolitan Transit Authority","Topeka","KS",7014,70014,"Independent Public Agency or Authority of Transit Service","Full Reporter",150003,37,1,null,0,null,1,null,0,null,0,null,"No"]
["The Tri-State Transit Authority","Huntington","WV",3002,30002,"Independent Public Agency or Authority of Transit Service","Full Reporter",202637,37,1,null,0,null,1,null,0,null,0,null,"No"]
["City of Columbia","Columbia","MO",7016,70016,"City, County or Local Government Unit or Department of Transportation","Full Reporter",124748,37,1,null,0,null,1,null,0,null,0,null,"No"]
["City of Rome Transit Department","Rome","GA",4058,40058,"City, County or Local Government Unit or Department of Transportation","Full Reporter",60851,37,0,null,0,null,0,null,0,null,0,null,"No"]
["Greater Lynchburg Transit Company","Lynchburg","VA",3008,30008,"Independent Public Agency or Authority of Transit Service","Full Reporter",116636,37,1,null,0,null,1,null,1,null,0,null,"No"]
["Metropolitan Evansville Transit System","Evansville","IN",5043,50043,"City, County or Local Government Unit or Department of Transportation","Full Reporter",229351,37,1,null,0,null,1,null,0,null,0,null,"No"]
["City of Lawrence","Lawrence","KS",7048,70048,"City, County or Local Government Unit or Department of Transportation","Full Reporter",88053,37,0,null,0,null,0,null,0,null,0,null,"No"]
["Bloomington-Normal Public Transit System","Normal","IL",5047,50047,"Independent Public Agency or Authority of Transit Service","Full Reporter",132600,36,1,null,0,null,1,null,3,null,0,null,"No"]
["Unitrans - City of Davis/ASUCD","Davis","CA",9142,90142,"University","Full Reporter",72794,36,0,null,0,null,0,null,0,null,0,null,"No"]
["Transit Services of Frederick County","Frederick","MD",3072,30072,"City, County or Local Government Unit or Department of Transportation","Full Reporter",141576,36,1,null,0,null,1,null,0,null,0,null,"No"]
["Muncie Indiana Transit System","Muncie","IN",5054,50054,"City, County or Local Government Unit or Department of Transportation","Full Reporter",90580,36,1,null,0,null,1,null,0,null,0,null,"No"]
["Tahoe Transportation District","Zephyr Cove","NV","9R02-137",91092,"Independent Public Agency or Authority of Transit Service","Full Reporter",210000,36,5,null,0,null,5,null,4,null,0,null,"No"]
["Bay County Transportation Planning Organization","Panama City","FL",4185,40185,"MPO, COG or Other Planning Agency","Full Reporter",143280,35,1,null,0,null,1,null,0,null,0,null,"No"]
["City of Fargo, DBA: Metropolitan Area Transit","Fargo","ND",8003,80003,"City, County or Local Government Unit or Department of Transportation","Full Reporter",176676,35,2,null,0,null,2,null,1,null,0,null,"No"]
["City of Glendale","Glendale","CA",null,99423,"City, County or Local Government Unit or Department of Transportation","Full Reporter",12150996,34,0,null,0,null,0,null,0,null,0,null,"No"]
["City of Santa Rosa","Santa Rosa","CA",9017,90017,"City, County or Local Government Unit or Department of Transportation","Full Reporter",308231,34,3,null,0,null,3,null,0,null,0,null,"No"]
["Yuba-Sutter Transit Authority","Marysville","CA",9061,90061,"Independent Public Agency or Authority of Transit Service","Full Reporter",116719,34,0,null,0,null,0,null,0,null,0,null,"No"]
["Woods Hole, Martha's Vineyard and Nantucket Steamship Authority","Woods Hole","MA",null,10183,"Independent Public Agency or Authority of Transit Service","Full Reporter",246695,34,8,null,0,null,8,null,4,null,0,null,"No"]
["Altoona Metro Transit","Altoona","PA",3011,30011,"Independent Public Agency or Authority of Transit Service","Full Reporter",79930,34,1,null,0,null,1,null,0,null,0,null,"No"]
["Council on Aging of St. Lucie, Inc.","Fort Pierce","FL",4097,40097,"Private Provider Reporting on Behalf of a Public Entity","Full Reporter",376047,33,1,null,0,null,1,null,0,null,0,null,"No"]
["Missoula Urban Transportation District","Missoula","MT",8009,80009,"Independent Public Agency or Authority of Transit Service","Full Reporter",82157,33,1,null,0,null,1,null,1,null,0,null,"No"]
["City of Brownsville - Brownsville Metro","Brownsville","TX",6014,60014,"City, County or Local Government Unit or Department of Transportation","Full Reporter",217585,33,3,null,0,null,3,null,2,null,0,null,"No"]
["Washington County Transit","West Bend","WI",5160,50160,"City, County or Local Government Unit or Department of Transportation","Full Reporter",1376476,33,0,null,0,null,0,null,0,null,0,null,"No"]
["North Carolina State University Transportation Department","Raleigh","NC",4147,40147,"University","Full Reporter",884891,32,0,null,0,null,0,null,0,null,0,null,"No"]
["The Woodlands Township","The Woodlands","TX",6134,60134,"City, County or Local Government Unit or Department of Transportation","Full Reporter",239938,32,3,null,0,null,3,null,0,null,0,null,"No"]
["Fayette Area Coordinated Transportation","Lemont Furnace","PA",3087,30087,"City, County or Local Government Unit or Department of Transportation","Full Reporter",51370,32,2,null,0,null,2,null,1,null,0,null,"No"]
["Northern Arizona Intergovernmental Public Transportation Authority","Flagstaff","AZ",9219,90219,"Independent Public Agency or Authority of Transit Service","Full Reporter",71957,32,0,null,0,null,0,null,0,null,0,null,"No"]
["Monsey New Square Trails Corporation","Spring Valley","NY",2135,20135,"Private-For-Profit Corporation","Full Reporter",18351295,32,0,null,0,null,0,null,0,null,0,null,"No"]
["Western Maine Transportation Services, Inc.","Auburn","ME",1098,10098,"Private-Non-Profit Corporation","Full Reporter",59397,32,0,null,0,null,0,null,0,null,0,null,"No"]
["El Dorado County Transit Authority","Diamond Springs","CA",9229,90229,"Independent Public Agency or Authority of Transit Service","Full Reporter",1723634,32,0,null,0,null,0,null,0,null,0,null,"No"]
["Saginaw Transit Authority Regional Service","Saginaw","MI",5039,50039,"Independent Public Agency or Authority of Transit Service","Full Reporter",126265,32,1,null,0,null,1,null,0,null,0,null,"No"]
["City of Huntsville, Alabama - Public Transportation Division","Huntsville","AL",4071,40071,"City, County or Local Government Unit or Department of Transportation","Full Reporter",286692,32,2,null,0,null,2,null,2,null,1,null,"No"]
["Decatur Public Transit System","Decatur","IL",5061,50061,"City, County or Local Government Unit or Department of Transportation","Full Reporter",93863,31,1,null,0,null,1,null,0,null,0,null,"No"]
["Billings Metropolitan Transit","Billings","MT",8004,80004,"City, County or Local Government Unit or Department of Transportation","Full Reporter",114773,31,2,null,0,null,2,null,0,null,0,null,"No"]
["Lee-Russell Council of Governments","Opelika","AL",4073,40073,"MPO, COG or Other Planning Agency","Reduced Reporter",74741,30,0,null,0,null,0,null,0,null,0,null,"No"]
["Carroll County Department of Public Works","Westminster","MD",3092,30092,"City, County or Local Government Unit or Department of Transportation","Reduced Reporter",72714,30,0,null,0,null,0,null,0,null,0,null,"No"]
["LaCrosse Municipal Transit Utility","La Crosse","WI",5004,50004,"City, County or Local Government Unit or Department of Transportation","Full Reporter",100868,30,1,null,0,null,1,null,0,null,0,null,"No"]
["Virgin Islands Department of Public Works","St. Thomas","VI",4188,40188,"State Government Unit or Department of Transportation","Reduced Reporter",106405,30,0,null,0,null,0,null,1,null,0,null,"No"]
["Meadowlands Transportation Brokerage Corporation, dba Meadowlink","Wood Ridge","NJ",2197,20197,"Private-Non-Profit Corporation","Reduced Reporter",18351295,30,0,null,0,null,0,null,0,null,0,null,"No"]
["City of Kokomo","Kokomo","IN",5145,50145,"City, County or Local Government Unit or Department of Transportation","Full Reporter",62182,30,1,null,0,null,1,null,0,null,0,null,"No"]
["Ozaukee County Transit Services","Port Washington","WI",5161,50161,"City, County or Local Government Unit or Department of Transportation","Full Reporter",1376476,30,1,null,0,null,1,null,1,null,2,null,"No"]
["GO Transit","Oshkosh","WI",5009,50009,"City, County or Local Government Unit or Department of Transportation","Full Reporter",74495,30,2,null,0,null,2,null,0,null,0,null,"No"]
["Gaston County","Gastonia","NC",4221,40221,"City, County or Local Government Unit or Department of Transportation","Reduced Reporter",169495,30,1,null,0,null,1,null,0,null,0,null,"No"]
["Redding Area Bus Authority","Redding","CA",9093,90093,"Independent Public Agency or Authority of Transit Service","Full Reporter",117731,29,1,null,0,null,1,null,0,null,0,null,"No"]
["New York City Department of Transportation","New York","NY",2082,20082,"City, County or Local Government Unit or Department of Transportation","Full Reporter",18351295,29,3,null,0,null,3,null,7,null,6,null,"No"]
["Cape Girardeau County Transit Authority","Cape Girardeau","MO",7051,70051,"Independent Public Agency or Authority of Transit Service","Reduced Reporter",52900,29,0,null,0,null,0,null,0,null,0,null,"No"]
["City of Pasadena","Pasadena","CA",null,99424,"City, County or Local Government Unit or Department of Transportation","Reduced Reporter",12150996,29,0,null,0,null,0,null,0,null,0,null,"No"]
["Cedar Rapids Transit","Cedar Rapids","IA",7008,70008,"City, County or Local Government Unit or Department of Transportation","Full Reporter",177844,29,1,null,0,null,1,null,1,null,0,null,"No"]
["Jalbert Leasing, Inc.","Portsmouth","NH",1122,10122,"Private-For-Profit Corporation","Reduced Reporter",88200,29,3,null,0,null,3,null,0,null,0,null,"No"]
["Indian River County","Vero Beach","FL",4104,40104,"City, County or Local Government Unit or Department of Transportation","Full Reporter",149422,29,0,null,0,null,0,null,0,null,0,null,"No"]
["Central Indiana Regional Transportation Authority","Indianapolis","IN",5209,50209,"Independent Public Agency or Authority of Transit Service","Reduced Reporter",1487483,29,0,null,0,null,0,null,0,null,0,null,"No"]
["Laguna Beach Municipal Transit","Laguna Beach","CA",9119,90119,"City, County or Local Government Unit or Department of Transportation","Full Reporter",583681,28,0,null,0,null,0,null,0,null,0,null,"No"]
["Thousand Oaks Transit","Thousand Oaks","CA",9165,90165,"City, County or Local Government Unit or Department of Transportation","Reduced Reporter",214811,28,1,null,0,null,1,null,0,null,0,null,"No"]
["Flint Hills Area Transportation","Manhattan","KS",7053,70053,"Private-Non-Profit Corporation","Reduced Reporter",54622,28,0,null,0,null,0,null,0,null,0,null,{"$f":"IF(S387&Q387&O387&M387&K387<>\"\",\"Yes\",\"No\")","v":"No"}]
["Golden Crescent Regional Planning Commission","Victoria","TX",6095,60095,"MPO, COG or Other Planning Agency","Reduced Reporter",63683,28,1,null,0,null,1,null,0,null,0,null,"No"]
["The Gulf Coast Center","Texas City","TX",6082,60082,"Independent Public Agency or Authority of Transit Service","Full Reporter",106383,28,0,null,0,null,0,null,0,null,0,null,"No"]
["A&C Bus Corporation & Montgomery & Westside Owners Association","Jersey City","NJ",2219,20219,"Private-For-Profit Corporation","Reduced Reporter",18351295,28,0,null,0,null,0,null,0,null,0,null,"No"]
["Iredell County Area Transportation Services","Statesville","NC",4205,40205,"City, County or Local Government Unit or Department of Transportation","Reduced Reporter",1249442,28,0,null,0,null,0,null,0,null,0,null,"No"]
["Cape May County Fare Free Transportation","Cape May Court House","NJ",2203,20203,"City, County or Local Government Unit or Department of Transportation","Reduced Reporter",51291,28,0,null,0,null,0,null,0,null,0,null,"No"]
["University of Iowa","Iowa City","IA",7019,70019,"University","Full Reporter",106621,28,0,null,0,null,0,null,0,null,0,null,"No"]
["Jackson County Mass Transit District","Carbondale","IL",5204,50204,"Independent Public Agency or Authority of Transit Service","Reduced Reporter",67821,28,0,null,0,null,0,null,0,null,0,null,"No"]
["Santa Maria Area Transit","Santa Maria","CA",9087,90087,"City, County or Local Government Unit or Department of Transportation","Full Reporter",130447,28,1,null,0,null,1,null,0,null,0,null,"No"]
["East Alabama Regional Planning and Development Commission","Anniston","AL",4064,40064,"MPO, COG or Other Planning Agency","Reduced Reporter",79796,28,1,null,0,null,1,null,0,null,0,null,"No"]
["City of San Juan","San Juan","PR",4112,40112,"City, County or Local Government Unit or Department of Transportation","Reduced Reporter",2148346,28,4,null,0,null,4,null,2,null,4,null,"No"]
["City of Pocatello","Pocatello","ID",22,22,"City, County or Local Government Unit or Department of Transportation","Reduced Reporter",69809,28,1,null,0,null,1,null,0,null,0,null,"No"]
["Ozark Regional Transit","Springdale","AR",6072,60072,"Independent Public Agency or Authority of Transit Service","Full Reporter",295083,28,0,null,0,null,0,null,0,null,0,null,"No"]
["Metropolitan Transit Authority of Black Hawk County","Waterloo","IA",7013,70013,"Independent Public Agency or Authority of Transit Service","Reduced Reporter",113418,27,1,null,0,null,1,null,0,null,0,null,"No"]
["Johnson City Transit System","Johnson City","TN",4054,40054,"City, County or Local Government Unit or Department of Transportation","Reduced Reporter",120415,27,1,null,0,null,1,null,1,null,0,null,"No"]
["Voluntary Action Center","Sycamore","IL",5215,50215,"Private-Non-Profit Corporation","Reduced Reporter",68545,27,0,null,0,null,0,null,0,null,0,null,"No"]
["Handitran Special Transit Division - City of Arlington","Arlington","TX",6041,60041,"City, County or Local Government Unit or Department of Transportation","Full Reporter",5121892,27,0,null,0,null,0,null,0,null,0,null,"No"]
["Cleveland Area Rapid Transit"," Norman","OK",6096,60096,"City, County or Local Government Unit or Department of Transportation","Reduced Reporter",103898,27,2,null,0,null,2,null,0,null,0,null,"No"]
["Las Cruces Area Transit","Las Cruces","NM",6049,60049,"City, County or Local Government Unit or Department of Transportation","Reduced Reporter",128600,27,1,null,0,null,1,null,1,null,0,null,"No"]
["City of Montgomery-Montgomery Area Transit System","Montgomery","AL",4044,40044,"City, County or Local Government Unit or Department of Transportation","Full Reporter",263907,27,3,null,0,null,3,null,3,null,0,null,"No"]
["Palos Verdes Peninsula Transit Authority","Palos Verdes Peninsula","CA",null,90287,"Independent Public Agency or Authority of Transit Service","Reduced Reporter",12150996,27,0,null,0,null,0,null,0,null,0,null,"No"]
["County Commissioners of Charles County, MD","Port Tobacco","MD",3088,30088,"City, County or Local Government Unit or Department of Transportation","Full Reporter",109919,27,2,null,0,null,2,null,0,null,0,null,"No"]
["Shenango Valley Shuttle Service","Hermitage","PA",3055,30055,"City, County or Local Government Unit or Department of Transportation","Full Reporter",387550,27,1,null,0,null,1,null,0,null,0,null,"No"]
["City of Jackson, Department of Planning and Development, Transit Services Division","Jackson","MS",4015,40015,"City, County or Local Government Unit or Department of Transportation","Full Reporter",351478,27,1,null,0,null,1,null,1,null,0,null,"No"]
["Public Transit Services","Mineral Wells","TX",6115,60115,"City, County or Local Government Unit or Department of Transportation","Reduced Reporter",5121892,27,1,null,0,null,1,null,1,null,0,null,"No"]
["Stanislaus County Public Works - Transit","Modesto","CA",9236,90236,"City, County or Local Government Unit or Department of Transportation","Reduced Reporter",358172,27,2,null,0,null,2,null,0,null,0,null,"No"]
["Fond du Lac Area Transit","Fond du Lac","WI",5171,50171,"City, County or Local Government Unit or Department of Transportation","Reduced Reporter",54901,27,2,null,0,null,2,null,0,null,0,null,"No"]
["Williamsport Bureau of Transportation","Williamsport","PA",3026,30026,"City, County or Local Government Unit or Department of Transportation","Full Reporter",56142,26,1,null,0,null,1,null,0,null,0,null,"No"]
["Imperial County Transportation Commission","El Centro","CA",9226,90226,"Independent Public Agency or Authority of Transit Service","Full Reporter",107672,26,3,null,0,null,3,null,0,null,0,null,"No"]
["Adirondack Transit Lines, Inc,","Hurley","NY",2177,20177,"Private-For-Profit Corporation","Full Reporter",18351295,26,10,null,0,null,10,null,0,null,0,null,"No"]
["Municipality of Carolina","Carolina","PR",4125,40125,"City, County or Local Government Unit or Department of Transportation","Reduced Reporter",2148346,26,2,null,0,null,2,null,0,null,0,null,"No"]
["Harris County Community Services Department, Office of Transit Services","Houston","TX",6108,60108,"City, County or Local Government Unit or Department of Transportation","Reduced Reporter",4944332,26,0,null,0,null,0,null,0,null,0,null,"No"]
["South Jersey Transportation Authority","Camden","NJ",2200,20200,"Independent Public Agency or Authority of Transit Service","Reduced Reporter",248402,26,0,null,0,null,0,null,0,null,0,null,"No"]
["Clarksville Transit System","Clarksville","TN",4092,40092,"City, County or Local Government Unit or Department of Transportation","Reduced Reporter",158655,26,1,null,0,null,1,null,0,null,0,null,"No"]
["Altamont Corridor Express","Stockton","CA",9182,90182,"Independent Public Agency or Authority of Transit Service","Full Reporter",370583,26,10,null,0,null,10,null,0,null,0,null,"No"]
["Muscogee (Creek) Nation","Okmulgee","OK","6T08",66170,"Tribe","Reduced Reporter",0,26,0,null,0,null,0,null,0,null,0,null,"No"]
["Greater Portland Transit District","Portland","ME",1016,10016,"Independent Public Agency or Authority of Transit Service","Full Reporter",203914,26,1,null,0,null,1,null,0,null,0,null,"No"]
["Harford Transit","Abingdon","MD",3074,30074,"City, County or Local Government Unit or Department of Transportation","Reduced Reporter",213751,26,1,null,0,null,1,null,0,null,0,null,"No"]
["Sioux City Transit System","Sioux City","IA",7012,70012,"City, County or Local Government Unit or Department of Transportation","Full Reporter",106494,26,1,null,0,null,1,null,2,null,0,null,"No"]
["Waco Transit System, Inc.","Waco","TX",6012,60012,"City, County or Local Government Unit or Department of Transportation","Full Reporter",172378,25,1,null,0,null,1,null,0,null,0,null,"No"]
["Berkshire Regional Transit Authority","Pittsfield","MA",1007,10007,"Subsidiary Unit of a Transit Agency, Reporting Separately","Full Reporter",59124,25,1,null,0,null,1,null,1,null,0,null,"No"]
["CityLink Transit","Abilene","TX",6040,60040,"City, County or Local Government Unit or Department of Transportation","Reduced Reporter",110421,25,1,null,0,null,1,null,0,null,0,null,"No"]
["Island Transit","Galveston","TX",6015,60015,"City, County or Local Government Unit or Department of Transportation","Reduced Reporter",0,25,2,null,0,null,2,null,4,null,0,null,"No"]
["University Of New Hampshire - University Transportation Services","Durham","NH",1119,10119,"University","Full Reporter",88087,25,2,null,0,null,2,null,0,null,0,null,"No"]
["Athens Transit System","Athens","GA",4047,40047,"City, County or Local Government Unit or Department of Transportation","Full Reporter",128754,25,2,null,0,null,2,null,2,null,0,null,"No"]
["Macon-Bibb County Transit Authority","Macon","GA",4130,40130,"Independent Public Agency or Authority of Transit Service","Reduced Reporter",137570,25,1,null,0,null,1,null,4,null,0,null,"No"]
["Town of Cary","Cary","NC",4143,40143,"City, County or Local Government Unit or Department of Transportation","Reduced Reporter",884891,25,1,null,0,null,1,null,0,null,0,null,"No"]
["Twin Cities Area Transportation Authority","Benton Harbor","MI",5132,50132,"Independent Public Agency or Authority of Transit Service","Reduced Reporter",61022,25,1,null,0,null,1,null,0,null,0,null,"No"]
["Bis-Man Transit Board","Bismarck","ND",8019,80019,"Independent Public Agency or Authority of Transit Service","Reduced Reporter",81955,24,1,null,0,null,1,null,0,null,0,null,"No"]
["Boston Express Bus, Inc.","Concord","NH",1133,10133,"Private-For-Profit Corporation","Reduced Reporter",4181019,24,6,null,0,null,6,null,0,null,0,null,"No"]
["University of Minnesota Transit","Minneapolis","MN",5218,50515,"University","Full Reporter",2650890,24,0,null,0,null,0,null,0,null,0,null,"No"]
["Las Vegas Monorail Company","Las Vegas","NV",9242,90242,"Private-Non-Profit Corporation","Full Reporter",1886011,24,7,null,0,null,7,null,22,null,11,null,"No"]
["University of Kansas Parking & Transit","Lawrence","KS",null,70044,"University","Full Reporter",88053,24,0,null,0,null,0,null,0,null,0,null,"No"]
["City Utilities of Springfield","Springfield","MO",7003,70003,"City, County or Local Government Unit or Department of Transportation","Full Reporter",273724,24,2,null,0,null,2,null,0,null,0,null,"No"]
["County of Lebanon Transit Authority","Lebanon","PA",3095,30095,"Independent Public Agency or Authority of Transit Service","Full Reporter",77086,24,2,null,0,null,2,null,0,null,0,null,"No"]
["C-TRAN","Elmira","NY",2005,20005,"City, County or Local Government Unit or Department of Transportation","Reduced Reporter",67983,24,1,null,0,null,1,null,0,null,0,null,"No"]
["Pueblo Transit System","Pueblo","CO",8007,80007,"City, County or Local Government Unit or Department of Transportation","Full Reporter",136550,24,1,null,0,null,1,null,0,null,0,null,"No"]
["Norwalk Transit System","Norwalk","CA",9022,90022,"City, County or Local Government Unit or Department of Transportation","Full Reporter",12150996,24,0,null,0,null,0,null,0,null,0,null,"No"]
["Berkeley Charleston Dorchester RTMA","Moncks Corner","SC",4206,40206,"Independent Public Agency or Authority of Transit Service","Reduced Reporter",548404,24,2,null,0,null,2,null,0,null,0,null,"No"]
["City of Lompoc - Lompoc Transit","Lompoc","CA",9149,90149,"City, County or Local Government Unit or Department of Transportation","Reduced Reporter",51509,23,0,null,0,null,0,null,0,null,0,null,"No"]
["Confederated Salish and Kootenai Tribes","Pablo","MT","8T04",88134,"Tribe","Reduced Reporter",0,23,0,null,0,null,0,null,0,null,0,null,"No"]
["Municipality of Caguas Mobility Office","Caguas","PR",4115,40115,"City, County or Local Government Unit or Department of Transportation","Reduced Reporter",2148346,23,0,null,0,null,0,null,0,null,0,null,"No"]
["Community Transit, Inc.","Paramus","NJ",2160,20160,"Private-For-Profit Corporation","Reduced Reporter",18351295,23,2,null,0,null,2,null,0,null,0,null,"No"]
["Muskegon Area Transit System","Muskegon Heights","MI",5037,50037,"City, County or Local Government Unit or Department of Transportation","Reduced Reporter",161280,23,1,null,0,null,1,null,0,null,0,null,"No"]
["Citrus County Transit","Lecanto","FL","4R02-035",41157,"City, County or Local Government Unit or Department of Transportation","Reduced Reporter",80962,23,1,null,0,null,1,null,0,null,0,null,{"$f":"IF(S451&Q451&O451&M451&K451<>\"\",\"Yes\",\"No\")","v":"No"}]
["Connecticut Department of Transportation - CTTransit New Britain -Dattco.","New Britain","CT",1045,10045,"Private Provider Reporting on Behalf of a Public Entity","Full Reporter",924859,23,0,null,0,null,0,null,0,null,0,null,"No"]
["Baltimore City Department of Transportation","Baltimore","MD",null,30201,"City, County or Local Government Unit or Department of Transportation","Full Reporter",2203663,23,0,null,5,null,5,null,0,null,0,null,"No"]
["RiverCities Transit","Longview","WA",16,16,"City, County or Local Government Unit or Department of Transportation","Full Reporter",63952,23,1,null,0,null,1,null,0,null,0,null,"No"]
["Lima Allen County Regional Transit Authority","Lima","OH",5093,50093,"Independent Public Agency or Authority of Transit Service","Reduced Reporter",72852,23,1,null,0,null,1,null,0,null,0,null,"No"]
["Roseville Transit","Roseville","CA",9168,90168,"City, County or Local Government Unit or Department of Transportation","Reduced Reporter",1723634,23,1,null,0,null,1,null,0,null,0,null,"No"]
["Pee Dee Regional Transportation Authority","Florence","SC",4056,40056,"Independent Public Agency or Authority of Transit Service","Reduced Reporter",89557,23,0,null,0,null,0,null,0,null,0,null,"No"]
["Shoreline Metro","Sheboygan","WI",5088,50088,"City, County or Local Government Unit or Department of Transportation","Full Reporter",71313,23,1,null,0,null,1,null,0,null,0,null,"No"]
["Metra Transit System (Columbus, GA)","Columbus","GA",4024,40024,"City, County or Local Government Unit or Department of Transportation","Reduced Reporter",253602,23,1,null,0,null,1,null,0,null,0,null,"No"]
["University of Arkansas, Fayetteville","Fayetteville","AR",6062,60062,"University","Reduced Reporter",295083,23,1,null,0,null,1,null,2,null,0,null,"No"]
["Eastern Panhandle Transit Authority","Martinsburg","WV",3090,30090,"Independent Public Agency or Authority of Transit Service","Reduced Reporter",182696,23,0,null,0,null,0,null,0,null,0,null,"No"]
["Mid Mon Valley Transit Authority","Charleroi","PA",3061,30061,"Independent Public Agency or Authority of Transit Service","Full Reporter",66086,23,3,null,0,null,3,null,0,null,0,null,"No"]
["Southeast Area Transit","Preston","CT",1040,10040,"Independent Public Agency or Authority of Transit Service","Full Reporter",209190,23,1,null,0,null,1,null,0,null,0,null,"No"]
["Tar River Transit","Rocky Mount","NC",4096,40096,"City, County or Local Government Unit or Department of Transportation","Reduced Reporter",68243,22,1,null,0,null,1,null,1,null,0,null,"No"]
["Ulster County Area Transit","Kingston","NY",2178,20178,"City, County or Local Government Unit or Department of Transportation","Full Reporter",423566,22,3,null,0,null,3,null,2,null,0,null,"No"]
["Huntington Area Rapid Transit","Huntington Station","NY",2071,20071,"City, County or Local Government Unit or Department of Transportation","Full Reporter",18351295,22,0,null,0,null,0,null,0,null,0,null,"No"]
["Midland-Odessa Urban Transit District","Midland","TX",6097,60097,"City, County or Local Government Unit or Department of Transportation","Reduced Reporter",126405,22,2,null,0,null,2,null,0,null,0,null,"No"]
["Monongalia County Urban Mass Transit Authority","Morgantown","WV",3089,30089,"Independent Public Agency or Authority of Transit Service","Reduced Reporter",70350,22,1,null,0,null,1,null,0,null,0,null,"No"]
["Charlottesville Area Transit","Charlottesville","VA",3036,30036,"City, County or Local Government Unit or Department of Transportation","Reduced Reporter",92359,22,1,null,0,null,1,null,1,null,0,null,"No"]
["Craven County","New Bern","NC",4210,40210,"City, County or Local Government Unit or Department of Transportation","Reduced Reporter",50503,22,0,null,0,null,0,null,0,null,0,null,"No"]
["Cache Valley Transit District","Logan","UT",8028,80028,"Independent Public Agency or Authority of Transit Service","Full Reporter",94983,22,1,null,0,null,1,null,0,null,0,null,"No"]
["Wausau Area Transit System","Wausau","WI",5091,50091,"City, County or Local Government Unit or Department of Transportation","Reduced Reporter",74632,21,1,null,0,null,1,null,0,null,0,null,"No"]
["County of Hunterdon","Flemington","NJ",2212,20212,"City, County or Local Government Unit or Department of Transportation","Reduced Reporter",18351295,21,0,null,0,null,0,null,0,null,0,null,"No"]
["The Lawton Area Transit System","Lawton","OK",6094,60094,"City, County or Local Government Unit or Department of Transportation","Reduced Reporter",94457,21,1,null,0,null,1,null,0,null,0,null,"No"]
["Macatawa Area Express Transportation Authority","Holland","MI",5184,50184,"Independent Public Agency or Authority of Transit Service","Full Reporter",99941,21,1,null,0,null,1,null,0,null,0,null,"No"]
["Fredericksburg Regional Transit","Fredericksburg","VA",3079,30079,"City, County or Local Government Unit or Department of Transportation","Reduced Reporter",141238,21,1,null,0,null,1,null,1,null,0,null,"No"]
["Municipality of Yauco","Yauco","PR",4174,40174,"City, County or Local Government Unit or Department of Transportation","Reduced Reporter",90899,21,3,null,0,null,3,null,0,null,0,null,"No"]
["City of Greeley - Transit Services","Greeley","CO",8010,80010,"City, County or Local Government Unit or Department of Transportation","Reduced Reporter",117825,21,0,null,0,null,0,null,0,null,0,null,"No"]
["Battle Creek Transit","Battle Creek","MI",5030,50030,"City, County or Local Government Unit or Department of Transportation","Reduced Reporter",78393,21,1,null,0,null,1,null,0,null,0,null,"No"]
["Eastern Band of Cherokee Indians","Cherokee","NC","4T02",44913,"Tribe","Reduced Reporter",0,21,0,null,0,null,0,null,0,null,0,null,"No"]
["Iowa City Transit","Iowa City","IA",7018,70018,"City, County or Local Government Unit or Department of Transportation","Full Reporter",106621,21,2,null,0,null,2,null,2,null,0,null,"No"]
["Valley Transit","Walla Walla","WA",64,64,"Independent Public Agency or Authority of Transit Service","Reduced Reporter",55805,21,1,null,0,null,1,null,0,null,0,null,"No"]
["Kings County Area Public Transit Agency","Hanford","CA",9200,90200,"Independent Public Agency or Authority of Transit Service","Full Reporter",87941,21,1,null,0,null,1,null,0,null,0,null,"No"]
["Benton County","Corvallis","OR",65,65,"City, County or Local Government Unit or Department of Transportation","Reduced Reporter",62433,21,0,null,0,null,0,null,0,null,0,null,"No"]
["City of Tyler","Tyler","TX",6089,60089,"City, County or Local Government Unit or Department of Transportation","Reduced Reporter",130247,21,1,null,0,null,1,null,0,null,0,null,"No"]
["Gary Public Transportation Corporation","Gary","IN",5045,50045,"City, County or Local Government Unit or Department of Transportation","Full Reporter",8608208,20,1,null,0,null,1,null,1,null,1,null,"No"]
["Northern New England Passenger Rail Authority","Portland","ME",1115,10115,"Independent Public Agency or Authority of Transit Service","Full Reporter",203914,20,12,null,0,null,12,null,2,null,1,null,"No"]
["City of Radford","Radford","VA",null,30200,"City, County or Local Government Unit or Department of Transportation","Reduced Reporter",88542,20,1,null,0,null,1,null,1,null,0,null,"No"]
["Goldsboro-Wayne Transportation Authority","Goldsboro","NC",4132,40132,"Independent Public Agency or Authority of Transit Service","Reduced Reporter",61054,20,1,null,0,null,1,null,0,null,0,null,"No"]
["Amarillo City Transit","Amarillo","TX",6001,60001,"City, County or Local Government Unit or Department of Transportation","Reduced Reporter",196651,20,1,null,0,null,1,null,0,null,0,null,"No"]
["Unified Government Transit Department","Kansas City","KS",7047,70047,"City, County or Local Government Unit or Department of Transportation","Reduced Reporter",1519417,20,1,null,0,null,1,null,0,null,0,null,"No"]
["Great Falls Transit District","Great Falls","MT",8012,80012,"Independent Public Agency or Authority of Transit Service","Full Reporter",65207,20,1,null,0,null,1,null,0,null,0,null,"No"]
["Rapid Transit System","Rapid City","SD",8014,80014,"City, County or Local Government Unit or Department of Transportation","Reduced Reporter",81251,20,0,null,0,null,0,null,0,null,0,null,"No"]
["City of Jackson Transportation Authority","Jackson","MI",5034,50034,"Independent Public Agency or Authority of Transit Service","Full Reporter",90057,20,1,null,0,null,1,null,0,null,0,null,"No"]
["Greenville Transit Authority","Greenville","SC",4053,40053,"Independent Public Agency or Authority of Transit Service","Full Reporter",400492,20,1,null,0,null,1,null,0,null,0,null,"No"]
["Rowan Transit System","Salisbury","NC",4217,40217,"City, County or Local Government Unit or Department of Transportation","Reduced Reporter",214881,19,0,null,0,null,0,null,0,null,0,null,"No"]
["Washington State Ferries","Seattle","WA",35,35,"State Government Unit or Department of Transportation","Full Reporter",3059393,19,20,null,0,null,20,null,0,null,0,null,"No"]
["Cape Ann Transportation Authority","Gloucester","MA",1053,10053,"Independent Public Agency or Authority of Transit Service","Full Reporter",4181019,19,0,null,0,null,0,null,0,null,0,null,"No"]
["High Point Transit","High Point","NC",4011,40011,"City, County or Local Government Unit or Department of Transportation","Reduced Reporter",166485,19,1,null,0,null,1,null,0,null,0,null,"No"]
["Mid-Ohio Valley Transit Authority","Parkersburg","WV",3003,30003,"Independent Public Agency or Authority of Transit Service","Reduced Reporter",67229,19,1,null,0,null,1,null,1,null,0,null,"No"]
["Lafayette Transit System","Lafayette","LA",6038,60038,"City, County or Local Government Unit or Department of Transportation","Full Reporter",252720,19,1,null,0,null,1,null,1,null,0,null,"No"]
["Augusta Richmond County Transit Department","Augusta","GA",4023,40023,"City, County or Local Government Unit or Department of Transportation","Full Reporter",386787,19,1,null,0,null,1,null,0,null,0,null,"No"]
["City of Dubuque","Dubuque","IA",7011,70011,"City, County or Local Government Unit or Department of Transportation","Reduced Reporter",67818,19,1,null,0,null,1,null,1,null,0,null,"No"]
["Municipality of Mayaguez","Mayaguez","PR",4194,40194,"City, County or Local Government Unit or Department of Transportation","Reduced Reporter",109572,19,4,null,0,null,4,null,0,null,0,null,"No"]
["City of Union City Transit Division","Union City","CA",9161,90161,"City, County or Local Government Unit or Department of Transportation","Reduced Reporter",3281212,19,1,null,0,null,1,null,0,null,0,null,"No"]
["Targhee Regional Public Transit Authority","Idaho Falls","ID",42,42,"Independent Public Agency or Authority of Transit Service","Reduced Reporter",90733,19,1,null,0,null,1,null,0,null,0,null,"No"]
["County of Carbon","Jim Thorpe","PA","3R04-002",30167,"City, County or Local Government Unit or Department of Transportation","Reduced Reporter",664651,19,0,null,1,null,1,null,0,null,0,null,"No"]
["Southeast Tennessee Human Resource Agency -Cleveland Urban Area Transit System Division","Cleveland","TN",4170,40170,"Other Publicly-Owned or Privately Chartered Corporation","Reduced Reporter",66777,18,1,null,0,null,1,null,0,null,0,null,"No"]
["Davidson County Transportation","Lexington","NC",4131,40131,"City, County or Local Government Unit or Department of Transportation","Reduced Reporter",166485,18,1,null,0,null,1,null,0,null,0,null,"No"]
["Cooperative Alliance for Seacoast Transportation","Dover","NH",1086,10086,"Independent Public Agency or Authority of Transit Service","Full Reporter",88087,18,3,null,0,null,3,null,0,null,0,null,"No"]
["Cities Area Transit","Grand Forks","ND",8008,80008,"City, County or Local Government Unit or Department of Transportation","Full Reporter",61270,18,1,null,0,null,1,null,0,null,0,null,"No"]
["South Metro Area Regional Transit","Wilsonville","OR",46,46,"City, County or Local Government Unit or Department of Transportation","Reduced Reporter",1849898,18,2,null,0,null,2,null,0,null,0,null,"No"]
["Beaumont Municipal Transit System","Beaumont","TX",6016,60016,"City, County or Local Government Unit or Department of Transportation","Full Reporter",147922,18,0,null,0,null,0,null,0,null,0,null,"No"]
["Davenport Public Transit","Davenport","IA",7009,70009,"City, County or Local Government Unit or Department of Transportation","Reduced Reporter",280051,18,1,null,0,null,1,null,0,null,0,null,"No"]
["Delaware County Transit Board","Delaware","OH",5199,50199,"Independent Public Agency or Authority of Transit Service","Full Reporter",1368035,18,0,null,0,null,0,null,0,null,0,null,{"$f":"IF(S515&Q515&O515&M515&K515<>\"\",\"Yes\",\"No\")","v":"No"}]
["Waccamaw Regional Transportation Authority","Conway","SC",4102,40102,"Independent Public Agency or Authority of Transit Service","Reduced Reporter",215304,18,1,null,0,null,1,null,0,null,0,null,"No"]
["Central Florida Commuter Rail","Sanford","FL",4232,40232,"State Government Unit or Department of Transportation","Full Reporter",1510516,18,12,null,0,null,12,null,0,null,0,null,"No"]
["City of Glendale Transit","Glendale","AZ",9034,90034,"City, County or Local Government Unit or Department of Transportation","Full Reporter",3629114,18,1,null,0,null,1,null,0,null,0,null,"No"]
["Petersburg Area Transit","Petersburg","VA",3009,30009,"City, County or Local Government Unit or Department of Transportation","Reduced Reporter",953556,18,1,null,0,null,1,null,1,null,0,null,"No"]
["Mesa County","Grand Junction","CO",8016,80016,"City, County or Local Government Unit or Department of Transportation","Reduced Reporter",128124,17,2,null,0,null,2,null,1,null,0,null,"No"]
["New River Transit Authority","Beckley","WV",null,30199,"Independent Public Agency or Authority of Transit Service","Reduced Reporter",64022,17,0,null,0,null,0,null,0,null,0,null,"No"]
["St. Mary's Transit System -Dept. of Public Works and Transit","California ","MD",3109,30109,"City, County or Local Government Unit or Department of Transportation","Reduced Reporter",58875,17,0,null,0,null,0,null,0,null,0,null,"No"]
["City of Jefferson","Jefferson City","MO",7043,70043,"City, County or Local Government Unit or Department of Transportation","Reduced Reporter",58533,17,1,null,0,null,1,null,0,null,0,null,"No"]
["Plymouth & Brockton Street Railway Company","Plymouth","MA",1117,10117,"Private-For-Profit Corporation","Reduced Reporter",4181019,17,2,null,0,null,2,null,1,null,1,null,"No"]
["River Valley Metro Mass Transit District","Bourbonnais","IL",5159,50159,"City, County or Local Government Unit or Department of Transportation","Full Reporter",81926,17,2,null,0,null,2,null,0,null,0,null,"No"]
["Medina County Public Transit","Medina","OH",5198,50198,"City, County or Local Government Unit or Department of Transportation","Full Reporter",1780673,17,0,null,0,null,0,null,0,null,0,null,"No"]
["City of Huntington Park","Huntington Park","CA",null,90267,"City, County or Local Government Unit or Department of Transportation","Reduced Reporter",12150996,17,0,null,0,null,0,null,0,null,0,null,"No"]
["City of Alhambra","Alhambra","CA",null,90247,"City, County or Local Government Unit or Department of Transportation","Reduced Reporter",12150996,17,0,null,0,null,0,null,0,null,0,null,"No"]
["City of Inglewood","Inglewood","CA",null,90268,"City, County or Local Government Unit or Department of Transportation","Reduced Reporter",12150996,17,0,null,0,null,0,null,0,null,0,null,"No"]
["Manchester Transit Authority","Manchester","NH",1002,10002,"Independent Public Agency or Authority of Transit Service","Reduced Reporter",158377,17,0,null,0,null,0,null,0,null,0,null,"No"]
["City of Avalon","Avalon","CA",null,90249,"City, County or Local Government Unit or Department of Transportation","Reduced Reporter",12150996,17,1,null,0,null,1,null,0,null,0,null,"No"]
["Greater Mankato Transit System","Mankato ","MN",5205,50205,"City, County or Local Government Unit or Department of Transportation","Reduced Reporter",57584,17,0,null,0,null,0,null,0,null,0,null,"No"]
["Hall Area Transit","Gainesville","GA",4144,40144,"City, County or Local Government Unit or Department of Transportation","Reduced Reporter",130846,16,1,null,0,null,1,null,0,null,0,null,"No"]
["Middletown Transit District","Middletown","CT",1063,10063,"Independent Public Agency or Authority of Transit Service","Full Reporter",924859,16,1,null,0,null,1,null,0,null,0,null,"No"]
["City of Downey","Downey","CA",null,90263,"City, County or Local Government Unit or Department of Transportation","Reduced Reporter",12150996,16,1,null,0,null,1,null,0,null,0,null,"No"]
["Fairbanks North Star Borough Transit","Fairbanks","AK",45,45,"City, County or Local Government Unit or Department of Transportation","Reduced Reporter",64513,16,1,null,0,null,1,null,0,null,0,null,"No"]
["Josephine County","Grants Pass","OR",59,59,"City, County or Local Government Unit or Department of Transportation","Reduced Reporter",50520,16,0,null,0,null,0,null,0,null,0,null,"No"]
["Janesville Transit System","Janesville","WI",5108,50108,"City, County or Local Government Unit or Department of Transportation","Reduced Reporter",69658,16,1,null,0,null,1,null,0,null,0,null,"No"]
["City of Madera","Madera","CA",9199,90199,"City, County or Local Government Unit or Department of Transportation","Reduced Reporter",78413,16,1,null,0,null,1,null,0,null,0,null,"No"]
["City of Petaluma","Petaluma","CA",9213,90213,"City, County or Local Government Unit or Department of Transportation","Full Reporter",64078,16,0,null,0,null,0,null,0,null,0,null,"No"]
["City of Monroe Transit System","Monroe","LA",6026,60026,"City, County or Local Government Unit or Department of Transportation","Reduced Reporter",116533,16,1,null,0,null,1,null,0,null,0,null,"No"]
["City of Cleburne","Cleburne","TX",6113,60113,"City, County or Local Government Unit or Department of Transportation","Reduced Reporter",5121892,16,2,null,0,null,2,null,1,null,0,null,"No"]
["Putnam County Transit","Carmel","NY",2096,20096,"City, County or Local Government Unit or Department of Transportation","Full Reporter",18351295,16,0,null,0,null,0,null,0,null,0,null,"No"]
["City of Fort Lauderdale","Fort Lauderdale","FL",null,44929,"City, County or Local Government Unit or Department of Transportation","Full Reporter",5502379,16,3,null,0,null,3,null,2,null,1,null,"No"]
["St Johns County, Florida, Board of County Commissioners","St. Augustine","FL",4155,40155,"City, County or Local Government Unit or Department of Transportation","Reduced Reporter",69173,16,0,null,0,null,0,null,0,null,0,null,"No"]
["City of Lodi - Transit Division","Lodi","CA",9175,90175,"City, County or Local Government Unit or Department of Transportation","Full Reporter",68738,16,1,null,0,null,1,null,2,null,0,null,"No"]
["Ohio Valley Regional Transportation Authority","Wheeling","WV",3035,30035,"Independent Public Agency or Authority of Transit Service","Full Reporter",81249,16,1,null,0,null,1,null,2,null,0,null,"No"]
["City of Clemson/ Clemson Area Transit","Clemson","SC",4208,40208,"City, County or Local Government Unit or Department of Transportation","Full Reporter",400492,16,1,null,0,null,1,null,0,null,0,null,"No"]
["Richland County Transit","Mansfield","OH",5090,50090,"Independent Public Agency or Authority of Transit Service","Reduced Reporter",75250,16,1,null,0,null,1,null,0,null,0,null,"No"]
["City of Portland","Portland","OR",58,58,"City, County or Local Government Unit or Department of Transportation","Full Reporter",1849898,16,4,null,0,null,4,null,1,null,0,null,"No"]
["ART (Asheville Redefines Transit)","Asheville","NC",4005,40005,"City, County or Local Government Unit or Department of Transportation","Full Reporter",280648,16,1,null,0,null,1,null,0,null,0,null,"No"]
["County of Burlington","Mt. Holly","NJ",2208,20208,"City, County or Local Government Unit or Department of Transportation","Reduced Reporter",5441567,16,0,null,0,null,0,null,0,null,0,null,"No"]
["Michiana Area Council of Governments","South Bend","IN",5149,50149,"MPO, COG or Other Planning Agency","Full Reporter",143592,16,0,null,0,null,0,null,0,null,0,null,"No"]
["Simi Valley Transit","Simi Valley","CA",9050,90050,"City, County or Local Government Unit or Department of Transportation","Reduced Reporter",125206,16,0,null,0,null,0,null,0,null,0,null,"No"]
["St. Joseph Transit","St. Joseph","MO",7032,70032,"City, County or Local Government Unit or Department of Transportation","Reduced Reporter",81176,16,3,null,0,null,3,null,0,null,0,null,"No"]
["City of Corona","Corona","CA",9052,90052,"City, County or Local Government Unit or Department of Transportation","Reduced Reporter",1932666,15,1,null,0,null,1,null,2,null,0,null,"No"]
["Camarillo Area Transit","Camarillo","CA",9163,90163,"City, County or Local Government Unit or Department of Transportation","Reduced Reporter",71772,15,0,null,0,null,0,null,0,null,0,null,"No"]
["Nashua Transit System","Nashua","NH",1087,10087,"City, County or Local Government Unit or Department of Transportation","Full Reporter",226400,15,1,null,0,null,1,null,0,null,0,null,"No"]
["City of Vacaville","Vacaville","CA",9155,90155,"City, County or Local Government Unit or Department of Transportation","Reduced Reporter",93141,15,1,null,0,null,1,null,0,null,0,null,"No"]
["City of Anderson Transportation System","Anderson","IN",5041,50041,"City, County or Local Government Unit or Department of Transportation","Reduced Reporter",88133,15,1,null,0,null,1,null,0,null,0,null,"No"]
["Jackson Transit Authority","Jackson","TN",4057,40057,"Independent Public Agency or Authority of Transit Service","Full Reporter",71880,15,1,null,0,null,1,null,0,null,0,null,"No"]
["City of Carson","Carson","CA",null,90258,"City, County or Local Government Unit or Department of Transportation","Reduced Reporter",12150996,15,0,null,0,null,0,null,0,null,0,null,"No"]
["City of Cerritos","Cerritos","CA",null,90259,"City, County or Local Government Unit or Department of Transportation","Reduced Reporter",12150996,15,0,null,0,null,0,null,0,null,0,null,"No"]
["Cherokee County Board of Commissioners","Canton","GA",4161,40161,"City, County or Local Government Unit or Department of Transportation","Reduced Reporter",4515419,14,0,null,0,null,0,null,0,null,0,null,"No"]
["City of Scottsdale - Scottsdale Trolley","Scottsdale","AZ",9131,90131,"City, County or Local Government Unit or Department of Transportation","Full Reporter",3629114,14,3,null,0,null,3,null,0,null,0,null,"No"]
["The City of Cheyenne Transit Program","Cheyenne","WY",8020,80020,"City, County or Local Government Unit or Department of Transportation","Reduced Reporter",73588,14,0,null,0,null,0,null,0,null,0,null,"No"]
["Bettendorf Transit System","Bettendorf","IA",7007,70007,"City, County or Local Government Unit or Department of Transportation","Reduced Reporter",280051,14,0,null,0,null,0,null,0,null,0,null,"No"]
["City of Burbank","Burbank","CA",null,90256,"City, County or Local Government Unit or Department of Transportation","Reduced Reporter",12150996,14,0,null,0,null,0,null,0,null,0,null,"No"]
["Municipality of Guaynabo","Guaynabo","PR",4201,40201,"City, County or Local Government Unit or Department of Transportation","Reduced Reporter",2148346,14,1,null,0,null,1,null,0,null,0,null,"No"]
["City of Irvine","Irvine","CA",9231,90231,"City, County or Local Government Unit or Department of Transportation","Reduced Reporter",12150996,14,2,null,0,null,2,null,9,null,0,null,"No"]
["Albany Transit System","Albany","GA",4021,40021,"City, County or Local Government Unit or Department of Transportation","Full Reporter",95779,14,1,null,0,null,1,null,0,null,0,null,"No"]
["City of Bangor - BAT Community Connector","Bangor","ME",1096,10096,"City, County or Local Government Unit or Department of Transportation","Reduced Reporter",61210,14,1,null,0,null,1,null,0,null,0,null,"No"]
["City of Commerce Municipal Buslines","Commerce","CA",9043,90043,"City, County or Local Government Unit or Department of Transportation","Full Reporter",12150996,14,1,null,0,null,1,null,0,null,0,null,"No"]
["City of Redondo Beach - Beach Cities Transit","Redondo Beach","CA",9214,90214,"City, County or Local Government Unit or Department of Transportation","Full Reporter",12150996,14,1,null,0,null,1,null,0,null,0,null,"No"]
["City of Arcadia Transit","Arcadia","CA",9044,90044,"City, County or Local Government Unit or Department of Transportation","Reduced Reporter",12150996,14,0,null,0,null,0,null,0,null,0,null,"No"]
["City of McAllen - McAllen Express Transit","McAllen","TX",6099,60099,"City, County or Local Government Unit or Department of Transportation","Reduced Reporter",728825,14,1,null,0,null,1,null,0,null,0,null,"No"]
["Olympia Trails Bus Company, Inc.","Elizabeth","NJ",2165,20165,"Private-For-Profit Corporation","Reduced Reporter",18351295,14,5,null,2,null,7,null,3,null,3,null,"No"]
["City of Casper","Casper","WY",8013,80013,"City, County or Local Government Unit or Department of Transportation","Reduced Reporter",64548,14,0,null,0,null,0,null,0,null,0,null,"No"]
["Milford Transit District","Milford","CT",1107,10107,"Independent Public Agency or Authority of Transit Service","Full Reporter",923311,14,0,null,0,null,0,null,0,null,0,null,{"$f":"IF(S579&Q579&O579&M579&K579<>\"\",\"Yes\",\"No\")","v":"No"}]
["City of South Gate","South Gate","CA",null,90291,"City, County or Local Government Unit or Department of Transportation","Reduced Reporter",12150996,14,0,null,0,null,0,null,0,null,0,null,"No"]
["Southeast Missouri State University","Cape Girardeau","MO",7050,70050,"University","Reduced Reporter",52900,13,1,null,0,null,1,null,0,null,0,null,"No"]
["Los Angeles County Department of Public Works - East L.A.","Alhambra","CA",null,90271,"City, County or Local Government Unit or Department of Transportation","Reduced Reporter",12150996,13,0,null,0,null,0,null,0,null,0,null,"No"]
["City of Tracy","Tracy","CA",9197,90197,"City, County or Local Government Unit or Department of Transportation","Reduced Reporter",87569,13,1,null,0,null,1,null,0,null,0,null,"No"]
["City of El Monte Transportation Division","El Monte","CA",null,90265,"City, County or Local Government Unit or Department of Transportation","Reduced Reporter",12150996,13,4,null,0,null,4,null,0,null,0,null,"No"]
["City of Glendora","Glendora","CA",null,90266,"City, County or Local Government Unit or Department of Transportation","Reduced Reporter",12150996,13,0,null,0,null,0,null,0,null,0,null,"No"]
["Kingsport Area Transit System","Kingsport","TN",4080,40080,"City, County or Local Government Unit or Department of Transportation","Reduced Reporter",106571,13,1,null,0,null,1,null,0,null,0,null,"No"]
["City of Albany","Albany","OR",61,61,"City, County or Local Government Unit or Department of Transportation","Reduced Reporter",56997,13,2,null,0,null,2,null,0,null,0,null,"No"]
["Asotin County PTBA","Clarkston","WA",51,51,"City, County or Local Government Unit or Department of Transportation","Reduced Reporter",51924,13,0,null,0,null,0,null,0,null,0,null,"No"]
["Board of County Commissioners of Calvert County, Maryland","Prince Frederick","MD","3R03-005",30131,"City, County or Local Government Unit or Department of Transportation","Reduced Reporter",58875,13,0,null,0,null,0,null,0,null,0,null,"No"]
["City of Danville/Danville Mass Transit","Danville","IL",5174,50174,"City, County or Local Government Unit or Department of Transportation","Reduced Reporter",50996,13,1,null,0,null,1,null,0,null,0,null,"No"]
["Connecticut Department of Transportation -CTTRANSIT New Britain","Berlin","CT",1130,10130,"Private Provider Reporting on Behalf of a Public Entity","Full Reporter",924859,13,0,null,0,null,0,null,0,null,0,null,"No"]
["Annapolis Department of Transportation","Annapolis","MD",3040,30040,"City, County or Local Government Unit or Department of Transportation","Reduced Reporter",2203663,13,1,null,0,null,1,null,1,null,0,null,"No"]
["Mashantucket Pequot Tribal Nation","Mashantucket","CT","1T03",11152,"Tribe","Reduced Reporter",0,13,0,null,0,null,0,null,0,null,0,null,"No"]
["Shoshone-Bannock Tribes","Fort Hall","ID","0T31",31,"Tribe","Reduced Reporter",0,12,0,null,0,null,0,null,0,null,0,null,"No"]
["Jonesboro Economical Transportation System","Jonesboro","AR",6104,60104,"City, County or Local Government Unit or Department of Transportation","Reduced Reporter",65419,12,1,null,0,null,1,null,0,null,0,null,"No"]
["City of Hazleton -- Hazleton Public Transit","Hazleton","PA",3093,30093,"City, County or Local Government Unit or Department of Transportation","Reduced Reporter",56827,12,1,null,0,null,1,null,0,null,0,null,"No"]
["City of Porterville","Porterville","CA",9198,90198,"City, County or Local Government Unit or Department of Transportation","Reduced Reporter",70272,12,1,null,0,null,1,null,0,null,0,null,"No"]
["Confederated Tribes of the Umatilla Indian Reservation","Pendleton","OR","0T06",119,"Tribe","Reduced Reporter",0,12,0,null,0,null,0,null,0,null,0,null,"No"]
["Hernando County Board of County Commissioners","Brooksville","FL",4146,40146,"City, County or Local Government Unit or Department of Transportation","Reduced Reporter",148220,12,0,null,0,null,0,null,0,null,0,null,"No"]
["Lorain County Transit","Elyria","OH",5095,50095,"City, County or Local Government Unit or Department of Transportation","Reduced Reporter",180956,12,0,null,0,null,0,null,0,null,0,null,"No"]
["City of Calabasas","Calabasas","CA",null,90257,"City, County or Local Government Unit or Department of Transportation","Reduced Reporter",12150996,12,1,null,0,null,1,null,0,null,0,null,"No"]
["Springfield City Area Transit","Springfield","OH",5020,50020,"City, County or Local Government Unit or Department of Transportation","Reduced Reporter",85256,12,1,null,0,null,1,null,0,null,0,null,"No"]
["City of Independence","Independence","MO",7046,70046,"City, County or Local Government Unit or Department of Transportation","Reduced Reporter",1519417,12,1,null,0,null,1,null,0,null,0,null,"No"]
["Tuscaloosa County Parking and Transit Authority","Tuscaloosa","AL",4045,40045,"Independent Public Agency or Authority of Transit Service","Reduced Reporter",139114,12,1,null,0,null,1,null,1,null,0,null,"No"]
["Navajo Nation","Window Rock","AZ","9T05",90005,"Tribe","Reduced Reporter",0,12,0,null,0,null,0,null,0,null,0,null,"No"]
["Monroe Bus Corporation","Brooklyn","NY",2137,20137,"Private-For-Profit Corporation","Full Reporter",423566,12,0,null,0,null,0,null,0,null,0,null,"No"]
["The City of Bowling Green/Community Action of Southern Kentucky","Bowling Green","KY",4184,40184,"City, County or Local Government Unit or Department of Transportation","Reduced Reporter",78306,12,0,null,0,null,0,null,0,null,0,null,"No"]
["Gadsden Transportation Services - City of Gadsden","Gadsden","AL",4049,40049,"City, County or Local Government Unit or Department of Transportation","Reduced Reporter",64172,12,0,null,0,null,0,null,0,null,0,null,"No"]
["City of Moorhead, DBA: Metropolitan Area Transit","Moorhead","MN",5026,50026,"City, County or Local Government Unit or Department of Transportation","Full Reporter",176676,11,1,null,0,null,1,null,0,null,0,null,"No"]
["Municipality of Lares","Lares","PR",4197,40197,"City, County or Local Government Unit or Department of Transportation","Reduced Reporter",306196,11,0,null,0,null,0,null,0,null,0,null,"No"]
["Biddeford-Saco-Old Orchard Beach Transit Committee Shuttle Bus","Biddeford","ME",1114,10114,"Independent Public Agency or Authority of Transit Service","Reduced Reporter",203914,11,0,null,0,null,0,null,0,null,0,null,"No"]
["Cecil County Government - SSCT","Elkton","MD",3108,30108,"City, County or Local Government Unit or Department of Transportation","Reduced Reporter",5441567,11,0,null,0,null,0,null,0,null,0,null,"No"]
["Allegany County Transit","Cumberland","MD",3041,30041,"City, County or Local Government Unit or Department of Transportation","Reduced Reporter",51899,11,0,null,0,null,0,null,0,null,0,null,"No"]
["Clarkstown Mini-Trans","Nanuet","NY",2085,20085,"City, County or Local Government Unit or Department of Transportation","Reduced Reporter",18351295,11,0,null,0,null,0,null,0,null,0,null,"No"]
["City of Corvallis","Corvallis","OR",47,47,"City, County or Local Government Unit or Department of Transportation","Full Reporter",62433,11,1,null,0,null,1,null,0,null,0,null,"No"]
["Martin County","Stuart","FL",4192,40192,"City, County or Local Government Unit or Department of Transportation","Full Reporter",376047,11,0,null,0,null,0,null,0,null,0,null,"No"]
["Terre Haute Transit Utility","Terre Haute","IN",5053,50053,"City, County or Local Government Unit or Department of Transportation","Full Reporter",92742,11,2,null,0,null,2,null,0,null,0,null,"No"]
["City of Long Beach","Long Beach","NY",2006,20006,"City, County or Local Government Unit or Department of Transportation","Full Reporter",18351295,11,1,null,0,null,1,null,0,null,0,null,"No"]
["Oglala Sioux Tribe","Pine Ridge","SD","8T08",88122,"Tribe","Reduced Reporter",0,11,1,null,0,null,1,null,0,null,0,null,"No"]
["City of Jacksonville","Jacksonville","NC",4166,40166,"City, County or Local Government Unit or Department of Transportation","Reduced Reporter",105419,11,0,null,0,null,0,null,0,null,0,null,"No"]
["Greenville Area Transit","Greenville","NC",4095,40095,"City, County or Local Government Unit or Department of Transportation","Reduced Reporter",117798,11,0,null,0,null,0,null,0,null,0,null,"No"]
["City of Folsom","Folsom","CA",9220,90220,"City, County or Local Government Unit or Department of Transportation","Reduced Reporter",1723634,11,0,null,0,null,0,null,0,null,0,null,"No"]
["Spokane Tribe of Indians","Wellpinit","WA","0T24",207,"Tribe","Reduced Reporter",0,10,0,null,0,null,0,null,0,null,0,null,"No"]
["San Francisco Bay Area Water Emergency Transportation Authority","San Francisco","CA",9225,90225,"Independent Public Agency or Authority of Transit Service","Full Reporter",3281212,10,9,null,0,null,9,null,0,null,0,null,"No"]
["Detroit Transportation Corporation","Detroit","MI",5141,50141,"Independent Public Agency or Authority of Transit Service","Full Reporter",3734090,10,13,null,0,null,13,null,11,null,15,null,"No"]
["Terrebonne Parish Consolidated Government","Houma","LA",6080,60080,"City, County or Local Government Unit or Department of Transportation","Reduced Reporter",144875,10,1,null,0,null,1,null,0,null,0,null,"No"]
["Washington County Transit","Hagerstown","MD",3042,30042,"City, County or Local Government Unit or Department of Transportation","Reduced Reporter",182696,10,1,null,0,null,1,null,0,null,0,null,"No"]
["San Marcos Urban Transit District","Austin","TX",6131,60131,"Independent Public Agency or Authority of Transit Service","Reduced Reporter",52826,10,1,null,0,null,1,null,0,null,0,null,"No"]
["Port Arthur Transit","Port Arthur","TX",6013,60013,"City, County or Local Government Unit or Department of Transportation","Reduced Reporter",153150,10,1,null,0,null,1,null,0,null,0,null,"No"]
["City of Alexandria","Alexandria","LA",6025,60025,"City, County or Local Government Unit or Department of Transportation","Reduced Reporter",82804,10,1,null,0,null,1,null,0,null,0,null,"No"]
["City of St. George","St. George","UT",8026,80026,"City, County or Local Government Unit or Department of Transportation","Reduced Reporter",98370,10,1,null,0,null,1,null,0,null,0,null,"No"]
["County of Cumberland","Bridgeton","NJ",2201,20201,"City, County or Local Government Unit or Department of Transportation","Reduced Reporter",5441567,10,0,null,0,null,0,null,0,null,0,null,"No"]
["Municipality of Bayamon","Bayamon","PR",4137,40137,"City, County or Local Government Unit or Department of Transportation","Reduced Reporter",2148346,10,3,null,0,null,3,null,2,null,0,null,"No"]
["City of Tulare","Tulare","CA",9244,90244,"City, County or Local Government Unit or Department of Transportation","Full Reporter",219454,10,1,null,0,null,1,null,0,null,0,null,"No"]
["City of Margate","Margate","FL",null,40256,"City, County or Local Government Unit or Department of Transportation","Reduced Reporter",5502379,10,0,null,0,null,0,null,0,null,0,null,"No"]
["Puerto Rico Maritime Transport Authority","Puerto Real","PR",4175,40175,"State Government Unit or Department of Transportation","Full Reporter",2148346,10,5,null,0,null,5,null,0,null,0,null,"No"]
["City of San Luis Obispo","San Luis Obispo","CA",9156,90156,"City, County or Local Government Unit or Department of Transportation","Full Reporter",59219,10,0,null,0,null,0,null,0,null,0,null,"No"]
["Orange Public Transportation","Hillsborough","NC",4231,40231,"City, County or Local Government Unit or Department of Transportation","Reduced Reporter",347602,10,0,null,0,null,0,null,0,null,0,null,"No"]
["Fort Smith Transit","Fort Smith","AR",6086,60086,"City, County or Local Government Unit or Department of Transportation","Reduced Reporter",122947,10,1,null,0,null,1,null,0,null,0,null,"No"]
["Broadway Bus Corporation","Bayonne","NJ",2220,20220,"Private-For-Profit Corporation","Reduced Reporter",18351295,10,0,null,0,null,0,null,0,null,0,null,"No"]
["Municipality of Toa Baja","Toa Baja","PR",4182,40182,"City, County or Local Government Unit or Department of Transportation","Reduced Reporter",2148346,10,1,null,0,null,1,null,0,null,0,null,"No"]
["City of Farmington dba: Red Apple Transit","Farmington","NM",6100,60100,"City, County or Local Government Unit or Department of Transportation","Reduced Reporter",53049,10,0,null,0,null,0,null,0,null,0,null,"No"]
["Ashland Bus System","Ashland","KY",4016,40016,"City, County or Local Government Unit or Department of Transportation","Reduced Reporter",202637,10,0,null,0,null,0,null,0,null,0,null,{"$f":"IF(S643&Q643&O643&M643&K643<>\"\",\"Yes\",\"No\")","v":"No"}]
["City of Joplin Metro Area Public","Joplin","MO",7040,70040,"City, County or Local Government Unit or Department of Transportation","Reduced Reporter",82775,9,0,null,0,null,0,null,0,null,0,null,"No"]
["ColumBUS Transit","Columbus","IN",5177,50177,"City, County or Local Government Unit or Department of Transportation","Reduced Reporter",54933,9,1,null,0,null,1,null,0,null,0,null,"No"]
["Texarkana Urban Transit District","Texarkana","TX",6093,60093,"Independent Public Agency or Authority of Transit Service","Reduced Reporter",78162,9,1,null,0,null,1,null,0,null,0,null,"No"]
["City of West Hollywood","West Hollywood","CA",null,90294,"City, County or Local Government Unit or Department of Transportation","Reduced Reporter",12150996,9,0,null,0,null,0,null,0,null,0,null,"No"]
["City of Gastonia","Gastonia","NC",4010,40010,"City, County or Local Government Unit or Department of Transportation","Reduced Reporter",169495,9,1,null,0,null,1,null,0,null,0,null,"No"]
["City of Monterey Park","Monterey Park","CA",null,90286,"City, County or Local Government Unit or Department of Transportation","Reduced Reporter",12150996,9,1,null,0,null,1,null,0,null,0,null,"No"]
["Owensboro Transit System","Owensboro","KY",4020,40020,"City, County or Local Government Unit or Department of Transportation","Reduced Reporter",70543,9,1,null,0,null,1,null,0,null,0,null,"No"]
["Municipality of Barceloneta","Barceloneta","PR",4150,40150,"City, County or Local Government Unit or Department of Transportation","Reduced Reporter",71747,9,1,null,0,null,1,null,0,null,0,null,"No"]
["Center for Pan Asian Community Services, Inc.","Chamblee","GA",null,40246,"Private-Non-Profit Corporation","Reduced Reporter",4515419,9,0,null,0,null,0,null,0,null,0,null,"No"]
["San Carlos Apache Tribe","Peridot","AZ","9T07",99286,"Tribe","Reduced Reporter",0,9,0,null,0,null,0,null,0,null,0,null,"No"]
["Lewiston-Auburn Transit Committee","Auburn","ME",1015,10015,"City, County or Local Government Unit or Department of Transportation","Reduced Reporter",59397,9,1,null,0,null,1,null,0,null,0,null,"No"]
["Pine Bluff Transit","Pine Bluff","AR",6034,60034,"City, County or Local Government Unit or Department of Transportation","Reduced Reporter",53495,9,0,null,0,null,0,null,0,null,0,null,"No"]
["Municipality of San Lorenzo","San Lorenzo","PR",4195,40195,"City, County or Local Government Unit or Department of Transportation","Reduced Reporter",2148346,9,1,null,0,null,1,null,0,null,0,null,"No"]
["City of Edmond","Edmond","OK",6118,60118,"City, County or Local Government Unit or Department of Transportation","Reduced Reporter",861505,9,0,null,0,null,0,null,0,null,0,null,"No"]
["City of Delano","Delano","CA",9238,90238,"City, County or Local Government Unit or Department of Transportation","Reduced Reporter",54372,9,2,null,0,null,2,null,0,null,0,null,"No"]
["City of Bell","Bell","CA",null,90252,"City, County or Local Government Unit or Department of Transportation","Reduced Reporter",12150996,9,0,null,0,null,0,null,0,null,0,null,"No"]
["Wichita Falls Transit System","Wichita Falls","TX",6035,60035,"City, County or Local Government Unit or Department of Transportation","Reduced Reporter",99437,9,1,null,0,null,1,null,0,null,0,null,"No"]
["City of Seattle - Seattle Center Monorail Transit","Seattle","WA",23,23,"City, County or Local Government Unit or Department of Transportation","Full Reporter",3059393,8,2,null,0,null,2,null,1,null,0,null,"No"]
["City of Sierra Vista","Sierra Vista","AZ",9239,90239,"City, County or Local Government Unit or Department of Transportation","Reduced Reporter",52745,8,1,null,0,null,1,null,0,null,0,null,"No"]
["Suffolk Transit","Suffolk","VA",null,30198,"City, County or Local Government Unit or Department of Transportation","Reduced Reporter",1439666,8,1,null,0,null,1,null,0,null,0,null,"No"]
["City of Valparaiso","Valparaiso","IN",5183,50183,"City, County or Local Government Unit or Department of Transportation","Full Reporter",8608208,8,0,null,0,null,0,null,0,null,0,null,"No"]
["City of Ocala, Florida","Ocala","FL",4120,40120,"City, County or Local Government Unit or Department of Transportation","Full Reporter",156909,8,1,null,0,null,1,null,0,null,0,null,"No"]
["Longview Transit","Longview","TX",6081,60081,"City, County or Local Government Unit or Department of Transportation","Reduced Reporter",98884,8,0,null,0,null,0,null,0,null,0,null,"No"]
["Municipality of Hormigueros","Hormigueros","PR",4121,40121,"City, County or Local Government Unit or Department of Transportation","Reduced Reporter",109572,8,0,null,0,null,0,null,0,null,0,null,"No"]
["City of Beloit Transit System","Beloit","WI",5109,50109,"City, County or Local Government Unit or Department of Transportation","Reduced Reporter",63835,8,1,null,0,null,1,null,0,null,0,null,"No"]
["Spartanburg Transit System","Spartanburg","SC",4101,40101,"Independent Public Agency or Authority of Transit Service","Reduced Reporter",180786,8,1,null,0,null,1,null,1,null,0,null,"No"]
["Greater Derry Salem Cooperative Alliance for Regional Transportation","Salem","NH",1123,10123,"Independent Public Agency or Authority of Transit Service","Reduced Reporter",4181019,8,0,null,0,null,0,null,0,null,0,null,"No"]
["City of Turlock","Turlock","CA",9201,90201,"City, County or Local Government Unit or Department of Transportation","Full Reporter",99904,8,1,null,0,null,1,null,0,null,0,null,"No"]
["Carson Area Metropolitan Planning Organization","Carson City","NV",9215,90215,"MPO, COG or Other Planning Agency","Reduced Reporter",58079,8,1,null,0,null,1,null,0,null,0,null,"No"]
["Michigan City Transit","Michigan City","IN",5098,50098,"City, County or Local Government Unit or Department of Transportation","Reduced Reporter",66025,8,0,null,0,null,0,null,0,null,0,null,"No"]
["St. Bernard Urban Rapid Transit","Chalmette","LA",6058,60058,"City, County or Local Government Unit or Department of Transportation","Reduced Reporter",899703,8,0,null,0,null,0,null,0,null,0,null,"No"]
["Fort Peck Tribes","Poplar ","MT","8T18",80018,"Tribe","Reduced Reporter",0,8,0,null,0,null,0,null,0,null,0,null,"No"]
["Municipality of San Sebastian","San Sebastian","PR",4183,40183,"City, County or Local Government Unit or Department of Transportation","Reduced Reporter",306196,8,1,null,0,null,1,null,0,null,0,null,"No"]
["City of Fairfax CUE Bus","Fairfax","VA",3058,30058,"City, County or Local Government Unit or Department of Transportation","Full Reporter",4586770,8,0,null,0,null,0,null,0,null,0,null,"No"]
["Kalispel Tribe of Indians","Usk","WA","0T09",9,"Tribe","Reduced Reporter",0,8,0,null,0,null,0,null,0,null,0,null,"No"]
["City of Baldwin Park, Baldwin Park Transit","Baldwin Park","CA",null,90251,"City, County or Local Government Unit or Department of Transportation","Reduced Reporter",12150996,8,1,null,0,null,1,null,2,null,0,null,"No"]
["Jolley Trolley Transportation of Clearwater, Inc.","Clearwater","FL",null,40259,"Private-Non-Profit Corporation","Full Reporter",2441770,8,0,null,0,null,0,null,0,null,0,null,"No"]
["Autonomous Municipality of Ponce","Ponce","PR",4234,40234,"City, County or Local Government Unit or Department of Transportation","Reduced Reporter",149539,8,1,null,0,null,1,null,0,null,1,null,"No"]
["South Portland Bus Service","South Portland","ME",1112,10112,"City, County or Local Government Unit or Department of Transportation","Reduced Reporter",203914,8,1,null,0,null,1,null,0,null,0,null,"No"]
["White Earth Band of Chippewa","White Earth","MN","5T10",55270,"Tribe","Reduced Reporter",0,8,0,null,0,null,0,null,0,null,0,null,"No"]
["City of West Covina","West Covina","CA",null,90293,"City, County or Local Government Unit or Department of Transportation","Reduced Reporter",12150996,8,0,null,0,null,0,null,0,null,0,null,"No"]
["City of Pembroke Pines","Pembrokes Pines","FL",null,40251,"City, County or Local Government Unit or Department of Transportation","Reduced Reporter",5502379,7,0,null,0,null,0,null,0,null,0,null,"No"]
["Lake Charles Transit System","Lake Charles","LA",6023,60023,"City, County or Local Government Unit or Department of Transportation","Reduced Reporter",143440,7,1,null,0,null,1,null,1,null,0,null,"No"]
["Hub City Transit","Hattiesburg","MS",4060,40060,"City, County or Local Government Unit or Department of Transportation","Reduced Reporter",80358,7,1,null,0,null,1,null,0,null,0,null,"No"]
["Link Transit - Burlington","Burlington","NC",null,40252,"City, County or Local Government Unit or Department of Transportation","Reduced Reporter",119911,7,0,null,0,null,0,null,0,null,0,null,"No"]
["City of Murfreesboro","Murfreesboro","TN",4186,40186,"City, County or Local Government Unit or Department of Transportation","Reduced Reporter",133228,7,0,null,0,null,0,null,0,null,0,null,"No"]
["City of Deerfield Beach/ North East Focal Point Senior Center","Deerfield Beach","FL",null,40239,"City, County or Local Government Unit or Department of Transportation","Reduced Reporter",5502379,7,0,null,0,null,0,null,0,null,0,null,"No"]
["Confederated Tribes and Bands of The Yakama Nation","Toppenish","WA","0T03",111,"Tribe","Reduced Reporter",0,7,0,null,0,null,0,null,0,null,0,null,"No"]
["City of Maple Grove","Maple Grove","MN",5220,50517,"City, County or Local Government Unit or Department of Transportation","Full Reporter",2650890,7,2,null,0,null,2,null,0,null,0,null,"No"]
["Steel Valley Regional Transit Authority","Steubenville","OH",5142,50142,"Independent Public Agency or Authority of Transit Service","Reduced Reporter",70889,7,0,null,0,null,0,null,0,null,0,null,"No"]
["Franklin Transit Authority","Franklin","TN",4162,40162,"City, County or Local Government Unit or Department of Transportation","Reduced Reporter",969587,7,1,null,0,null,1,null,1,null,0,null,"No"]
["Bristol Tennessee Transit System","Bristol","TN",4055,40055,"City, County or Local Government Unit or Department of Transportation","Reduced Reporter",69501,7,1,null,0,null,1,null,0,null,0,null,"No"]
["Central Shenandoah Planning District Commission","Staunton","VA",3113,30989,"MPO, COG or Other Planning Agency","Reduced Reporter",56611,7,0,null,0,null,0,null,0,null,0,null,"No"]
["City of Lauderhill","Lauderhill","FL",null,40254,"City, County or Local Government Unit or Department of Transportation","Reduced Reporter",5502379,7,1,null,0,null,1,null,0,null,0,null,"No"]
["City of Miramar - Public Works Department","Miramar","FL",null,40241,"City, County or Local Government Unit or Department of Transportation","Reduced Reporter",5502379,7,1,null,0,null,1,null,0,null,0,null,"No"]
["Municipality of Camuy","Camuy","PR",4160,40160,"City, County or Local Government Unit or Department of Transportation","Reduced Reporter",139171,7,0,null,0,null,0,null,0,null,0,null,"No"]
["Municipality of Fajardo","Fajardo","PR",4164,40164,"City, County or Local Government Unit or Department of Transportation","Reduced Reporter",85225,7,1,null,0,null,1,null,0,null,0,null,"No"]
["Saddle River Trail, Inc.","Wallington","NJ",2222,20222,"Private-For-Profit Corporation","Reduced Reporter",18351295,7,0,null,0,null,0,null,0,null,0,null,"No"]
["Lower Savannah COG","Aiken","SC",4156,40156,"MPO, COG or Other Planning Agency","Reduced Reporter",386787,7,1,null,0,null,1,null,0,null,0,null,"No"]
["Coralville Transit System","Coralville","IA",7030,70030,"City, County or Local Government Unit or Department of Transportation","Full Reporter",106621,7,1,null,0,null,1,null,2,null,0,null,"No"]
["City of Winchester","Winchester","VA",3099,30099,"City, County or Local Government Unit or Department of Transportation","Reduced Reporter",69449,7,0,null,0,null,0,null,0,null,0,null,"No"]
["City of Manteca","Manteca","CA",9217,90217,"City, County or Local Government Unit or Department of Transportation","Reduced Reporter",83578,7,1,null,0,null,1,null,0,null,0,null,"No"]
["Newburgh Beacon Bus Corporation","New Windsor","NY",2148,20148,"Private Provider Reporting on Behalf of a Public Entity","Reduced Reporter",423566,7,0,null,0,null,0,null,0,null,0,null,"No"]
["Compton Renaissance Transit Service","Compton","CA",null,90260,"City, County or Local Government Unit or Department of Transportation","Reduced Reporter",12150996,7,1,null,0,null,1,null,1,null,0,null,{"$f":"IF(S707&Q707&O707&M707&K707<>\"\",\"Yes\",\"No\")","v":"No"}]
["Concord Kannapolis Area Transit","Concord","NC",4167,40167,"City, County or Local Government Unit or Department of Transportation","Reduced Reporter",214881,7,1,null,0,null,1,null,1,null,0,null,"No"]
["Kootenai County","Coeur d'Alene","ID",55,55,"City, County or Local Government Unit or Department of Transportation","Reduced Reporter",98378,7,1,null,0,null,1,null,0,null,0,null,"No"]
["Martz Group, National Coach Works of Virginia","Fredericksburg","VA",3103,30103,"Private-For-Profit Corporation","Full Reporter",4586770,7,0,null,0,null,0,null,0,null,0,null,"No"]
["Private Transportation Corporation","Brooklyn","NY",2175,20175,"Private-For-Profit Corporation","Full Reporter",18351295,6,0,null,0,null,0,null,0,null,0,null,"No"]
["Henderson Area Rapid Transit","Henderson","KY",5107,50107,"City, County or Local Government Unit or Department of Transportation","Reduced Reporter",229351,6,0,null,0,null,0,null,0,null,0,null,"No"]
["Greater Glens Falls Transit System","Queensbury","NY",2120,20120,"City, County or Local Government Unit or Department of Transportation","Reduced Reporter",65443,6,0,null,0,null,0,null,0,null,0,null,"No"]
["City of Bell Gardens","Bell Gardens","CA",null,90253,"City, County or Local Government Unit or Department of Transportation","Reduced Reporter",12150996,6,0,null,0,null,0,null,0,null,0,null,"No"]
["Chippewa Cree Tribe","Box Elder","MT","8T03",88164,"Tribe","Reduced Reporter",0,6,0,null,0,null,0,null,0,null,0,null,"No"]
["Municipality of Cidra","Cidra","PR",4124,40124,"City, County or Local Government Unit or Department of Transportation","Reduced Reporter",2148346,6,0,null,0,null,0,null,0,null,0,null,"No"]
["Intracity Transit","Hot Springs","AR",6105,60105,"City, County or Local Government Unit or Department of Transportation","Reduced Reporter",55121,6,1,null,0,null,1,null,0,null,0,null,"No"]
["County of Ventura","Ventura","CA",null,90298,"City, County or Local Government Unit or Department of Transportation","Reduced Reporter",214811,6,0,null,0,null,0,null,0,null,0,null,"No"]
["Borough of Pottstown - Pottstown Area Rapid Transit","Pottstown","PA",3077,30077,"City, County or Local Government Unit or Department of Transportation","Full Reporter",107682,6,1,null,0,null,1,null,0,null,0,null,"No"]
["Autonomous Municipality of Vega Alta","Vega Alta","PR",4199,40199,"City, County or Local Government Unit or Department of Transportation","Reduced Reporter",2148346,6,1,null,0,null,1,null,0,null,0,null,"No"]
["Crow Tribe of Indians","Crow Agency","MT","8T14",88188,"Tribe","Reduced Reporter",0,6,0,null,0,null,0,null,0,null,0,null,"No"]
["Leprechaun Lines, Inc.","Newburgh","NY",2179,20179,"Private Provider Reporting on Behalf of a Public Entity","Reduced Reporter",423566,6,0,null,0,null,0,null,0,null,0,null,"No"]
["Plaquemines Parish Government","Belle Chasse","LA",6127,60127,"City, County or Local Government Unit or Department of Transportation","Full Reporter",899703,6,4,null,0,null,4,null,0,null,0,null,"No"]
["Confederated Tribes of the Colville Indian Reservation","Nespelem","WA","0T04",4,"Tribe","Reduced Reporter",0,6,0,null,0,null,0,null,0,null,0,null,"No"]
["Pueblo of Laguna","Laguna","NM","6T15",60620,"Tribe","Reduced Reporter",0,6,0,null,0,null,0,null,0,null,0,null,"No"]
["Municipality of Juncos","Juncos","PR",4165,40165,"City, County or Local Government Unit or Department of Transportation","Reduced Reporter",2148346,6,1,null,0,null,1,null,0,null,0,null,"No"]
["BillyBey Ferry Company, LLC","New York","NY",2189,20189,"Private-For-Profit Corporation","Full Reporter",18351295,6,6,null,0,null,6,null,0,null,0,null,"No"]
["Town of Warwick Dial A Bus","Warwick","NY",2214,20214,"City, County or Local Government Unit or Department of Transportation","Reduced Reporter",423566,6,0,null,0,null,0,null,0,null,0,null,"No"]
["Bois Forte Reservation Tribal Council","Nett Lake","MN","5T06",55252,"Tribe","Reduced Reporter",0,6,0,null,0,null,0,null,0,null,0,null,"No"]
["Klamath Tribes","Chiloquin","OR","0T10",10,"Tribe","Reduced Reporter",0,6,0,null,0,null,0,null,0,null,0,null,"No"]
["City of Poughkeepsie","Poughkeepsie","NY",2009,20009,"City, County or Local Government Unit or Department of Transportation","Reduced Reporter",423566,6,0,null,0,null,0,null,0,null,0,null,"No"]
["Cheyenne & Arapaho Tribes","Concho","OK","6T14",66194,"Tribe","Reduced Reporter",0,6,0,null,0,null,0,null,0,null,0,null,"No"]
["City of Cudahy","Cudahy","CA",null,90262,"City, County or Local Government Unit or Department of Transportation","Reduced Reporter",12150996,6,0,null,0,null,0,null,0,null,0,null,"No"]
["Municipality of Vega Baja","Vega Baja","PR",4117,40117,"City, County or Local Government Unit or Department of Transportation","Reduced Reporter",2148346,5,3,null,0,null,3,null,1,null,1,null,"No"]
["Municipality of Dorado","Dorado","PR",4198,40198,"City, County or Local Government Unit or Department of Transportation","Reduced Reporter",2148346,5,1,null,0,null,1,null,0,null,0,null,"No"]
["Watertown CitiBus","Watertown","NY",2215,20215,"City, County or Local Government Unit or Department of Transportation","Reduced Reporter",57840,5,0,null,0,null,0,null,0,null,0,null,"No"]
["Town of Davie","Davie","FL",null,40262,"City, County or Local Government Unit or Department of Transportation","Reduced Reporter",5502379,5,1,null,0,null,1,null,0,null,0,null,"No"]
["Niles Dial-A-Ride","Niles","MI",5038,50038,"City, County or Local Government Unit or Department of Transportation","Reduced Reporter",278165,5,1,null,0,null,1,null,0,null,0,null,"No"]
["City of Kingston Citibus","Kingston","NY",2191,20191,"City, County or Local Government Unit or Department of Transportation","Reduced Reporter",57442,5,0,null,0,null,0,null,0,null,0,null,"No"]
["City of Middletown - Middletown Transit System","Middletown","OH",5019,50019,"City, County or Local Government Unit or Department of Transportation","Reduced Reporter",97503,5,1,null,0,null,1,null,0,null,0,null,"No"]
["Municipality of Cayey","Cayey","PR",4122,40122,"City, County or Local Government Unit or Department of Transportation","Reduced Reporter",2148346,5,2,null,0,null,2,null,0,null,0,null,"No"]
["The University of Montana - ASUM Transportation","Missoula","MT",8107,80107,"University","Full Reporter",82157,5,0,null,0,null,0,null,0,null,0,null,"No"]
["Municipality of Hatillo","Hatillo","PR",4151,40151,"City, County or Local Government Unit or Department of Transportation","Reduced Reporter",139171,5,2,null,0,null,2,null,0,null,0,null,"No"]
["Anderson Transit Authority","Anderson","SC",4081,40081,"City, County or Local Government Unit or Department of Transportation","Reduced Reporter",75702,5,0,null,0,null,0,null,0,null,0,null,"No"]
["Fond du Lac Reservation","Cloquet","MN","5T05",55246,"Tribe","Reduced Reporter",0,5,0,null,0,null,0,null,0,null,0,null,"No"]
["Pueblo of Santa Ana","Santa Ana Pueblo","NM","6T11",66152,"Tribe","Reduced Reporter",0,5,0,null,0,null,0,null,0,null,0,null,"No"]
["City of Rosemead","Rosemead","CA",null,90289,"City, County or Local Government Unit or Department of Transportation","Reduced Reporter",12150996,5,0,null,0,null,0,null,0,null,0,null,"No"]
["City of Loveland Transit","Loveland","CO",8025,80025,"City, County or Local Government Unit or Department of Transportation","Full Reporter",264465,5,0,null,0,null,0,null,0,null,0,null,"No"]
["City of Coconut Creek","Coconut Creek","FL",null,40238,"City, County or Local Government Unit or Department of Transportation","Reduced Reporter",5502379,4,0,null,0,null,0,null,0,null,0,null,"No"]
["State of Connecticut - CTTransit - Nason - Torrington-Winsted","Torrington","CT",1132,10132,"Private-For-Profit Corporation","Reduced Reporter",924859,4,0,null,0,null,0,null,0,null,0,null,"No"]
["City of Lynwood","Lynwood","CA",null,90281,"City, County or Local Government Unit or Department of Transportation","Reduced Reporter",12150996,4,0,null,0,null,0,null,0,null,0,null,"No"]
["City of Conroe","Conroe","TX",6129,60129,"City, County or Local Government Unit or Department of Transportation","Reduced Reporter",239938,4,0,null,0,null,0,null,0,null,0,null,"No"]
["Weirton Transit Corporation","Weirton","WV",3066,30066,"Other Publicly-Owned or Privately Chartered Corporation","Reduced Reporter",70889,4,1,null,0,null,1,null,1,null,0,null,"No"]
["Hopi Tribe","Kykotsmovi","AZ","9T24",99382,"Tribe","Reduced Reporter",0,4,0,null,0,null,0,null,0,null,0,null,"No"]
["Yankton Sioux Tribe","Wagner","SD","8T16",88194,"Tribe","Reduced Reporter",0,4,0,null,0,null,0,null,0,null,0,null,"No"]
["City of Maywood","Maywood","CA",null,90284,"City, County or Local Government Unit or Department of Transportation","Reduced Reporter",12150996,4,0,null,0,null,0,null,0,null,0,null,"No"]
["Municipality of Manati","Manati","PR",4145,40145,"City, County or Local Government Unit or Department of Transportation","Reduced Reporter",2148346,4,2,null,0,null,2,null,1,null,0,null,"No"]
["City of Bellflower","Bellflower","CA",null,90254,"City, County or Local Government Unit or Department of Transportation","Reduced Reporter",12150996,4,0,null,0,null,0,null,0,null,0,null,"No"]
["Susanville Indian Rancheria","Susanville","CA","9T08",99256,"Tribe","Reduced Reporter",0,4,0,null,0,null,0,null,0,null,0,null,"No"]
["Casco Bay Island Transit District","Portland","ME",1088,10088,"Independent Public Agency or Authority of Transit Service","Full Reporter",203914,4,1,null,0,null,1,null,0,null,0,null,"No"]
["Henderson County/ Apple Country Public Transit","Hendersonville","NC",4229,40229,"City, County or Local Government Unit or Department of Transportation","Reduced Reporter",280648,4,0,null,0,null,0,null,0,null,0,null,"No"]
["Nez Perce Tribe","Lapwai","ID","0T12",135,"Tribe","Reduced Reporter",0,4,0,null,0,null,0,null,0,null,0,null,"No"]
["Village of Kiryas Joel","Monroe","NY",2187,20187,"City, County or Local Government Unit or Department of Transportation","Reduced Reporter",423566,4,0,null,0,null,0,null,0,null,0,null,"No"]
["Yurok Tribe","Klamath","CA","9T09",99262,"Tribe","Reduced Reporter",0,4,0,null,2,null,2,null,0,null,0,null,"No"]
["Lewiston Transit System","Lewiston","ID",48,48,"City, County or Local Government Unit or Department of Transportation","Reduced Reporter",51924,4,0,null,0,null,0,null,0,null,0,null,"No"]
["Bristol Virginia Transit","Bristol","VA",3053,30053,"City, County or Local Government Unit or Department of Transportation","Reduced Reporter",69501,4,1,null,0,null,1,null,0,null,0,null,"No"]
["Winnebago Tribe of Nebraska","Winnebago","NE","7T04",70004,"Tribe","Reduced Reporter",0,4,0,null,0,null,0,null,0,null,0,null,"No"]
["City of Pompano Beach","Pompano Beach","FL",null,40257,"City, County or Local Government Unit or Department of Transportation","Reduced Reporter",5502379,4,1,null,0,null,1,null,0,null,0,null,"No"]
["East Chicago Transit","East Chicago","IN",5042,50042,"City, County or Local Government Unit or Department of Transportation","Full Reporter",8608208,4,0,null,0,null,0,null,0,null,0,null,"No"]
["Los Angeles County Department of Public Works - South Whittier","Alhambra","CA",null,90276,"City, County or Local Government Unit or Department of Transportation","Reduced Reporter",12150996,4,1,null,0,null,1,null,0,null,0,null,"No"]
["Municipality of Humacao","Humacao","PR",4126,40126,"City, County or Local Government Unit or Department of Transportation","Reduced Reporter",2148346,4,2,null,0,null,2,null,1,null,0,null,{"$f":"IF(S771&Q771&O771&M771&K771<>\"\",\"Yes\",\"No\")","v":"No"}]
["City of Hallandale Beach","Hallandale Beach","FL",null,40249,"City, County or Local Government Unit or Department of Transportation","Reduced Reporter",5502379,4,0,null,0,null,0,null,0,null,0,null,"No"]
["Coeur d'Alene Tribe dba Citylink Transit","Worley","ID",53,53,"Tribe","Reduced Reporter",98378,4,0,null,0,null,0,null,0,null,0,null,"No"]
["Municipality of Aguada","Aguada","PR",4114,40114,"City, County or Local Government Unit or Department of Transportation","Reduced Reporter",306196,4,1,null,0,null,1,null,0,null,0,null,"No"]
["Squaxin Island Tribe","Shelton","WA","0T16",103,"Tribe","Reduced Reporter",0,3,0,null,0,null,0,null,0,null,0,null,"No"]
["Zuni Pueblo","Zuni","NM","6T22",66242,"Tribe","Reduced Reporter",0,3,0,null,0,null,0,null,0,null,0,null,"No"]
["Lac du Flambeau Band of Lake Superior Chippewa Indians","Lac Du Flambeau","WI","5T17",55300,"Tribe","Reduced Reporter",0,3,0,null,0,null,0,null,0,null,0,null,"No"]
["Ute Tribe","Fort Duchesne","UT","8T19",88200,"Tribe","Reduced Reporter",0,3,0,null,0,null,0,null,0,null,0,null,"No"]
["McKinney Avenue Transit Authority","Dallas","TX",6133,60133,"Private-Non-Profit Corporation","Full Reporter",5121892,3,0,null,0,null,0,null,0,null,0,null,"No"]
["Municipality of Catano","Catano","PR",4163,40163,"City, County or Local Government Unit or Department of Transportation","Reduced Reporter",2148346,3,1,null,0,null,1,null,1,null,0,null,"No"]
["City of Hollywood","Hollywood","FL",null,40255,"City, County or Local Government Unit or Department of Transportation","Reduced Reporter",5502379,3,0,null,0,null,0,null,0,null,0,null,"No"]
["Reno-Sparks Indian Colony","Reno","NV","9T11",90011,"Tribe","Reduced Reporter",0,3,0,null,0,null,0,null,0,null,0,null,"No"]
["City of Burlington","Burlington","MA",1158,10180,"City, County or Local Government Unit or Department of Transportation","Reduced Reporter",4181019,3,0,null,0,null,0,null,0,null,0,null,"No"]
["Northern Cheyenne Tribe","Lame Deer","MT","8T07",88116,"Tribe","Reduced Reporter",0,3,0,null,0,null,0,null,0,null,0,null,"No"]
["Liberty Transit","Hinesville","GA",4193,40193,"City, County or Local Government Unit or Department of Transportation","Reduced Reporter",51456,3,0,null,0,null,0,null,0,null,0,null,"No"]
["Town of Lexington","Lexington","MA",1159,10181,"City, County or Local Government Unit or Department of Transportation","Reduced Reporter",4181019,3,0,null,0,null,0,null,0,null,0,null,"No"]
["Blue Lake Rancheria","Blue Lake","CA","9T02",99292,"Tribe","Reduced Reporter",0,3,2,null,0,null,2,null,0,null,0,null,"No"]
["City of Salisbury - Salisbury","Salisbury","NC",4233,40233,"City, County or Local Government Unit or Department of Transportation","Reduced Reporter",214881,3,0,null,0,null,0,null,0,null,0,null,"No"]
["City of Atlanta - Department of Public Works - Transit Division","Atlanta","GA",4230,40230,"City, County or Local Government Unit or Department of Transportation","Full Reporter",4515419,3,0,null,0,null,0,null,0,null,0,null,"No"]
["Gulkana Village Council","Gakona","AK","0T08",85,"Tribe","Reduced Reporter",0,3,0,null,0,null,0,null,0,null,0,null,"No"]
["New York City Economic Development Corporation","New York","NY",null,22930,"Private-Non-Profit Corporation","Full Reporter",18351295,3,5,null,2,null,7,null,0,null,0,null,"No"]
["Fort Belknap Indian Community","Harlem","MT","8T05",88170,"Tribe","Reduced Reporter",0,2,0,null,0,null,0,null,0,null,0,null,"No"]
["Bad River Band of Lake Superior Tribe of Chippewa","Odanah","WI","5T12",55282,"Tribe","Reduced Reporter",0,2,0,null,0,null,0,null,0,null,0,null,"No"]
["Flight Line, Inc.","Salem","NH",1135,11154,"Private-For-Profit Corporation","Reduced Reporter",158377,2,0,null,0,null,0,null,0,null,0,null,"No"]
["East Windsor Township","East Windsor","NJ",2194,20194,"City, County or Local Government Unit or Department of Transportation","Reduced Reporter",64037,2,0,null,0,null,0,null,0,null,0,null,"No"]
["Kaser Bus Service","Monsey","NY",2176,20176,"Independent Public Agency or Authority of Transit Service","Reduced Reporter",18351295,2,0,null,0,null,0,null,0,null,0,null,"No"]
["Bay Mills Indian Community","Brimley","MI","5T07",50007,"Tribe","Reduced Reporter",0,2,0,null,0,null,0,null,0,null,0,null,"No"]
["City of Dania Beach","Dania Beach","FL",null,40261,"City, County or Local Government Unit or Department of Transportation","Reduced Reporter",5502379,2,0,null,0,null,0,null,0,null,0,null,"No"]
["Oldham's Public Bus","LaGrange","KY",4218,40218,"City, County or Local Government Unit or Department of Transportation","Reduced Reporter",972546,2,0,null,0,null,0,null,0,null,0,null,"No"]
["Pierce County Ferry Operations","Tacoma","WA",28,28,"City, County or Local Government Unit or Department of Transportation","Full Reporter",3059393,2,3,null,0,null,3,null,1,null,0,null,"No"]
["Pyramid Lake Paiute Tribe","Nixon","NV","9T31",99406,"Tribe","Reduced Reporter",0,2,0,null,0,null,0,null,0,null,0,null,"No"]
["City of Duarte","Duarte","CA",null,90264,"City, County or Local Government Unit or Department of Transportation","Reduced Reporter",12150996,2,0,null,0,null,0,null,0,null,0,null,"No"]
["City of Coral Springs","Coral Springs","FL",null,40253,"City, County or Local Government Unit or Department of Transportation","Reduced Reporter",5502379,2,0,null,0,null,0,null,0,null,0,null,"No"]
["Los Angeles County Dept. of Public Works - Florence-Firestone","Alhambra","CA",null,90273,"City, County or Local Government Unit or Department of Transportation","Reduced Reporter",12150996,2,0,null,0,null,0,null,0,null,0,null,"No"]
["City of Moorpark","Moorpark","CA",9227,90227,"City, County or Local Government Unit or Department of Transportation","Reduced Reporter",214811,2,0,null,0,null,0,null,0,null,0,null,"No"]
["Brunswick Transit Alternative","Brunswick","OH",5143,50143,"City, County or Local Government Unit or Department of Transportation","Full Reporter",1780673,2,0,null,0,null,0,null,0,null,0,null,"No"]
["City of Beverly","Beverly","MA",1157,10179,"City, County or Local Government Unit or Department of Transportation","Reduced Reporter",4181019,2,0,null,0,null,0,null,0,null,0,null,"No"]
["Federal Programs Municipality of Gurabo","Gurabo","PR",4123,40123,"City, County or Local Government Unit or Department of Transportation","Reduced Reporter",2148346,2,0,null,0,null,0,null,0,null,0,null,"No"]
["City of Mechanicville","Mechanicville","NY",2213,20213,"City, County or Local Government Unit or Department of Transportation","Reduced Reporter",594962,2,0,null,0,null,0,null,0,null,0,null,"No"]
["The Looper Group, Inc.","St. Petersburg","FL",null,40258,"Private-Non-Profit Corporation","Full Reporter",2441770,2,0,null,0,null,0,null,0,null,0,null,"No"]
["City of Tamarac","Taramac","FL",null,44932,"City, County or Local Government Unit or Department of Transportation","Reduced Reporter",5502379,2,0,null,0,null,0,null,0,null,0,null,"No"]
["Los Angeles County Dept. of Public Works - Willowbrook Shuttle","Alhambra","CA",null,90278,"City, County or Local Government Unit or Department of Transportation","Reduced Reporter",12150996,2,0,null,0,null,0,null,0,null,0,null,"No"]
["Quinault Tribe of the Quinault Reservation","Taholah","WA","0T21",183,"Tribe","Reduced Reporter",0,2,0,null,0,null,0,null,0,null,0,null,"No"]
["Seneca Nation of Indians","Salamanca","NY","2T02",22929,"Tribe","Reduced Reporter",0,2,0,null,0,null,0,null,0,null,0,null,"No"]
["Chemehuevi Indian Tribe","Havasu Lake ","CA","9T27",99316,"Tribe","Reduced Reporter",0,2,2,null,0,null,2,null,0,null,0,null,"No"]
["City of Lauderdale Lakes","Lauderdale Lakes","FL",null,40250,"City, County or Local Government Unit or Department of Transportation","Reduced Reporter",5502379,2,1,null,0,null,1,null,0,null,0,null,"No"]
["Turtle Mountain Band of Chippewa Indian","Belcourt","ND","8T13",88146,"Tribe","Reduced Reporter",0,2,0,null,0,null,0,null,0,null,0,null,"No"]
["City of Lawndale","Lawndale","CA",null,90280,"City, County or Local Government Unit or Department of Transportation","Reduced Reporter",12150996,2,1,null,0,null,1,null,1,null,0,null,"No"]
["Lummi Nation","Bellingham","WA","0T11",95,"Tribe","Reduced Reporter",0,2,0,null,0,null,0,null,0,null,0,null,"No"]
["City of Milton-Freewater","MiltonFreewater","OR",63,63,"City, County or Local Government Unit or Department of Transportation","Reduced Reporter",55805,2,1,null,0,null,1,null,0,null,0,null,"No"]
["Yavapai-Apache Nation","Camp Verde","AZ","9T14",99328,"Tribe","Reduced Reporter",0,2,0,null,0,null,0,null,0,null,0,null,"No"]
["Town of Lauderdale-By-The-Sea","Lauderdale-By-The-Sea","FL",null,40260,"City, County or Local Government Unit or Department of Transportation","Reduced Reporter",5502379,1,0,null,0,null,0,null,0,null,0,null,"No"]
["Los Angeles County Department of Public Works - East Valinda","Alhambra","CA",null,90272,"City, County or Local Government Unit or Department of Transportation","Reduced Reporter",12150996,1,0,null,0,null,0,null,0,null,0,null,"No"]
["Nome Eskimo Community","Nome","AK","0T41",271,"Tribe","Reduced Reporter",0,1,0,null,0,null,0,null,0,null,0,null,"No"]
["City of Lighthouse Point","Lighthouse Point","FL",null,40240,"City, County or Local Government Unit or Department of Transportation","Reduced Reporter",5502379,1,0,null,0,null,0,null,0,null,0,null,"No"]
["Town of Bedford","Bedford","MA",1156,10178,"City, County or Local Government Unit or Department of Transportation","Reduced Reporter",4181019,1,0,null,0,null,0,null,0,null,0,null,"No"]
["The Tulalip Tribes of Washington","Tulalip","WA",60,60,"Tribe","Reduced Reporter",145140,1,0,null,0,null,0,null,0,null,0,null,"No"]
["Gwichyaa Zhee Tribal Transit Service","Fort Yukon","AK",null,400,"Tribe","Reduced Reporter",0,1,0,null,0,null,0,null,0,null,0,null,"No"]
["City of West Park","West Park","FL",null,40263,"City, County or Local Government Unit or Department of Transportation","Reduced Reporter",5502379,1,0,null,0,null,0,null,0,null,0,null,"No"]
["Makah Tribal Council","Neah Bay ","WA","0T36",36,"Tribe","Reduced Reporter",0,1,0,null,0,null,0,null,0,null,0,null,"No"]
["Los Angeles County Dept. of Public Works - King Medical Center Shuttle Service","Alhambra","CA",null,90274,"City, County or Local Government Unit or Department of Transportation","Reduced Reporter",12150996,1,0,null,0,null,0,null,0,null,0,null,"No"]
["Sitka Tribe of Alaska","Sitka","AK","0T14",14,"Tribe","Reduced Reporter",0,1,0,null,0,null,0,null,0,null,0,null,"No"]
["Lower Elwha Klallam Tribe","Port Angeles","WA",null,401,"Tribe","Reduced Reporter",0,1,0,null,0,null,0,null,0,null,0,null,"No"]
["Village of Spring Valley Bus","Spring Valley","NY",2089,20089,"City, County or Local Government Unit or Department of Transportation","Reduced Reporter",18351295,1,0,null,0,null,0,null,0,null,0,null,"No"]
["Los Angeles County Dept. of Public Works - Lennox Shuttle","Alhambra","CA",null,90275,"City, County or Local Government Unit or Department of Transportation","Reduced Reporter",12150996,1,0,null,0,null,0,null,0,null,0,null,{"$f":"IF(S835&Q835&O835&M835&K835<>\"\",\"Yes\",\"No\")","v":"No"}]
["Tetlin Village Council","Tok","AK","0T18",159,"Tribe","Reduced Reporter",0,1,0,null,0,null,0,null,0,null,0,null,"No"]
["Town of Hillsboro Beach","Hillsboro Beach","FL",null,40248,"City, County or Local Government Unit or Department of Transportation","Reduced Reporter",5502379,1,0,null,0,null,0,null,0,null,0,null,"No"]
["Manley Village Council","Manley Hot Springs","AK","0T20",175,"Tribe","Reduced Reporter",0,1,0,null,0,null,0,null,0,null,0,null,"No"]
["Los Angeles County Dept. of Public Works - Athens Shuttle Service","Alhambra","CA",null,90269,"City, County or Local Government Unit or Department of Transportation","Reduced Reporter",12150996,1,0,null,0,null,0,null,0,null,0,null,"No"]
["Mission Hill Link, Inc.","Boston","MA",1160,10182,"Private-Non-Profit Corporation","Reduced Reporter",4181019,1,0,null,0,null,0,null,0,null,0,null,"No"]
["Los Angeles County Department of Public Works - Avocado Heights","Alhambra","CA",null,90270,"City, County or Local Government Unit or Department of Transportation","Reduced Reporter",12150996,1,0,null,0,null,0,null,0,null,0,null,"No"]
["Seldovia Village Tribe","Seldovia","AK","0T23",199,"Tribe","Reduced Reporter",0,1,2,null,0,null,2,null,0,null,0,null,"No"]

{"sheet":"Summary Tables","index":4,"n_rows":116,"n_cols":14,"rows_kept":116,"cut":false,"hidden":false,"merged":[]}
["To bring up the accessible control panel, press ctrl + a. Some screen reading functionality will not work while the sheet is protected. To unprotect the sheet press alt h o p and enter the password ntd.",null,null,null,null,"National Totals",null,null,null,null,null,null,null,{"$f":"IF(N4=1,0,1)","v":0}]
[null,null,null,null,null,"VOMS","ADA Accessible","Non-ADA Accessible","Total Stations","Elevators","Escalators",null,null,"Include Questionable Data"]
[null,null,null,null,null,{"$f":"IF($N$1,SUMIFS(Stations!L:L,Stations!$W:$W,\"=No\"),SUM(Stations!L:L))","v":71632},{"$f":"IF($N$1,SUMIFS(Stations!M:M,Stations!$W:$W,\"=No\"),SUM(Stations!M:M))","v":4329},{"$f":"IF($N$1,SUMIFS(Stations!O:O,Stations!$W:$W,\"=No\"),SUM(Stations!O:O))","v":1030},{"$f":"IF($N$1,SUMIFS(Stations!Q:Q,Stations!$W:$W,\"=No\"),SUM(Stations!Q:Q))","v":5359},{"$f":"IF($N$1,SUMIFS(Stations!S:S,Stations!$W:$W,\"=No\"),SUM(Stations!S:S))","v":2930},{"$f":"IF($N$1,SUMIFS(Stations!U:U,Stations!$W:$W,\"=No\"),SUM(Stations!U:U))","v":2716},null,null,"Exclude Questionable Data"]
[null,null,null,null,null,null,null,null,null,null,null,null,null,1]
["By Urbanized Area Size"]
[null,null,null,"enter bins here","Column1","VOMS","ADA Accessible","Non-ADA Accessible","Total Stations","Elevators","Escalators"]
["Under",{"$f":"D7","v":200000},null,200000,{"$f":"IFERROR(IF(A7=\"Between\",A7&\" \"&FIXED(B7,0,0)&\" \"&C7&\" \"&FIXED(D7,0,0),A7&\" \"&FIXED(B7,0,0)),\"invalid bin\")","v":"Under 200,000"},{"$f":"IF($N$1,SUMIFS(Stations!L:L,Stations!$H:$H,\"<\"&$D7,Stations!$W:$W,\"=No\"),SUMIFS(Stations!L:L,Stations!$H:$H,\"<\"&$D7))","v":4983},{"$f":"IF($N$1,SUMIFS(Stations!M:M,Stations!$H:$H,\"<\"&$D7,Stations!$W:$W,\"=No\"),SUMIFS(Stations!M:M,Stations!$H:$H,\"<\"&$D7))","v":321},{"$f":"IF($N$1,SUMIFS(Stations!O:O,Stations!$H:$H,\"<\"&$D7,Stations!$W:$W,\"=No\"),SUMIFS(Stations!O:O,Stations!$H:$H,\"<\"&$D7))","v":3},{"$f":"IF($N$1,SUMIFS(Stations!Q:Q,Stations!$H:$H,\"<\"&$D7,Stations!$W:$W,\"=No\"),SUMIFS(Stations!Q:Q,Stations!$H:$H,\"<\"&$D7))","v":324},{"$f":"IF($N$1,SUMIFS(Stations!S:S,Stations!$H:$H,\"<\"&$D7,Stations!$W:$W,\"=No\"),SUMIFS(Stations!S:S,Stations!$H:$H,\"<\"&$D7))","v":76},{"$f":"IF($N$1,SUMIFS(Stations!U:U,Stations!$H:$H,\"<\"&$D7,Stations!$W:$W,\"=No\"),SUMIFS(Stations!U:U,Stations!$H:$H,\"<\"&$D7))","v":2}]
[{"$f":"IF(D8<>\"\",\"Between\",\"Over\")","v":"Between"},{"$f":"D7","v":200000},{"$f":"IF(D8<>\"\",\"and\",\"\")","v":"and"},1000000,"Between 200,000 and 1,000,000",{"$f":"IF($N$1,IF($A8=\"Between\",SUMIFS(Stations!L:L,Stations!$H:$H,\">=\"&$B8,Stations!$H:$H,\"<\"&$D8,Stations!$W:$W,\"=No\"),SUMIFS(Stations!L:L,Stations!$H:$H,\">=\"&$B8,Stations!$W:$W,\"=No\")),IF($A8=\"Between\",SUMIFS(Stations!L:L,Stations!$H:$H,\">=\"&$B8,Stations!$H:$H,\"<\"&$D8),SUMIFS(Stations!L:L,Stations!$H:$H,\">=\"&$B8)))","v":9369},{"$f":"IF($N$1,IF($A8=\"Between\",SUMIFS(Stations!M:M,Stations!$H:$H,\">=\"&$B8,Stations!$H:$H,\"<\"&$D8,Stations!$W:$W,\"=No\"),SUMIFS(Stations!M:M,Stations!$H:$H,\">=\"&$B8,Stations!$W:$W,\"=No\")),IF($A8=\"Between\",SUMIFS(Stations!M:M,Stations!$H:$H,\">=\"&$B8,Stations!$H:$H,\"<\"&$D8),SUMIFS(Stations!M:M,Stations!$H:$H,\">=\"&$B8)))","v":416},{"$f":"IF($N$1,IF($A8=\"Between\",SUMIFS(Stations!O:O,Stations!$H:$H,\">=\"&$B8,Stations!$H:$H,\"<\"&$D8,Stations!$W:$W,\"=No\"),SUMIFS(Stations!O:O,Stations!$H:$H,\">=\"&$B8,Stations!$W:$W,\"=No\")),IF($A8=\"Between\",SUMIFS(Stations!O:O,Stations!$H:$H,\">=\"&$B8,Stations!$H:$H,\"<\"&$D8),SUMIFS(Stations!O:O,Stations!$H:$H,\">=\"&$B8)))","v":4},{"$f":"IF($N$1,IF($A8=\"Between\",SUMIFS(Stations!Q:Q,Stations!$H:$H,\">=\"&$B8,Stations!$H:$H,\"<\"&$D8,Stations!$W:$W,\"=No\"),SUMIFS(Stations!Q:Q,Stations!$H:$H,\">=\"&$B8,Stations!$W:$W,\"=No\")),IF($A8=\"Between\",SUMIFS(Stations!Q:Q,Stations!$H:$H,\">=\"&$B8,Stations!$H:$H,\"<\"&$D8),SUMIFS(Stations!Q:Q,Stations!$H:$H,\">=\"&$B8)))","v":420},{"$f":"IF($N$1,IF($A8=\"Between\",SUMIFS(Stations!S:S,Stations!$H:$H,\">=\"&$B8,Stations!$H:$H,\"<\"&$D8,Stations!$W:$W,\"=No\"),SUMIFS(Stations!S:S,Stations!$H:$H,\">=\"&$B8,Stations!$W:$W,\"=No\")),IF($A8=\"Between\",SUMIFS(Stations!S:S,Stations!$H:$H,\">=\"&$B8,Stations!$H:$H,\"<\"&$D8),SUMIFS(Stations!S:S,Stations!$H:$H,\">=\"&$B8)))","v":102},{"$f":"IF($N$1,IF($A8=\"Between\",SUMIFS(Stations!U:U,Stations!$H:$H,\">=\"&$B8,Stations!$H:$H,\"<\"&$D8,Stations!$W:$W,\"=No\"),SUMIFS(Stations!U:U,Stations!$H:$H,\">=\"&$B8,Stations!$W:$W,\"=No\")),IF($A8=\"Between\",SUMIFS(Stations!U:U,Stations!$H:$H,\">=\"&$B8,Stations!$H:$H,\"<\"&$D8),SUMIFS(Stations!U:U,Stations!$H:$H,\">=\"&$B8)))","v":50}]
[{"$f":"IF(OR(A8=\"Over\",A8=\"\"),\"\",IF(D9=\"\",\"Over\",\"Between\"))","v":"Over"},{"$f":"IF(D8=\"\",\"\",D8)","v":1000000},{"$f":"IF(D9<>\"\",\"and\",\"\")","v":""},null,"Over 1,000,000",{"$f":"IF($N$1,IF($A9=\"\",\"\",IF($A9=\"Between\",SUMIFS(Stations!L:L,Stations!$H:$H,\">=\"&$B9,Stations!$H:$H,\"<\"&$D9,Stations!$W:$W,\"=No\"),SUMIFS(Stations!L:L,Stations!$H:$H,\">=\"&$B9,Stations!$W:$W,\"=No\"))),IF($A9=\"\",\"\",IF($A9=\"Between\",SUMIFS(Stations!L:L,Stations!$H:$H,\">=\"&$B9,Stations!$H:$H,\"<\"&$D9),SUMIFS(Stations!L:L,Stations!$H:$H,\">=\"&$B9))))","v":57280},{"$f":"IF($N$1,IF($A9=\"\",\"\",IF($A9=\"Between\",SUMIFS(Stations!M:M,Stations!$H:$H,\">=\"&$B9,Stations!$H:$H,\"<\"&$D9,Stations!$W:$W,\"=No\"),SUMIFS(Stations!M:M,Stations!$H:$H,\">=\"&$B9,Stations!$W:$W,\"=No\"))),IF($A9=\"\",\"\",IF($A9=\"Between\",SUMIFS(Stations!M:M,Stations!$H:$H,\">=\"&$B9,Stations!$H:$H,\"<\"&$D9),SUMIFS(Stations!M:M,Stations!$H:$H,\">=\"&$B9))))","v":3592},{"$f":"IF($N$1,IF($A9=\"\",\"\",IF($A9=\"Between\",SUMIFS(Stations!O:O,Stations!$H:$H,\">=\"&$B9,Stations!$H:$H,\"<\"&$D9,Stations!$W:$W,\"=No\"),SUMIFS(Stations!O:O,Stations!$H:$H,\">=\"&$B9,Stations!$W:$W,\"=No\"))),IF($A9=\"\",\"\",IF($A9=\"Between\",SUMIFS(Stations!O:O,Stations!$H:$H,\">=\"&$B9,Stations!$H:$H,\"<\"&$D9),SUMIFS(Stations!O:O,Stations!$H:$H,\">=\"&$B9))))","v":1023},{"$f":"IF($N$1,IF($A9=\"\",\"\",IF($A9=\"Between\",SUMIFS(Stations!Q:Q,Stations!$H:$H,\">=\"&$B9,Stations!$H:$H,\"<\"&$D9,Stations!$W:$W,\"=No\"),SUMIFS(Stations!Q:Q,Stations!$H:$H,\">=\"&$B9,Stations!$W:$W,\"=No\"))),IF($A9=\"\",\"\",IF($A9=\"Between\",SUMIFS(Stations!Q:Q,Stations!$H:$H,\">=\"&$B9,Stations!$H:$H,\"<\"&$D9),SUMIFS(Stations!Q:Q,Stations!$H:$H,\">=\"&$B9))))","v":4615},{"$f":"IF($N$1,IF($A9=\"\",\"\",IF($A9=\"Between\",SUMIFS(Stations!S:S,Stations!$H:$H,\">=\"&$B9,Stations!$H:$H,\"<\"&$D9,Stations!$W:$W,\"=No\"),SUMIFS(Stations!S:S,Stations!$H:$H,\">=\"&$B9,Stations!$W:$W,\"=No\"))),IF($A9=\"\",\"\",IF($A9=\"Between\",SUMIFS(Stations!S:S,Stations!$H:$H,\">=\"&$B9,Stations!$H:$H,\"<\"&$D9),SUMIFS(Stations!S:S,Stations!$H:$H,\">=\"&$B9))))","v":2752},{"$f":"IF($N$1,IF($A9=\"\",\"\",IF($A9=\"Between\",SUMIFS(Stations!U:U,Stations!$H:$H,\">=\"&$B9,Stations!$H:$H,\"<\"&$D9,Stations!$W:$W,\"=No\"),SUMIFS(Stations!U:U,Stations!$H:$H,\">=\"&$B9,Stations!$W:$W,\"=No\"))),IF($A9=\"\",\"\",IF($A9=\"Between\",SUMIFS(Stations!U:U,Stations!$H:$H,\">=\"&$B9,Stations!$H:$H,\"<\"&$D9),SUMIFS(Stations!U:U,Stations!$H:$H,\">=\"&$B9))))","v":2664}]
["","",{"$f":"IF(D10<>\"\",\"and\",\"\")","v":""},null,"invalid bin",{"$f":"IF($N$1,IF($A10=\"\",\"\",IF($A10=\"Between\",SUMIFS(Stations!L:L,Stations!$H:$H,\">=\"&$B10,Stations!$H:$H,\"<\"&$D10,Stations!$W:$W,\"=No\"),SUMIFS(Stations!L:L,Stations!$H:$H,\">=\"&$B10,Stations!$W:$W,\"=No\"))),IF($A10=\"\",\"\",IF($A10=\"Between\",SUMIFS(Stations!L:L,Stations!$H:$H,\">=\"&$B10,Stations!$H:$H,\"<\"&$D10),SUMIFS(Stations!L:L,Stations!$H:$H,\">=\"&$B10))))","v":""},{"$f":"IF($N$1,IF($A10=\"\",\"\",IF($A10=\"Between\",SUMIFS(Stations!M:M,Stations!$H:$H,\">=\"&$B10,Stations!$H:$H,\"<\"&$D10,Stations!$W:$W,\"=No\"),SUMIFS(Stations!M:M,Stations!$H:$H,\">=\"&$B10,Stations!$W:$W,\"=No\"))),IF($A10=\"\",\"\",IF($A10=\"Between\",SUMIFS(Stations!M:M,Stations!$H:$H,\">=\"&$B10,Stations!$H:$H,\"<\"&$D10),SUMIFS(Stations!M:M,Stations!$H:$H,\">=\"&$B10))))","v":""},{"$f":"IF($N$1,IF($A10=\"\",\"\",IF($A10=\"Between\",SUMIFS(Stations!O:O,Stations!$H:$H,\">=\"&$B10,Stations!$H:$H,\"<\"&$D10,Stations!$W:$W,\"=No\"),SUMIFS(Stations!O:O,Stations!$H:$H,\">=\"&$B10,Stations!$W:$W,\"=No\"))),IF($A10=\"\",\"\",IF($A10=\"Between\",SUMIFS(Stations!O:O,Stations!$H:$H,\">=\"&$B10,Stations!$H:$H,\"<\"&$D10),SUMIFS(Stations!O:O,Stations!$H:$H,\">=\"&$B10))))","v":""},{"$f":"IF($N$1,IF($A10=\"\",\"\",IF($A10=\"Between\",SUMIFS(Stations!Q:Q,Stations!$H:$H,\">=\"&$B10,Stations!$H:$H,\"<\"&$D10,Stations!$W:$W,\"=No\"),SUMIFS(Stations!Q:Q,Stations!$H:$H,\">=\"&$B10,Stations!$W:$W,\"=No\"))),IF($A10=\"\",\"\",IF($A10=\"Between\",SUMIFS(Stations!Q:Q,Stations!$H:$H,\">=\"&$B10,Stations!$H:$H,\"<\"&$D10),SUMIFS(Stations!Q:Q,Stations!$H:$H,\">=\"&$B10))))","v":""},{"$f":"IF($N$1,IF($A10=\"\",\"\",IF($A10=\"Between\",SUMIFS(Stations!S:S,Stations!$H:$H,\">=\"&$B10,Stations!$H:$H,\"<\"&$D10,Stations!$W:$W,\"=No\"),SUMIFS(Stations!S:S,Stations!$H:$H,\">=\"&$B10,Stations!$W:$W,\"=No\"))),IF($A10=\"\",\"\",IF($A10=\"Between\",SUMIFS(Stations!S:S,Stations!$H:$H,\">=\"&$B10,Stations!$H:$H,\"<\"&$D10),SUMIFS(Stations!S:S,Stations!$H:$H,\">=\"&$B10))))","v":""},{"$f":"IF($N$1,IF($A10=\"\",\"\",IF($A10=\"Between\",SUMIFS(Stations!U:U,Stations!$H:$H,\">=\"&$B10,Stations!$H:$H,\"<\"&$D10,Stations!$W:$W,\"=No\"),SUMIFS(Stations!U:U,Stations!$H:$H,\">=\"&$B10,Stations!$W:$W,\"=No\"))),IF($A10=\"\",\"\",IF($A10=\"Between\",SUMIFS(Stations!U:U,Stations!$H:$H,\">=\"&$B10,Stations!$H:$H,\"<\"&$D10),SUMIFS(Stations!U:U,Stations!$H:$H,\">=\"&$B10))))","v":""}]
["","","",null,"invalid bin",{"$f":"IF($N$1,IF($A11=\"\",\"\",IF($A11=\"Between\",SUMIFS(Stations!L:L,Stations!$H:$H,\">=\"&$B11,Stations!$H:$H,\"<\"&$D11,Stations!$W:$W,\"=No\"),SUMIFS(Stations!L:L,Stations!$H:$H,\">=\"&$B11,Stations!$W:$W,\"=No\"))),IF($A11=\"\",\"\",IF($A11=\"Between\",SUMIFS(Stations!L:L,Stations!$H:$H,\">=\"&$B11,Stations!$H:$H,\"<\"&$D11),SUMIFS(Stations!L:L,Stations!$H:$H,\">=\"&$B11))))","v":""},{"$f":"IF($N$1,IF($A11=\"\",\"\",IF($A11=\"Between\",SUMIFS(Stations!M:M,Stations!$H:$H,\">=\"&$B11,Stations!$H:$H,\"<\"&$D11,Stations!$W:$W,\"=No\"),SUMIFS(Stations!M:M,Stations!$H:$H,\">=\"&$B11,Stations!$W:$W,\"=No\"))),IF($A11=\"\",\"\",IF($A11=\"Between\",SUMIFS(Stations!M:M,Stations!$H:$H,\">=\"&$B11,Stations!$H:$H,\"<\"&$D11),SUMIFS(Stations!M:M,Stations!$H:$H,\">=\"&$B11))))","v":""},{"$f":"IF($N$1,IF($A11=\"\",\"\",IF($A11=\"Between\",SUMIFS(Stations!O:O,Stations!$H:$H,\">=\"&$B11,Stations!$H:$H,\"<\"&$D11,Stations!$W:$W,\"=No\"),SUMIFS(Stations!O:O,Stations!$H:$H,\">=\"&$B11,Stations!$W:$W,\"=No\"))),IF($A11=\"\",\"\",IF($A11=\"Between\",SUMIFS(Stations!O:O,Stations!$H:$H,\">=\"&$B11,Stations!$H:$H,\"<\"&$D11),SUMIFS(Stations!O:O,Stations!$H:$H,\">=\"&$B11))))","v":""},{"$f":"IF($N$1,IF($A11=\"\",\"\",IF($A11=\"Between\",SUMIFS(Stations!Q:Q,Stations!$H:$H,\">=\"&$B11,Stations!$H:$H,\"<\"&$D11,Stations!$W:$W,\"=No\"),SUMIFS(Stations!Q:Q,Stations!$H:$H,\">=\"&$B11,Stations!$W:$W,\"=No\"))),IF($A11=\"\",\"\",IF($A11=\"Between\",SUMIFS(Stations!Q:Q,Stations!$H:$H,\">=\"&$B11,Stations!$H:$H,\"<\"&$D11),SUMIFS(Stations!Q:Q,Stations!$H:$H,\">=\"&$B11))))","v":""},{"$f":"IF($N$1,IF($A11=\"\",\"\",IF($A11=\"Between\",SUMIFS(Stations!S:S,Stations!$H:$H,\">=\"&$B11,Stations!$H:$H,\"<\"&$D11,Stations!$W:$W,\"=No\"),SUMIFS(Stations!S:S,Stations!$H:$H,\">=\"&$B11,Stations!$W:$W,\"=No\"))),IF($A11=\"\",\"\",IF($A11=\"Between\",SUMIFS(Stations!S:S,Stations!$H:$H,\">=\"&$B11,Stations!$H:$H,\"<\"&$D11),SUMIFS(Stations!S:S,Stations!$H:$H,\">=\"&$B11))))","v":""},{"$f":"IF($N$1,IF($A11=\"\",\"\",IF($A11=\"Between\",SUMIFS(Stations!U:U,Stations!$H:$H,\">=\"&$B11,Stations!$H:$H,\"<\"&$D11,Stations!$W:$W,\"=No\"),SUMIFS(Stations!U:U,Stations!$H:$H,\">=\"&$B11,Stations!$W:$W,\"=No\"))),IF($A11=\"\",\"\",IF($A11=\"Between\",SUMIFS(Stations!U:U,Stations!$H:$H,\">=\"&$B11,Stations!$H:$H,\"<\"&$D11),SUMIFS(Stations!U:U,Stations!$H:$H,\">=\"&$B11))))","v":""}]
["","","",null,"invalid bin",{"$f":"IF($N$1,IF($A12=\"\",\"\",IF($A12=\"Between\",SUMIFS(Stations!L:L,Stations!$H:$H,\">=\"&$B12,Stations!$H:$H,\"<\"&$D12,Stations!$W:$W,\"=No\"),SUMIFS(Stations!L:L,Stations!$H:$H,\">=\"&$B12,Stations!$W:$W,\"=No\"))),IF($A12=\"\",\"\",IF($A12=\"Between\",SUMIFS(Stations!L:L,Stations!$H:$H,\">=\"&$B12,Stations!$H:$H,\"<\"&$D12),SUMIFS(Stations!L:L,Stations!$H:$H,\">=\"&$B12))))","v":""},{"$f":"IF($N$1,IF($A12=\"\",\"\",IF($A12=\"Between\",SUMIFS(Stations!M:M,Stations!$H:$H,\">=\"&$B12,Stations!$H:$H,\"<\"&$D12,Stations!$W:$W,\"=No\"),SUMIFS(Stations!M:M,Stations!$H:$H,\">=\"&$B12,Stations!$W:$W,\"=No\"))),IF($A12=\"\",\"\",IF($A12=\"Between\",SUMIFS(Stations!M:M,Stations!$H:$H,\">=\"&$B12,Stations!$H:$H,\"<\"&$D12),SUMIFS(Stations!M:M,Stations!$H:$H,\">=\"&$B12))))","v":""},{"$f":"IF($N$1,IF($A12=\"\",\"\",IF($A12=\"Between\",SUMIFS(Stations!O:O,Stations!$H:$H,\">=\"&$B12,Stations!$H:$H,\"<\"&$D12,Stations!$W:$W,\"=No\"),SUMIFS(Stations!O:O,Stations!$H:$H,\">=\"&$B12,Stations!$W:$W,\"=No\"))),IF($A12=\"\",\"\",IF($A12=\"Between\",SUMIFS(Stations!O:O,Stations!$H:$H,\">=\"&$B12,Stations!$H:$H,\"<\"&$D12),SUMIFS(Stations!O:O,Stations!$H:$H,\">=\"&$B12))))","v":""},{"$f":"IF($N$1,IF($A12=\"\",\"\",IF($A12=\"Between\",SUMIFS(Stations!Q:Q,Stations!$H:$H,\">=\"&$B12,Stations!$H:$H,\"<\"&$D12,Stations!$W:$W,\"=No\"),SUMIFS(Stations!Q:Q,Stations!$H:$H,\">=\"&$B12,Stations!$W:$W,\"=No\"))),IF($A12=\"\",\"\",IF($A12=\"Between\",SUMIFS(Stations!Q:Q,Stations!$H:$H,\">=\"&$B12,Stations!$H:$H,\"<\"&$D12),SUMIFS(Stations!Q:Q,Stations!$H:$H,\">=\"&$B12))))","v":""},{"$f":"IF($N$1,IF($A12=\"\",\"\",IF($A12=\"Between\",SUMIFS(Stations!S:S,Stations!$H:$H,\">=\"&$B12,Stations!$H:$H,\"<\"&$D12,Stations!$W:$W,\"=No\"),SUMIFS(Stations!S:S,Stations!$H:$H,\">=\"&$B12,Stations!$W:$W,\"=No\"))),IF($A12=\"\",\"\",IF($A12=\"Between\",SUMIFS(Stations!S:S,Stations!$H:$H,\">=\"&$B12,Stations!$H:$H,\"<\"&$D12),SUMIFS(Stations!S:S,Stations!$H:$H,\">=\"&$B12))))","v":""},{"$f":"IF($N$1,IF($A12=\"\",\"\",IF($A12=\"Between\",SUMIFS(Stations!U:U,Stations!$H:$H,\">=\"&$B12,Stations!$H:$H,\"<\"&$D12,Stations!$W:$W,\"=No\"),SUMIFS(Stations!U:U,Stations!$H:$H,\">=\"&$B12,Stations!$W:$W,\"=No\"))),IF($A12=\"\",\"\",IF($A12=\"Between\",SUMIFS(Stations!U:U,Stations!$H:$H,\">=\"&$B12,Stations!$H:$H,\"<\"&$D12),SUMIFS(Stations!U:U,Stations!$H:$H,\">=\"&$B12))))","v":""}]
["","","",null,"invalid bin",{"$f":"IF($N$1,IF($A13=\"\",\"\",IF($A13=\"Between\",SUMIFS(Stations!L:L,Stations!$H:$H,\">=\"&$B13,Stations!$H:$H,\"<\"&$D13,Stations!$W:$W,\"=No\"),SUMIFS(Stations!L:L,Stations!$H:$H,\">=\"&$B13,Stations!$W:$W,\"=No\"))),IF($A13=\"\",\"\",IF($A13=\"Between\",SUMIFS(Stations!L:L,Stations!$H:$H,\">=\"&$B13,Stations!$H:$H,\"<\"&$D13),SUMIFS(Stations!L:L,Stations!$H:$H,\">=\"&$B13))))","v":""},{"$f":"IF($N$1,IF($A13=\"\",\"\",IF($A13=\"Between\",SUMIFS(Stations!M:M,Stations!$H:$H,\">=\"&$B13,Stations!$H:$H,\"<\"&$D13,Stations!$W:$W,\"=No\"),SUMIFS(Stations!M:M,Stations!$H:$H,\">=\"&$B13,Stations!$W:$W,\"=No\"))),IF($A13=\"\",\"\",IF($A13=\"Between\",SUMIFS(Stations!M:M,Stations!$H:$H,\">=\"&$B13,Stations!$H:$H,\"<\"&$D13),SUMIFS(Stations!M:M,Stations!$H:$H,\">=\"&$B13))))","v":""},{"$f":"IF($N$1,IF($A13=\"\",\"\",IF($A13=\"Between\",SUMIFS(Stations!O:O,Stations!$H:$H,\">=\"&$B13,Stations!$H:$H,\"<\"&$D13,Stations!$W:$W,\"=No\"),SUMIFS(Stations!O:O,Stations!$H:$H,\">=\"&$B13,Stations!$W:$W,\"=No\"))),IF($A13=\"\",\"\",IF($A13=\"Between\",SUMIFS(Stations!O:O,Stations!$H:$H,\">=\"&$B13,Stations!$H:$H,\"<\"&$D13),SUMIFS(Stations!O:O,Stations!$H:$H,\">=\"&$B13))))","v":""},{"$f":"IF($N$1,IF($A13=\"\",\"\",IF($A13=\"Between\",SUMIFS(Stations!Q:Q,Stations!$H:$H,\">=\"&$B13,Stations!$H:$H,\"<\"&$D13,Stations!$W:$W,\"=No\"),SUMIFS(Stations!Q:Q,Stations!$H:$H,\">=\"&$B13,Stations!$W:$W,\"=No\"))),IF($A13=\"\",\"\",IF($A13=\"Between\",SUMIFS(Stations!Q:Q,Stations!$H:$H,\">=\"&$B13,Stations!$H:$H,\"<\"&$D13),SUMIFS(Stations!Q:Q,Stations!$H:$H,\">=\"&$B13))))","v":""},{"$f":"IF($N$1,IF($A13=\"\",\"\",IF($A13=\"Between\",SUMIFS(Stations!S:S,Stations!$H:$H,\">=\"&$B13,Stations!$H:$H,\"<\"&$D13,Stations!$W:$W,\"=No\"),SUMIFS(Stations!S:S,Stations!$H:$H,\">=\"&$B13,Stations!$W:$W,\"=No\"))),IF($A13=\"\",\"\",IF($A13=\"Between\",SUMIFS(Stations!S:S,Stations!$H:$H,\">=\"&$B13,Stations!$H:$H,\"<\"&$D13),SUMIFS(Stations!S:S,Stations!$H:$H,\">=\"&$B13))))","v":""},{"$f":"IF($N$1,IF($A13=\"\",\"\",IF($A13=\"Between\",SUMIFS(Stations!U:U,Stations!$H:$H,\">=\"&$B13,Stations!$H:$H,\"<\"&$D13,Stations!$W:$W,\"=No\"),SUMIFS(Stations!U:U,Stations!$H:$H,\">=\"&$B13,Stations!$W:$W,\"=No\"))),IF($A13=\"\",\"\",IF($A13=\"Between\",SUMIFS(Stations!U:U,Stations!$H:$H,\">=\"&$B13,Stations!$H:$H,\"<\"&$D13),SUMIFS(Stations!U:U,Stations!$H:$H,\">=\"&$B13))))","v":""}]
["","","",null,"invalid bin",{"$f":"IF($N$1,IF($A14=\"\",\"\",IF($A14=\"Between\",SUMIFS(Stations!L:L,Stations!$H:$H,\">=\"&$B14,Stations!$H:$H,\"<\"&$D14,Stations!$W:$W,\"=No\"),SUMIFS(Stations!L:L,Stations!$H:$H,\">=\"&$B14,Stations!$W:$W,\"=No\"))),IF($A14=\"\",\"\",IF($A14=\"Between\",SUMIFS(Stations!L:L,Stations!$H:$H,\">=\"&$B14,Stations!$H:$H,\"<\"&$D14),SUMIFS(Stations!L:L,Stations!$H:$H,\">=\"&$B14))))","v":""},{"$f":"IF($N$1,IF($A14=\"\",\"\",IF($A14=\"Between\",SUMIFS(Stations!M:M,Stations!$H:$H,\">=\"&$B14,Stations!$H:$H,\"<\"&$D14,Stations!$W:$W,\"=No\"),SUMIFS(Stations!M:M,Stations!$H:$H,\">=\"&$B14,Stations!$W:$W,\"=No\"))),IF($A14=\"\",\"\",IF($A14=\"Between\",SUMIFS(Stations!M:M,Stations!$H:$H,\">=\"&$B14,Stations!$H:$H,\"<\"&$D14),SUMIFS(Stations!M:M,Stations!$H:$H,\">=\"&$B14))))","v":""},{"$f":"IF($N$1,IF($A14=\"\",\"\",IF($A14=\"Between\",SUMIFS(Stations!O:O,Stations!$H:$H,\">=\"&$B14,Stations!$H:$H,\"<\"&$D14,Stations!$W:$W,\"=No\"),SUMIFS(Stations!O:O,Stations!$H:$H,\">=\"&$B14,Stations!$W:$W,\"=No\"))),IF($A14=\"\",\"\",IF($A14=\"Between\",SUMIFS(Stations!O:O,Stations!$H:$H,\">=\"&$B14,Stations!$H:$H,\"<\"&$D14),SUMIFS(Stations!O:O,Stations!$H:$H,\">=\"&$B14))))","v":""},{"$f":"IF($N$1,IF($A14=\"\",\"\",IF($A14=\"Between\",SUMIFS(Stations!Q:Q,Stations!$H:$H,\">=\"&$B14,Stations!$H:$H,\"<\"&$D14,Stations!$W:$W,\"=No\"),SUMIFS(Stations!Q:Q,Stations!$H:$H,\">=\"&$B14,Stations!$W:$W,\"=No\"))),IF($A14=\"\",\"\",IF($A14=\"Between\",SUMIFS(Stations!Q:Q,Stations!$H:$H,\">=\"&$B14,Stations!$H:$H,\"<\"&$D14),SUMIFS(Stations!Q:Q,Stations!$H:$H,\">=\"&$B14))))","v":""},{"$f":"IF($N$1,IF($A14=\"\",\"\",IF($A14=\"Between\",SUMIFS(Stations!S:S,Stations!$H:$H,\">=\"&$B14,Stations!$H:$H,\"<\"&$D14,Stations!$W:$W,\"=No\"),SUMIFS(Stations!S:S,Stations!$H:$H,\">=\"&$B14,Stations!$W:$W,\"=No\"))),IF($A14=\"\",\"\",IF($A14=\"Between\",SUMIFS(Stations!S:S,Stations!$H:$H,\">=\"&$B14,Stations!$H:$H,\"<\"&$D14),SUMIFS(Stations!S:S,Stations!$H:$H,\">=\"&$B14))))","v":""},{"$f":"IF($N$1,IF($A14=\"\",\"\",IF($A14=\"Between\",SUMIFS(Stations!U:U,Stations!$H:$H,\">=\"&$B14,Stations!$H:$H,\"<\"&$D14,Stations!$W:$W,\"=No\"),SUMIFS(Stations!U:U,Stations!$H:$H,\">=\"&$B14,Stations!$W:$W,\"=No\"))),IF($A14=\"\",\"\",IF($A14=\"Between\",SUMIFS(Stations!U:U,Stations!$H:$H,\">=\"&$B14,Stations!$H:$H,\"<\"&$D14),SUMIFS(Stations!U:U,Stations!$H:$H,\">=\"&$B14))))","v":""}]
["","","",null,"invalid bin",{"$f":"IF($N$1,IF($A15=\"\",\"\",IF($A15=\"Between\",SUMIFS(Stations!L:L,Stations!$H:$H,\">=\"&$B15,Stations!$H:$H,\"<\"&$D15,Stations!$W:$W,\"=No\"),SUMIFS(Stations!L:L,Stations!$H:$H,\">=\"&$B15,Stations!$W:$W,\"=No\"))),IF($A15=\"\",\"\",IF($A15=\"Between\",SUMIFS(Stations!L:L,Stations!$H:$H,\">=\"&$B15,Stations!$H:$H,\"<\"&$D15),SUMIFS(Stations!L:L,Stations!$H:$H,\">=\"&$B15))))","v":""},{"$f":"IF($N$1,IF($A15=\"\",\"\",IF($A15=\"Between\",SUMIFS(Stations!M:M,Stations!$H:$H,\">=\"&$B15,Stations!$H:$H,\"<\"&$D15,Stations!$W:$W,\"=No\"),SUMIFS(Stations!M:M,Stations!$H:$H,\">=\"&$B15,Stations!$W:$W,\"=No\"))),IF($A15=\"\",\"\",IF($A15=\"Between\",SUMIFS(Stations!M:M,Stations!$H:$H,\">=\"&$B15,Stations!$H:$H,\"<\"&$D15),SUMIFS(Stations!M:M,Stations!$H:$H,\">=\"&$B15))))","v":""},{"$f":"IF($N$1,IF($A15=\"\",\"\",IF($A15=\"Between\",SUMIFS(Stations!O:O,Stations!$H:$H,\">=\"&$B15,Stations!$H:$H,\"<\"&$D15,Stations!$W:$W,\"=No\"),SUMIFS(Stations!O:O,Stations!$H:$H,\">=\"&$B15,Stations!$W:$W,\"=No\"))),IF($A15=\"\",\"\",IF($A15=\"Between\",SUMIFS(Stations!O:O,Stations!$H:$H,\">=\"&$B15,Stations!$H:$H,\"<\"&$D15),SUMIFS(Stations!O:O,Stations!$H:$H,\">=\"&$B15))))","v":""},{"$f":"IF($N$1,IF($A15=\"\",\"\",IF($A15=\"Between\",SUMIFS(Stations!Q:Q,Stations!$H:$H,\">=\"&$B15,Stations!$H:$H,\"<\"&$D15,Stations!$W:$W,\"=No\"),SUMIFS(Stations!Q:Q,Stations!$H:$H,\">=\"&$B15,Stations!$W:$W,\"=No\"))),IF($A15=\"\",\"\",IF($A15=\"Between\",SUMIFS(Stations!Q:Q,Stations!$H:$H,\">=\"&$B15,Stations!$H:$H,\"<\"&$D15),SUMIFS(Stations!Q:Q,Stations!$H:$H,\">=\"&$B15))))","v":""},{"$f":"IF($N$1,IF($A15=\"\",\"\",IF($A15=\"Between\",SUMIFS(Stations!S:S,Stations!$H:$H,\">=\"&$B15,Stations!$H:$H,\"<\"&$D15,Stations!$W:$W,\"=No\"),SUMIFS(Stations!S:S,Stations!$H:$H,\">=\"&$B15,Stations!$W:$W,\"=No\"))),IF($A15=\"\",\"\",IF($A15=\"Between\",SUMIFS(Stations!S:S,Stations!$H:$H,\">=\"&$B15,Stations!$H:$H,\"<\"&$D15),SUMIFS(Stations!S:S,Stations!$H:$H,\">=\"&$B15))))","v":""},{"$f":"IF($N$1,IF($A15=\"\",\"\",IF($A15=\"Between\",SUMIFS(Stations!U:U,Stations!$H:$H,\">=\"&$B15,Stations!$H:$H,\"<\"&$D15,Stations!$W:$W,\"=No\"),SUMIFS(Stations!U:U,Stations!$H:$H,\">=\"&$B15,Stations!$W:$W,\"=No\"))),IF($A15=\"\",\"\",IF($A15=\"Between\",SUMIFS(Stations!U:U,Stations!$H:$H,\">=\"&$B15,Stations!$H:$H,\"<\"&$D15),SUMIFS(Stations!U:U,Stations!$H:$H,\">=\"&$B15))))","v":""}]
[]
[]
[]
["By Mode/Type of Service"]
["Mode","Type","Description","Column1","Column2","VOMS","ADA Accessible","Non-ADA Accessible","Total Stations","Elevators","Escalators"]
["TR","PT","Aerial Tramway - Purchased Transportation",null,null,{"$f":"IF($N$1,SUMIFS(Stations!L:L,Stations!$J:$J,\"=\"&$A21,Stations!$K:$K,\"=\"&$B21,Stations!$W:$W,\"=No\"),SUMIFS(Stations!L:L,Stations!$J:$J,\"=\"&$A21,Stations!$K:$K,\"=\"&$B21))","v":2},{"$f":"IF($N$1,SUMIFS(Stations!M:M,Stations!$J:$J,\"=\"&$A21,Stations!$K:$K,\"=\"&$B21,Stations!$W:$W,\"=No\"),SUMIFS(Stations!M:M,Stations!$J:$J,\"=\"&$A21,Stations!$K:$K,\"=\"&$B21))","v":2},{"$f":"IF($N$1,SUMIFS(Stations!O:O,Stations!$J:$J,\"=\"&$A21,Stations!$K:$K,\"=\"&$B21,Stations!$W:$W,\"=No\"),SUMIFS(Stations!O:O,Stations!$J:$J,\"=\"&$A21,Stations!$K:$K,\"=\"&$B21))","v":0},{"$f":"IF($N$1,SUMIFS(Stations!Q:Q,Stations!$J:$J,\"=\"&$A21,Stations!$K:$K,\"=\"&$B21,Stations!$W:$W,\"=No\"),SUMIFS(Stations!Q:Q,Stations!$J:$J,\"=\"&$A21,Stations!$K:$K,\"=\"&$B21))","v":2},{"$f":"IF($N$1,SUMIFS(Stations!S:S,Stations!$J:$J,\"=\"&$A21,Stations!$K:$K,\"=\"&$B21,Stations!$W:$W,\"=No\"),SUMIFS(Stations!S:S,Stations!$J:$J,\"=\"&$A21,Stations!$K:$K,\"=\"&$B21))","v":1},{"$f":"IF($N$1,SUMIFS(Stations!U:U,Stations!$J:$J,\"=\"&$A21,Stations!$K:$K,\"=\"&$B21,Stations!$W:$W,\"=No\"),SUMIFS(Stations!U:U,Stations!$J:$J,\"=\"&$A21,Stations!$K:$K,\"=\"&$B21))","v":0}]
["AR","DO","Alaska Railroad - Directly Operated",null,null,{"$f":"IF($N$1,SUMIFS(Stations!L:L,Stations!$J:$J,\"=\"&$A22,Stations!$K:$K,\"=\"&$B22,Stations!$W:$W,\"=No\"),SUMIFS(Stations!L:L,Stations!$J:$J,\"=\"&$A22,Stations!$K:$K,\"=\"&$B22))","v":39},{"$f":"IF($N$1,SUMIFS(Stations!M:M,Stations!$J:$J,\"=\"&$A22,Stations!$K:$K,\"=\"&$B22,Stations!$W:$W,\"=No\"),SUMIFS(Stations!M:M,Stations!$J:$J,\"=\"&$A22,Stations!$K:$K,\"=\"&$B22))","v":11},{"$f":"IF($N$1,SUMIFS(Stations!O:O,Stations!$J:$J,\"=\"&$A22,Stations!$K:$K,\"=\"&$B22,Stations!$W:$W,\"=No\"),SUMIFS(Stations!O:O,Stations!$J:$J,\"=\"&$A22,Stations!$K:$K,\"=\"&$B22))","v":0},{"$f":"IF($N$1,SUMIFS(Stations!Q:Q,Stations!$J:$J,\"=\"&$A22,Stations!$K:$K,\"=\"&$B22,Stations!$W:$W,\"=No\"),SUMIFS(Stations!Q:Q,Stations!$J:$J,\"=\"&$A22,Stations!$K:$K,\"=\"&$B22))","v":11},{"$f":"IF($N$1,SUMIFS(Stations!S:S,Stations!$J:$J,\"=\"&$A22,Stations!$K:$K,\"=\"&$B22,Stations!$W:$W,\"=No\"),SUMIFS(Stations!S:S,Stations!$J:$J,\"=\"&$A22,Stations!$K:$K,\"=\"&$B22))","v":2},{"$f":"IF($N$1,SUMIFS(Stations!U:U,Stations!$J:$J,\"=\"&$A22,Stations!$K:$K,\"=\"&$B22,Stations!$W:$W,\"=No\"),SUMIFS(Stations!U:U,Stations!$J:$J,\"=\"&$A22,Stations!$K:$K,\"=\"&$B22))","v":2}]
["MB","DO","Bus - Directly Operated",null,null,{"$f":"IF($N$1,SUMIFS(Stations!L:L,Stations!$J:$J,\"=\"&$A23,Stations!$K:$K,\"=\"&$B23,Stations!$W:$W,\"=No\"),SUMIFS(Stations!L:L,Stations!$J:$J,\"=\"&$A23,Stations!$K:$K,\"=\"&$B23))","v":40036},{"$f":"IF($N$1,SUMIFS(Stations!M:M,Stations!$J:$J,\"=\"&$A23,Stations!$K:$K,\"=\"&$B23,Stations!$W:$W,\"=No\"),SUMIFS(Stations!M:M,Stations!$J:$J,\"=\"&$A23,Stations!$K:$K,\"=\"&$B23))","v":1098},{"$f":"IF($N$1,SUMIFS(Stations!O:O,Stations!$J:$J,\"=\"&$A23,Stations!$K:$K,\"=\"&$B23,Stations!$W:$W,\"=No\"),SUMIFS(Stations!O:O,Stations!$J:$J,\"=\"&$A23,Stations!$K:$K,\"=\"&$B23))","v":34},{"$f":"IF($N$1,SUMIFS(Stations!Q:Q,Stations!$J:$J,\"=\"&$A23,Stations!$K:$K,\"=\"&$B23,Stations!$W:$W,\"=No\"),SUMIFS(Stations!Q:Q,Stations!$J:$J,\"=\"&$A23,Stations!$K:$K,\"=\"&$B23))","v":1132},{"$f":"IF($N$1,SUMIFS(Stations!S:S,Stations!$J:$J,\"=\"&$A23,Stations!$K:$K,\"=\"&$B23,Stations!$W:$W,\"=No\"),SUMIFS(Stations!S:S,Stations!$J:$J,\"=\"&$A23,Stations!$K:$K,\"=\"&$B23))","v":305},{"$f":"IF($N$1,SUMIFS(Stations!U:U,Stations!$J:$J,\"=\"&$A23,Stations!$K:$K,\"=\"&$B23,Stations!$W:$W,\"=No\"),SUMIFS(Stations!U:U,Stations!$J:$J,\"=\"&$A23,Stations!$K:$K,\"=\"&$B23))","v":125}]
["MB","PT","Bus - Purchased Transportation",null,null,{"$f":"IF($N$1,SUMIFS(Stations!L:L,Stations!$J:$J,\"=\"&$A24,Stations!$K:$K,\"=\"&$B24,Stations!$W:$W,\"=No\"),SUMIFS(Stations!L:L,Stations!$J:$J,\"=\"&$A24,Stations!$K:$K,\"=\"&$B24))","v":8969},{"$f":"IF($N$1,SUMIFS(Stations!M:M,Stations!$J:$J,\"=\"&$A24,Stations!$K:$K,\"=\"&$B24,Stations!$W:$W,\"=No\"),SUMIFS(Stations!M:M,Stations!$J:$J,\"=\"&$A24,Stations!$K:$K,\"=\"&$B24))","v":378},{"$f":"IF($N$1,SUMIFS(Stations!O:O,Stations!$J:$J,\"=\"&$A24,Stations!$K:$K,\"=\"&$B24,Stations!$W:$W,\"=No\"),SUMIFS(Stations!O:O,Stations!$J:$J,\"=\"&$A24,Stations!$K:$K,\"=\"&$B24))","v":4},{"$f":"IF($N$1,SUMIFS(Stations!Q:Q,Stations!$J:$J,\"=\"&$A24,Stations!$K:$K,\"=\"&$B24,Stations!$W:$W,\"=No\"),SUMIFS(Stations!Q:Q,Stations!$J:$J,\"=\"&$A24,Stations!$K:$K,\"=\"&$B24))","v":382},{"$f":"IF($N$1,SUMIFS(Stations!S:S,Stations!$J:$J,\"=\"&$A24,Stations!$K:$K,\"=\"&$B24,Stations!$W:$W,\"=No\"),SUMIFS(Stations!S:S,Stations!$J:$J,\"=\"&$A24,Stations!$K:$K,\"=\"&$B24))","v":159},{"$f":"IF($N$1,SUMIFS(Stations!U:U,Stations!$J:$J,\"=\"&$A24,Stations!$K:$K,\"=\"&$B24,Stations!$W:$W,\"=No\"),SUMIFS(Stations!U:U,Stations!$J:$J,\"=\"&$A24,Stations!$K:$K,\"=\"&$B24))","v":93}]
["RB","DO","Bus Rapid Transit - Directly Operated",null,null,{"$f":"IF($N$1,SUMIFS(Stations!L:L,Stations!$J:$J,\"=\"&$A25,Stations!$K:$K,\"=\"&$B25,Stations!$W:$W,\"=No\"),SUMIFS(Stations!L:L,Stations!$J:$J,\"=\"&$A25,Stations!$K:$K,\"=\"&$B25))","v":277},{"$f":"IF($N$1,SUMIFS(Stations!M:M,Stations!$J:$J,\"=\"&$A25,Stations!$K:$K,\"=\"&$B25,Stations!$W:$W,\"=No\"),SUMIFS(Stations!M:M,Stations!$J:$J,\"=\"&$A25,Stations!$K:$K,\"=\"&$B25))","v":30},{"$f":"IF($N$1,SUMIFS(Stations!O:O,Stations!$J:$J,\"=\"&$A25,Stations!$K:$K,\"=\"&$B25,Stations!$W:$W,\"=No\"),SUMIFS(Stations!O:O,Stations!$J:$J,\"=\"&$A25,Stations!$K:$K,\"=\"&$B25))","v":0},{"$f":"IF($N$1,SUMIFS(Stations!Q:Q,Stations!$J:$J,\"=\"&$A25,Stations!$K:$K,\"=\"&$B25,Stations!$W:$W,\"=No\"),SUMIFS(Stations!Q:Q,Stations!$J:$J,\"=\"&$A25,Stations!$K:$K,\"=\"&$B25))","v":30},{"$f":"IF($N$1,SUMIFS(Stations!S:S,Stations!$J:$J,\"=\"&$A25,Stations!$K:$K,\"=\"&$B25,Stations!$W:$W,\"=No\"),SUMIFS(Stations!S:S,Stations!$J:$J,\"=\"&$A25,Stations!$K:$K,\"=\"&$B25))","v":11},{"$f":"IF($N$1,SUMIFS(Stations!U:U,Stations!$J:$J,\"=\"&$A25,Stations!$K:$K,\"=\"&$B25,Stations!$W:$W,\"=No\"),SUMIFS(Stations!U:U,Stations!$J:$J,\"=\"&$A25,Stations!$K:$K,\"=\"&$B25))","v":17}]
["RB","PT","Bus Rapid Transit - Purchased Transportation",null,null,{"$f":"IF($N$1,SUMIFS(Stations!L:L,Stations!$J:$J,\"=\"&$A26,Stations!$K:$K,\"=\"&$B26,Stations!$W:$W,\"=No\"),SUMIFS(Stations!L:L,Stations!$J:$J,\"=\"&$A26,Stations!$K:$K,\"=\"&$B26))","v":23},{"$f":"IF($N$1,SUMIFS(Stations!M:M,Stations!$J:$J,\"=\"&$A26,Stations!$K:$K,\"=\"&$B26,Stations!$W:$W,\"=No\"),SUMIFS(Stations!M:M,Stations!$J:$J,\"=\"&$A26,Stations!$K:$K,\"=\"&$B26))","v":1},{"$f":"IF($N$1,SUMIFS(Stations!O:O,Stations!$J:$J,\"=\"&$A26,Stations!$K:$K,\"=\"&$B26,Stations!$W:$W,\"=No\"),SUMIFS(Stations!O:O,Stations!$J:$J,\"=\"&$A26,Stations!$K:$K,\"=\"&$B26))","v":0},{"$f":"IF($N$1,SUMIFS(Stations!Q:Q,Stations!$J:$J,\"=\"&$A26,Stations!$K:$K,\"=\"&$B26,Stations!$W:$W,\"=No\"),SUMIFS(Stations!Q:Q,Stations!$J:$J,\"=\"&$A26,Stations!$K:$K,\"=\"&$B26))","v":1},{"$f":"IF($N$1,SUMIFS(Stations!S:S,Stations!$J:$J,\"=\"&$A26,Stations!$K:$K,\"=\"&$B26,Stations!$W:$W,\"=No\"),SUMIFS(Stations!S:S,Stations!$J:$J,\"=\"&$A26,Stations!$K:$K,\"=\"&$B26))","v":0},{"$f":"IF($N$1,SUMIFS(Stations!U:U,Stations!$J:$J,\"=\"&$A26,Stations!$K:$K,\"=\"&$B26,Stations!$W:$W,\"=No\"),SUMIFS(Stations!U:U,Stations!$J:$J,\"=\"&$A26,Stations!$K:$K,\"=\"&$B26))","v":0}]
["CC","DO","Cable Car - Directly Operated",null,null,{"$f":"IF($N$1,SUMIFS(Stations!L:L,Stations!$J:$J,\"=\"&$A27,Stations!$K:$K,\"=\"&$B27,Stations!$W:$W,\"=No\"),SUMIFS(Stations!L:L,Stations!$J:$J,\"=\"&$A27,Stations!$K:$K,\"=\"&$B27))","v":27},{"$f":"IF($N$1,SUMIFS(Stations!M:M,Stations!$J:$J,\"=\"&$A27,Stations!$K:$K,\"=\"&$B27,Stations!$W:$W,\"=No\"),SUMIFS(Stations!M:M,Stations!$J:$J,\"=\"&$A27,Stations!$K:$K,\"=\"&$B27))","v":0},{"$f":"IF($N$1,SUMIFS(Stations!O:O,Stations!$J:$J,\"=\"&$A27,Stations!$K:$K,\"=\"&$B27,Stations!$W:$W,\"=No\"),SUMIFS(Stations!O:O,Stations!$J:$J,\"=\"&$A27,Stations!$K:$K,\"=\"&$B27))","v":0},{"$f":"IF($N$1,SUMIFS(Stations!Q:Q,Stations!$J:$J,\"=\"&$A27,Stations!$K:$K,\"=\"&$B27,Stations!$W:$W,\"=No\"),SUMIFS(Stations!Q:Q,Stations!$J:$J,\"=\"&$A27,Stations!$K:$K,\"=\"&$B27))","v":0},{"$f":"IF($N$1,SUMIFS(Stations!S:S,Stations!$J:$J,\"=\"&$A27,Stations!$K:$K,\"=\"&$B27,Stations!$W:$W,\"=No\"),SUMIFS(Stations!S:S,Stations!$J:$J,\"=\"&$A27,Stations!$K:$K,\"=\"&$B27))","v":0},{"$f":"IF($N$1,SUMIFS(Stations!U:U,Stations!$J:$J,\"=\"&$A27,Stations!$K:$K,\"=\"&$B27,Stations!$W:$W,\"=No\"),SUMIFS(Stations!U:U,Stations!$J:$J,\"=\"&$A27,Stations!$K:$K,\"=\"&$B27))","v":0}]
["CB","DO","Commuter Bus - Directly Operated",null,null,{"$f":"IF($N$1,SUMIFS(Stations!L:L,Stations!$J:$J,\"=\"&$A28,Stations!$K:$K,\"=\"&$B28,Stations!$W:$W,\"=No\"),SUMIFS(Stations!L:L,Stations!$J:$J,\"=\"&$A28,Stations!$K:$K,\"=\"&$B28))","v":2538},{"$f":"IF($N$1,SUMIFS(Stations!M:M,Stations!$J:$J,\"=\"&$A28,Stations!$K:$K,\"=\"&$B28,Stations!$W:$W,\"=No\"),SUMIFS(Stations!M:M,Stations!$J:$J,\"=\"&$A28,Stations!$K:$K,\"=\"&$B28))","v":153},{"$f":"IF($N$1,SUMIFS(Stations!O:O,Stations!$J:$J,\"=\"&$A28,Stations!$K:$K,\"=\"&$B28,Stations!$W:$W,\"=No\"),SUMIFS(Stations!O:O,Stations!$J:$J,\"=\"&$A28,Stations!$K:$K,\"=\"&$B28))","v":3},{"$f":"IF($N$1,SUMIFS(Stations!Q:Q,Stations!$J:$J,\"=\"&$A28,Stations!$K:$K,\"=\"&$B28,Stations!$W:$W,\"=No\"),SUMIFS(Stations!Q:Q,Stations!$J:$J,\"=\"&$A28,Stations!$K:$K,\"=\"&$B28))","v":156},{"$f":"IF($N$1,SUMIFS(Stations!S:S,Stations!$J:$J,\"=\"&$A28,Stations!$K:$K,\"=\"&$B28,Stations!$W:$W,\"=No\"),SUMIFS(Stations!S:S,Stations!$J:$J,\"=\"&$A28,Stations!$K:$K,\"=\"&$B28))","v":56},{"$f":"IF($N$1,SUMIFS(Stations!U:U,Stations!$J:$J,\"=\"&$A28,Stations!$K:$K,\"=\"&$B28,Stations!$W:$W,\"=No\"),SUMIFS(Stations!U:U,Stations!$J:$J,\"=\"&$A28,Stations!$K:$K,\"=\"&$B28))","v":16}]
["CB","PT","Commuter Bus - Purchased Transportation",null,null,{"$f":"IF($N$1,SUMIFS(Stations!L:L,Stations!$J:$J,\"=\"&$A29,Stations!$K:$K,\"=\"&$B29,Stations!$W:$W,\"=No\"),SUMIFS(Stations!L:L,Stations!$J:$J,\"=\"&$A29,Stations!$K:$K,\"=\"&$B29))","v":1425},{"$f":"IF($N$1,SUMIFS(Stations!M:M,Stations!$J:$J,\"=\"&$A29,Stations!$K:$K,\"=\"&$B29,Stations!$W:$W,\"=No\"),SUMIFS(Stations!M:M,Stations!$J:$J,\"=\"&$A29,Stations!$K:$K,\"=\"&$B29))","v":79},{"$f":"IF($N$1,SUMIFS(Stations!O:O,Stations!$J:$J,\"=\"&$A29,Stations!$K:$K,\"=\"&$B29,Stations!$W:$W,\"=No\"),SUMIFS(Stations!O:O,Stations!$J:$J,\"=\"&$A29,Stations!$K:$K,\"=\"&$B29))","v":0},{"$f":"IF($N$1,SUMIFS(Stations!Q:Q,Stations!$J:$J,\"=\"&$A29,Stations!$K:$K,\"=\"&$B29,Stations!$W:$W,\"=No\"),SUMIFS(Stations!Q:Q,Stations!$J:$J,\"=\"&$A29,Stations!$K:$K,\"=\"&$B29))","v":79},{"$f":"IF($N$1,SUMIFS(Stations!S:S,Stations!$J:$J,\"=\"&$A29,Stations!$K:$K,\"=\"&$B29,Stations!$W:$W,\"=No\"),SUMIFS(Stations!S:S,Stations!$J:$J,\"=\"&$A29,Stations!$K:$K,\"=\"&$B29))","v":53},{"$f":"IF($N$1,SUMIFS(Stations!U:U,Stations!$J:$J,\"=\"&$A29,Stations!$K:$K,\"=\"&$B29,Stations!$W:$W,\"=No\"),SUMIFS(Stations!U:U,Stations!$J:$J,\"=\"&$A29,Stations!$K:$K,\"=\"&$B29))","v":79}]
["CR","DO","Commuter Rail - Directly Operated",null,null,{"$f":"IF($N$1,SUMIFS(Stations!L:L,Stations!$J:$J,\"=\"&$A30,Stations!$K:$K,\"=\"&$B30,Stations!$W:$W,\"=No\"),SUMIFS(Stations!L:L,Stations!$J:$J,\"=\"&$A30,Stations!$K:$K,\"=\"&$B30))","v":4966},{"$f":"IF($N$1,SUMIFS(Stations!M:M,Stations!$J:$J,\"=\"&$A30,Stations!$K:$K,\"=\"&$B30,Stations!$W:$W,\"=No\"),SUMIFS(Stations!M:M,Stations!$J:$J,\"=\"&$A30,Stations!$K:$K,\"=\"&$B30))","v":510},{"$f":"IF($N$1,SUMIFS(Stations!O:O,Stations!$J:$J,\"=\"&$A30,Stations!$K:$K,\"=\"&$B30,Stations!$W:$W,\"=No\"),SUMIFS(Stations!O:O,Stations!$J:$J,\"=\"&$A30,Stations!$K:$K,\"=\"&$B30))","v":322},{"$f":"IF($N$1,SUMIFS(Stations!Q:Q,Stations!$J:$J,\"=\"&$A30,Stations!$K:$K,\"=\"&$B30,Stations!$W:$W,\"=No\"),SUMIFS(Stations!Q:Q,Stations!$J:$J,\"=\"&$A30,Stations!$K:$K,\"=\"&$B30))","v":832},{"$f":"IF($N$1,SUMIFS(Stations!S:S,Stations!$J:$J,\"=\"&$A30,Stations!$K:$K,\"=\"&$B30,Stations!$W:$W,\"=No\"),SUMIFS(Stations!S:S,Stations!$J:$J,\"=\"&$A30,Stations!$K:$K,\"=\"&$B30))","v":365},{"$f":"IF($N$1,SUMIFS(Stations!U:U,Stations!$J:$J,\"=\"&$A30,Stations!$K:$K,\"=\"&$B30,Stations!$W:$W,\"=No\"),SUMIFS(Stations!U:U,Stations!$J:$J,\"=\"&$A30,Stations!$K:$K,\"=\"&$B30))","v":175}]
["CR","PT","Commuter Rail - Purchased Transportation",null,null,{"$f":"IF($N$1,SUMIFS(Stations!L:L,Stations!$J:$J,\"=\"&$A31,Stations!$K:$K,\"=\"&$B31,Stations!$W:$W,\"=No\"),SUMIFS(Stations!L:L,Stations!$J:$J,\"=\"&$A31,Stations!$K:$K,\"=\"&$B31))","v":1318},{"$f":"IF($N$1,SUMIFS(Stations!M:M,Stations!$J:$J,\"=\"&$A31,Stations!$K:$K,\"=\"&$B31,Stations!$W:$W,\"=No\"),SUMIFS(Stations!M:M,Stations!$J:$J,\"=\"&$A31,Stations!$K:$K,\"=\"&$B31))","v":363},{"$f":"IF($N$1,SUMIFS(Stations!O:O,Stations!$J:$J,\"=\"&$A31,Stations!$K:$K,\"=\"&$B31,Stations!$W:$W,\"=No\"),SUMIFS(Stations!O:O,Stations!$J:$J,\"=\"&$A31,Stations!$K:$K,\"=\"&$B31))","v":66},{"$f":"IF($N$1,SUMIFS(Stations!Q:Q,Stations!$J:$J,\"=\"&$A31,Stations!$K:$K,\"=\"&$B31,Stations!$W:$W,\"=No\"),SUMIFS(Stations!Q:Q,Stations!$J:$J,\"=\"&$A31,Stations!$K:$K,\"=\"&$B31))","v":429},{"$f":"IF($N$1,SUMIFS(Stations!S:S,Stations!$J:$J,\"=\"&$A31,Stations!$K:$K,\"=\"&$B31,Stations!$W:$W,\"=No\"),SUMIFS(Stations!S:S,Stations!$J:$J,\"=\"&$A31,Stations!$K:$K,\"=\"&$B31))","v":140},{"$f":"IF($N$1,SUMIFS(Stations!U:U,Stations!$J:$J,\"=\"&$A31,Stations!$K:$K,\"=\"&$B31,Stations!$W:$W,\"=No\"),SUMIFS(Stations!U:U,Stations!$J:$J,\"=\"&$A31,Stations!$K:$K,\"=\"&$B31))","v":40}]
["FB","DO","Ferryboat - Directly Operated",null,null,{"$f":"IF($N$1,SUMIFS(Stations!L:L,Stations!$J:$J,\"=\"&$A32,Stations!$K:$K,\"=\"&$B32,Stations!$W:$W,\"=No\"),SUMIFS(Stations!L:L,Stations!$J:$J,\"=\"&$A32,Stations!$K:$K,\"=\"&$B32))","v":82},{"$f":"IF($N$1,SUMIFS(Stations!M:M,Stations!$J:$J,\"=\"&$A32,Stations!$K:$K,\"=\"&$B32,Stations!$W:$W,\"=No\"),SUMIFS(Stations!M:M,Stations!$J:$J,\"=\"&$A32,Stations!$K:$K,\"=\"&$B32))","v":60},{"$f":"IF($N$1,SUMIFS(Stations!O:O,Stations!$J:$J,\"=\"&$A32,Stations!$K:$K,\"=\"&$B32,Stations!$W:$W,\"=No\"),SUMIFS(Stations!O:O,Stations!$J:$J,\"=\"&$A32,Stations!$K:$K,\"=\"&$B32))","v":5},{"$f":"IF($N$1,SUMIFS(Stations!Q:Q,Stations!$J:$J,\"=\"&$A32,Stations!$K:$K,\"=\"&$B32,Stations!$W:$W,\"=No\"),SUMIFS(Stations!Q:Q,Stations!$J:$J,\"=\"&$A32,Stations!$K:$K,\"=\"&$B32))","v":65},{"$f":"IF($N$1,SUMIFS(Stations!S:S,Stations!$J:$J,\"=\"&$A32,Stations!$K:$K,\"=\"&$B32,Stations!$W:$W,\"=No\"),SUMIFS(Stations!S:S,Stations!$J:$J,\"=\"&$A32,Stations!$K:$K,\"=\"&$B32))","v":11},{"$f":"IF($N$1,SUMIFS(Stations!U:U,Stations!$J:$J,\"=\"&$A32,Stations!$K:$K,\"=\"&$B32,Stations!$W:$W,\"=No\"),SUMIFS(Stations!U:U,Stations!$J:$J,\"=\"&$A32,Stations!$K:$K,\"=\"&$B32))","v":6}]
["FB","PT","Ferryboat - Purchased Transportation",null,null,{"$f":"IF($N$1,SUMIFS(Stations!L:L,Stations!$J:$J,\"=\"&$A33,Stations!$K:$K,\"=\"&$B33,Stations!$W:$W,\"=No\"),SUMIFS(Stations!L:L,Stations!$J:$J,\"=\"&$A33,Stations!$K:$K,\"=\"&$B33))","v":48},{"$f":"IF($N$1,SUMIFS(Stations!M:M,Stations!$J:$J,\"=\"&$A33,Stations!$K:$K,\"=\"&$B33,Stations!$W:$W,\"=No\"),SUMIFS(Stations!M:M,Stations!$J:$J,\"=\"&$A33,Stations!$K:$K,\"=\"&$B33))","v":51},{"$f":"IF($N$1,SUMIFS(Stations!O:O,Stations!$J:$J,\"=\"&$A33,Stations!$K:$K,\"=\"&$B33,Stations!$W:$W,\"=No\"),SUMIFS(Stations!O:O,Stations!$J:$J,\"=\"&$A33,Stations!$K:$K,\"=\"&$B33))","v":9},{"$f":"IF($N$1,SUMIFS(Stations!Q:Q,Stations!$J:$J,\"=\"&$A33,Stations!$K:$K,\"=\"&$B33,Stations!$W:$W,\"=No\"),SUMIFS(Stations!Q:Q,Stations!$J:$J,\"=\"&$A33,Stations!$K:$K,\"=\"&$B33))","v":60},{"$f":"IF($N$1,SUMIFS(Stations!S:S,Stations!$J:$J,\"=\"&$A33,Stations!$K:$K,\"=\"&$B33,Stations!$W:$W,\"=No\"),SUMIFS(Stations!S:S,Stations!$J:$J,\"=\"&$A33,Stations!$K:$K,\"=\"&$B33))","v":7},{"$f":"IF($N$1,SUMIFS(Stations!U:U,Stations!$J:$J,\"=\"&$A33,Stations!$K:$K,\"=\"&$B33,Stations!$W:$W,\"=No\"),SUMIFS(Stations!U:U,Stations!$J:$J,\"=\"&$A33,Stations!$K:$K,\"=\"&$B33))","v":0}]
["HR","DO","Heavy Rail - Directly Operated",null,null,{"$f":"IF($N$1,SUMIFS(Stations!L:L,Stations!$J:$J,\"=\"&$A34,Stations!$K:$K,\"=\"&$B34,Stations!$W:$W,\"=No\"),SUMIFS(Stations!L:L,Stations!$J:$J,\"=\"&$A34,Stations!$K:$K,\"=\"&$B34))","v":9435},{"$f":"IF($N$1,SUMIFS(Stations!M:M,Stations!$J:$J,\"=\"&$A34,Stations!$K:$K,\"=\"&$B34,Stations!$W:$W,\"=No\"),SUMIFS(Stations!M:M,Stations!$J:$J,\"=\"&$A34,Stations!$K:$K,\"=\"&$B34))","v":558},{"$f":"IF($N$1,SUMIFS(Stations!O:O,Stations!$J:$J,\"=\"&$A34,Stations!$K:$K,\"=\"&$B34,Stations!$W:$W,\"=No\"),SUMIFS(Stations!O:O,Stations!$J:$J,\"=\"&$A34,Stations!$K:$K,\"=\"&$B34))","v":477},{"$f":"IF($N$1,SUMIFS(Stations!Q:Q,Stations!$J:$J,\"=\"&$A34,Stations!$K:$K,\"=\"&$B34,Stations!$W:$W,\"=No\"),SUMIFS(Stations!Q:Q,Stations!$J:$J,\"=\"&$A34,Stations!$K:$K,\"=\"&$B34))","v":1035},{"$f":"IF($N$1,SUMIFS(Stations!S:S,Stations!$J:$J,\"=\"&$A34,Stations!$K:$K,\"=\"&$B34,Stations!$W:$W,\"=No\"),SUMIFS(Stations!S:S,Stations!$J:$J,\"=\"&$A34,Stations!$K:$K,\"=\"&$B34))","v":1311},{"$f":"IF($N$1,SUMIFS(Stations!U:U,Stations!$J:$J,\"=\"&$A34,Stations!$K:$K,\"=\"&$B34,Stations!$W:$W,\"=No\"),SUMIFS(Stations!U:U,Stations!$J:$J,\"=\"&$A34,Stations!$K:$K,\"=\"&$B34))","v":1804}]
["HR","PT","Heavy Rail - Purchased Transportation",null,null,{"$f":"IF($N$1,SUMIFS(Stations!L:L,Stations!$J:$J,\"=\"&$A35,Stations!$K:$K,\"=\"&$B35,Stations!$W:$W,\"=No\"),SUMIFS(Stations!L:L,Stations!$J:$J,\"=\"&$A35,Stations!$K:$K,\"=\"&$B35))","v":32},{"$f":"IF($N$1,SUMIFS(Stations!M:M,Stations!$J:$J,\"=\"&$A35,Stations!$K:$K,\"=\"&$B35,Stations!$W:$W,\"=No\"),SUMIFS(Stations!M:M,Stations!$J:$J,\"=\"&$A35,Stations!$K:$K,\"=\"&$B35))","v":16},{"$f":"IF($N$1,SUMIFS(Stations!O:O,Stations!$J:$J,\"=\"&$A35,Stations!$K:$K,\"=\"&$B35,Stations!$W:$W,\"=No\"),SUMIFS(Stations!O:O,Stations!$J:$J,\"=\"&$A35,Stations!$K:$K,\"=\"&$B35))","v":0},{"$f":"IF($N$1,SUMIFS(Stations!Q:Q,Stations!$J:$J,\"=\"&$A35,Stations!$K:$K,\"=\"&$B35,Stations!$W:$W,\"=No\"),SUMIFS(Stations!Q:Q,Stations!$J:$J,\"=\"&$A35,Stations!$K:$K,\"=\"&$B35))","v":16},{"$f":"IF($N$1,SUMIFS(Stations!S:S,Stations!$J:$J,\"=\"&$A35,Stations!$K:$K,\"=\"&$B35,Stations!$W:$W,\"=No\"),SUMIFS(Stations!S:S,Stations!$J:$J,\"=\"&$A35,Stations!$K:$K,\"=\"&$B35))","v":33},{"$f":"IF($N$1,SUMIFS(Stations!U:U,Stations!$J:$J,\"=\"&$A35,Stations!$K:$K,\"=\"&$B35,Stations!$W:$W,\"=No\"),SUMIFS(Stations!U:U,Stations!$J:$J,\"=\"&$A35,Stations!$K:$K,\"=\"&$B35))","v":51}]
["YR","PT","Hybrid Rail - Purchased Transportation",null,null,{"$f":"IF($N$1,SUMIFS(Stations!L:L,Stations!$J:$J,\"=\"&$A36,Stations!$K:$K,\"=\"&$B36,Stations!$W:$W,\"=No\"),SUMIFS(Stations!L:L,Stations!$J:$J,\"=\"&$A36,Stations!$K:$K,\"=\"&$B36))","v":40},{"$f":"IF($N$1,SUMIFS(Stations!M:M,Stations!$J:$J,\"=\"&$A36,Stations!$K:$K,\"=\"&$B36,Stations!$W:$W,\"=No\"),SUMIFS(Stations!M:M,Stations!$J:$J,\"=\"&$A36,Stations!$K:$K,\"=\"&$B36))","v":55},{"$f":"IF($N$1,SUMIFS(Stations!O:O,Stations!$J:$J,\"=\"&$A36,Stations!$K:$K,\"=\"&$B36,Stations!$W:$W,\"=No\"),SUMIFS(Stations!O:O,Stations!$J:$J,\"=\"&$A36,Stations!$K:$K,\"=\"&$B36))","v":0},{"$f":"IF($N$1,SUMIFS(Stations!Q:Q,Stations!$J:$J,\"=\"&$A36,Stations!$K:$K,\"=\"&$B36,Stations!$W:$W,\"=No\"),SUMIFS(Stations!Q:Q,Stations!$J:$J,\"=\"&$A36,Stations!$K:$K,\"=\"&$B36))","v":55},{"$f":"IF($N$1,SUMIFS(Stations!S:S,Stations!$J:$J,\"=\"&$A36,Stations!$K:$K,\"=\"&$B36,Stations!$W:$W,\"=No\"),SUMIFS(Stations!S:S,Stations!$J:$J,\"=\"&$A36,Stations!$K:$K,\"=\"&$B36))","v":1},{"$f":"IF($N$1,SUMIFS(Stations!U:U,Stations!$J:$J,\"=\"&$A36,Stations!$K:$K,\"=\"&$B36,Stations!$W:$W,\"=No\"),SUMIFS(Stations!U:U,Stations!$J:$J,\"=\"&$A36,Stations!$K:$K,\"=\"&$B36))","v":0}]
["IP","DO","Inclined Plane - Directly Operated",null,null,{"$f":"IF($N$1,SUMIFS(Stations!L:L,Stations!$J:$J,\"=\"&$A37,Stations!$K:$K,\"=\"&$B37,Stations!$W:$W,\"=No\"),SUMIFS(Stations!L:L,Stations!$J:$J,\"=\"&$A37,Stations!$K:$K,\"=\"&$B37))","v":6},{"$f":"IF($N$1,SUMIFS(Stations!M:M,Stations!$J:$J,\"=\"&$A37,Stations!$K:$K,\"=\"&$B37,Stations!$W:$W,\"=No\"),SUMIFS(Stations!M:M,Stations!$J:$J,\"=\"&$A37,Stations!$K:$K,\"=\"&$B37))","v":6},{"$f":"IF($N$1,SUMIFS(Stations!O:O,Stations!$J:$J,\"=\"&$A37,Stations!$K:$K,\"=\"&$B37,Stations!$W:$W,\"=No\"),SUMIFS(Stations!O:O,Stations!$J:$J,\"=\"&$A37,Stations!$K:$K,\"=\"&$B37))","v":0},{"$f":"IF($N$1,SUMIFS(Stations!Q:Q,Stations!$J:$J,\"=\"&$A37,Stations!$K:$K,\"=\"&$B37,Stations!$W:$W,\"=No\"),SUMIFS(Stations!Q:Q,Stations!$J:$J,\"=\"&$A37,Stations!$K:$K,\"=\"&$B37))","v":6},{"$f":"IF($N$1,SUMIFS(Stations!S:S,Stations!$J:$J,\"=\"&$A37,Stations!$K:$K,\"=\"&$B37,Stations!$W:$W,\"=No\"),SUMIFS(Stations!S:S,Stations!$J:$J,\"=\"&$A37,Stations!$K:$K,\"=\"&$B37))","v":3},{"$f":"IF($N$1,SUMIFS(Stations!U:U,Stations!$J:$J,\"=\"&$A37,Stations!$K:$K,\"=\"&$B37,Stations!$W:$W,\"=No\"),SUMIFS(Stations!U:U,Stations!$J:$J,\"=\"&$A37,Stations!$K:$K,\"=\"&$B37))","v":0}]
["LR","DO","Light Rail - Directly Operated",null,null,{"$f":"IF($N$1,SUMIFS(Stations!L:L,Stations!$J:$J,\"=\"&$A38,Stations!$K:$K,\"=\"&$B38,Stations!$W:$W,\"=No\"),SUMIFS(Stations!L:L,Stations!$J:$J,\"=\"&$A38,Stations!$K:$K,\"=\"&$B38))","v":1522},{"$f":"IF($N$1,SUMIFS(Stations!M:M,Stations!$J:$J,\"=\"&$A38,Stations!$K:$K,\"=\"&$B38,Stations!$W:$W,\"=No\"),SUMIFS(Stations!M:M,Stations!$J:$J,\"=\"&$A38,Stations!$K:$K,\"=\"&$B38))","v":743},{"$f":"IF($N$1,SUMIFS(Stations!O:O,Stations!$J:$J,\"=\"&$A38,Stations!$K:$K,\"=\"&$B38,Stations!$W:$W,\"=No\"),SUMIFS(Stations!O:O,Stations!$J:$J,\"=\"&$A38,Stations!$K:$K,\"=\"&$B38))","v":64},{"$f":"IF($N$1,SUMIFS(Stations!Q:Q,Stations!$J:$J,\"=\"&$A38,Stations!$K:$K,\"=\"&$B38,Stations!$W:$W,\"=No\"),SUMIFS(Stations!Q:Q,Stations!$J:$J,\"=\"&$A38,Stations!$K:$K,\"=\"&$B38))","v":807},{"$f":"IF($N$1,SUMIFS(Stations!S:S,Stations!$J:$J,\"=\"&$A38,Stations!$K:$K,\"=\"&$B38,Stations!$W:$W,\"=No\"),SUMIFS(Stations!S:S,Stations!$J:$J,\"=\"&$A38,Stations!$K:$K,\"=\"&$B38))","v":380},{"$f":"IF($N$1,SUMIFS(Stations!U:U,Stations!$J:$J,\"=\"&$A38,Stations!$K:$K,\"=\"&$B38,Stations!$W:$W,\"=No\"),SUMIFS(Stations!U:U,Stations!$J:$J,\"=\"&$A38,Stations!$K:$K,\"=\"&$B38))","v":242}]
["LR","PT","Light Rail - Purchased Transportation",null,null,{"$f":"IF($N$1,SUMIFS(Stations!L:L,Stations!$J:$J,\"=\"&$A39,Stations!$K:$K,\"=\"&$B39,Stations!$W:$W,\"=No\"),SUMIFS(Stations!L:L,Stations!$J:$J,\"=\"&$A39,Stations!$K:$K,\"=\"&$B39))","v":80},{"$f":"IF($N$1,SUMIFS(Stations!M:M,Stations!$J:$J,\"=\"&$A39,Stations!$K:$K,\"=\"&$B39,Stations!$W:$W,\"=No\"),SUMIFS(Stations!M:M,Stations!$J:$J,\"=\"&$A39,Stations!$K:$K,\"=\"&$B39))","v":64},{"$f":"IF($N$1,SUMIFS(Stations!O:O,Stations!$J:$J,\"=\"&$A39,Stations!$K:$K,\"=\"&$B39,Stations!$W:$W,\"=No\"),SUMIFS(Stations!O:O,Stations!$J:$J,\"=\"&$A39,Stations!$K:$K,\"=\"&$B39))","v":0},{"$f":"IF($N$1,SUMIFS(Stations!Q:Q,Stations!$J:$J,\"=\"&$A39,Stations!$K:$K,\"=\"&$B39,Stations!$W:$W,\"=No\"),SUMIFS(Stations!Q:Q,Stations!$J:$J,\"=\"&$A39,Stations!$K:$K,\"=\"&$B39))","v":64},{"$f":"IF($N$1,SUMIFS(Stations!S:S,Stations!$J:$J,\"=\"&$A39,Stations!$K:$K,\"=\"&$B39,Stations!$W:$W,\"=No\"),SUMIFS(Stations!S:S,Stations!$J:$J,\"=\"&$A39,Stations!$K:$K,\"=\"&$B39))","v":16},{"$f":"IF($N$1,SUMIFS(Stations!U:U,Stations!$J:$J,\"=\"&$A39,Stations!$K:$K,\"=\"&$B39,Stations!$W:$W,\"=No\"),SUMIFS(Stations!U:U,Stations!$J:$J,\"=\"&$A39,Stations!$K:$K,\"=\"&$B39))","v":1}]
["MG","DO","Monorail/Automated Guideway - Directly Operated",null,null,{"$f":"IF($N$1,SUMIFS(Stations!L:L,Stations!$J:$J,\"=\"&$A40,Stations!$K:$K,\"=\"&$B40,Stations!$W:$W,\"=No\"),SUMIFS(Stations!L:L,Stations!$J:$J,\"=\"&$A40,Stations!$K:$K,\"=\"&$B40))","v":110},{"$f":"IF($N$1,SUMIFS(Stations!M:M,Stations!$J:$J,\"=\"&$A40,Stations!$K:$K,\"=\"&$B40,Stations!$W:$W,\"=No\"),SUMIFS(Stations!M:M,Stations!$J:$J,\"=\"&$A40,Stations!$K:$K,\"=\"&$B40))","v":56},{"$f":"IF($N$1,SUMIFS(Stations!O:O,Stations!$J:$J,\"=\"&$A40,Stations!$K:$K,\"=\"&$B40,Stations!$W:$W,\"=No\"),SUMIFS(Stations!O:O,Stations!$J:$J,\"=\"&$A40,Stations!$K:$K,\"=\"&$B40))","v":0},{"$f":"IF($N$1,SUMIFS(Stations!Q:Q,Stations!$J:$J,\"=\"&$A40,Stations!$K:$K,\"=\"&$B40,Stations!$W:$W,\"=No\"),SUMIFS(Stations!Q:Q,Stations!$J:$J,\"=\"&$A40,Stations!$K:$K,\"=\"&$B40))","v":56},{"$f":"IF($N$1,SUMIFS(Stations!S:S,Stations!$J:$J,\"=\"&$A40,Stations!$K:$K,\"=\"&$B40,Stations!$W:$W,\"=No\"),SUMIFS(Stations!S:S,Stations!$J:$J,\"=\"&$A40,Stations!$K:$K,\"=\"&$B40))","v":69},{"$f":"IF($N$1,SUMIFS(Stations!U:U,Stations!$J:$J,\"=\"&$A40,Stations!$K:$K,\"=\"&$B40,Stations!$W:$W,\"=No\"),SUMIFS(Stations!U:U,Stations!$J:$J,\"=\"&$A40,Stations!$K:$K,\"=\"&$B40))","v":60}]
["MG","PT","Monorail/Automated Guideway - Purchased Transportation",null,null,{"$f":"IF($N$1,SUMIFS(Stations!L:L,Stations!$J:$J,\"=\"&$A41,Stations!$K:$K,\"=\"&$B41,Stations!$W:$W,\"=No\"),SUMIFS(Stations!L:L,Stations!$J:$J,\"=\"&$A41,Stations!$K:$K,\"=\"&$B41))","v":12},{"$f":"IF($N$1,SUMIFS(Stations!M:M,Stations!$J:$J,\"=\"&$A41,Stations!$K:$K,\"=\"&$B41,Stations!$W:$W,\"=No\"),SUMIFS(Stations!M:M,Stations!$J:$J,\"=\"&$A41,Stations!$K:$K,\"=\"&$B41))","v":4},{"$f":"IF($N$1,SUMIFS(Stations!O:O,Stations!$J:$J,\"=\"&$A41,Stations!$K:$K,\"=\"&$B41,Stations!$W:$W,\"=No\"),SUMIFS(Stations!O:O,Stations!$J:$J,\"=\"&$A41,Stations!$K:$K,\"=\"&$B41))","v":0},{"$f":"IF($N$1,SUMIFS(Stations!Q:Q,Stations!$J:$J,\"=\"&$A41,Stations!$K:$K,\"=\"&$B41,Stations!$W:$W,\"=No\"),SUMIFS(Stations!Q:Q,Stations!$J:$J,\"=\"&$A41,Stations!$K:$K,\"=\"&$B41))","v":4},{"$f":"IF($N$1,SUMIFS(Stations!S:S,Stations!$J:$J,\"=\"&$A41,Stations!$K:$K,\"=\"&$B41,Stations!$W:$W,\"=No\"),SUMIFS(Stations!S:S,Stations!$J:$J,\"=\"&$A41,Stations!$K:$K,\"=\"&$B41))","v":3},{"$f":"IF($N$1,SUMIFS(Stations!U:U,Stations!$J:$J,\"=\"&$A41,Stations!$K:$K,\"=\"&$B41,Stations!$W:$W,\"=No\"),SUMIFS(Stations!U:U,Stations!$J:$J,\"=\"&$A41,Stations!$K:$K,\"=\"&$B41))","v":4}]
["SR","DO","Street Car Rail - Directly Operated",null,null,{"$f":"IF($N$1,SUMIFS(Stations!L:L,Stations!$J:$J,\"=\"&$A42,Stations!$K:$K,\"=\"&$B42,Stations!$W:$W,\"=No\"),SUMIFS(Stations!L:L,Stations!$J:$J,\"=\"&$A42,Stations!$K:$K,\"=\"&$B42))","v":180},{"$f":"IF($N$1,SUMIFS(Stations!M:M,Stations!$J:$J,\"=\"&$A42,Stations!$K:$K,\"=\"&$B42,Stations!$W:$W,\"=No\"),SUMIFS(Stations!M:M,Stations!$J:$J,\"=\"&$A42,Stations!$K:$K,\"=\"&$B42))","v":50},{"$f":"IF($N$1,SUMIFS(Stations!O:O,Stations!$J:$J,\"=\"&$A42,Stations!$K:$K,\"=\"&$B42,Stations!$W:$W,\"=No\"),SUMIFS(Stations!O:O,Stations!$J:$J,\"=\"&$A42,Stations!$K:$K,\"=\"&$B42))","v":46},{"$f":"IF($N$1,SUMIFS(Stations!Q:Q,Stations!$J:$J,\"=\"&$A42,Stations!$K:$K,\"=\"&$B42,Stations!$W:$W,\"=No\"),SUMIFS(Stations!Q:Q,Stations!$J:$J,\"=\"&$A42,Stations!$K:$K,\"=\"&$B42))","v":96},{"$f":"IF($N$1,SUMIFS(Stations!S:S,Stations!$J:$J,\"=\"&$A42,Stations!$K:$K,\"=\"&$B42,Stations!$W:$W,\"=No\"),SUMIFS(Stations!S:S,Stations!$J:$J,\"=\"&$A42,Stations!$K:$K,\"=\"&$B42))","v":4},{"$f":"IF($N$1,SUMIFS(Stations!U:U,Stations!$J:$J,\"=\"&$A42,Stations!$K:$K,\"=\"&$B42,Stations!$W:$W,\"=No\"),SUMIFS(Stations!U:U,Stations!$J:$J,\"=\"&$A42,Stations!$K:$K,\"=\"&$B42))","v":1}]
["SR","PT","Street Car Rail - Purchased Transportation",null,null,{"$f":"IF($N$1,SUMIFS(Stations!L:L,Stations!$J:$J,\"=\"&$A43,Stations!$K:$K,\"=\"&$B43,Stations!$W:$W,\"=No\"),SUMIFS(Stations!L:L,Stations!$J:$J,\"=\"&$A43,Stations!$K:$K,\"=\"&$B43))","v":53},{"$f":"IF($N$1,SUMIFS(Stations!M:M,Stations!$J:$J,\"=\"&$A43,Stations!$K:$K,\"=\"&$B43,Stations!$W:$W,\"=No\"),SUMIFS(Stations!M:M,Stations!$J:$J,\"=\"&$A43,Stations!$K:$K,\"=\"&$B43))","v":36},{"$f":"IF($N$1,SUMIFS(Stations!O:O,Stations!$J:$J,\"=\"&$A43,Stations!$K:$K,\"=\"&$B43,Stations!$W:$W,\"=No\"),SUMIFS(Stations!O:O,Stations!$J:$J,\"=\"&$A43,Stations!$K:$K,\"=\"&$B43))","v":0},{"$f":"IF($N$1,SUMIFS(Stations!Q:Q,Stations!$J:$J,\"=\"&$A43,Stations!$K:$K,\"=\"&$B43,Stations!$W:$W,\"=No\"),SUMIFS(Stations!Q:Q,Stations!$J:$J,\"=\"&$A43,Stations!$K:$K,\"=\"&$B43))","v":36},{"$f":"IF($N$1,SUMIFS(Stations!S:S,Stations!$J:$J,\"=\"&$A43,Stations!$K:$K,\"=\"&$B43,Stations!$W:$W,\"=No\"),SUMIFS(Stations!S:S,Stations!$J:$J,\"=\"&$A43,Stations!$K:$K,\"=\"&$B43))","v":0},{"$f":"IF($N$1,SUMIFS(Stations!U:U,Stations!$J:$J,\"=\"&$A43,Stations!$K:$K,\"=\"&$B43,Stations!$W:$W,\"=No\"),SUMIFS(Stations!U:U,Stations!$J:$J,\"=\"&$A43,Stations!$K:$K,\"=\"&$B43))","v":0}]
["TB","DO","Trolleybus - Directly Operated",null,null,{"$f":"IF($N$1,SUMIFS(Stations!L:L,Stations!$J:$J,\"=\"&$A44,Stations!$K:$K,\"=\"&$B44,Stations!$W:$W,\"=No\"),SUMIFS(Stations!L:L,Stations!$J:$J,\"=\"&$A44,Stations!$K:$K,\"=\"&$B44))","v":412},{"$f":"IF($N$1,SUMIFS(Stations!M:M,Stations!$J:$J,\"=\"&$A44,Stations!$K:$K,\"=\"&$B44,Stations!$W:$W,\"=No\"),SUMIFS(Stations!M:M,Stations!$J:$J,\"=\"&$A44,Stations!$K:$K,\"=\"&$B44))","v":5},{"$f":"IF($N$1,SUMIFS(Stations!O:O,Stations!$J:$J,\"=\"&$A44,Stations!$K:$K,\"=\"&$B44,Stations!$W:$W,\"=No\"),SUMIFS(Stations!O:O,Stations!$J:$J,\"=\"&$A44,Stations!$K:$K,\"=\"&$B44))","v":0},{"$f":"IF($N$1,SUMIFS(Stations!Q:Q,Stations!$J:$J,\"=\"&$A44,Stations!$K:$K,\"=\"&$B44,Stations!$W:$W,\"=No\"),SUMIFS(Stations!Q:Q,Stations!$J:$J,\"=\"&$A44,Stations!$K:$K,\"=\"&$B44))","v":5},{"$f":"IF($N$1,SUMIFS(Stations!S:S,Stations!$J:$J,\"=\"&$A44,Stations!$K:$K,\"=\"&$B44,Stations!$W:$W,\"=No\"),SUMIFS(Stations!S:S,Stations!$J:$J,\"=\"&$A44,Stations!$K:$K,\"=\"&$B44))","v":0},{"$f":"IF($N$1,SUMIFS(Stations!U:U,Stations!$J:$J,\"=\"&$A44,Stations!$K:$K,\"=\"&$B44,Stations!$W:$W,\"=No\"),SUMIFS(Stations!U:U,Stations!$J:$J,\"=\"&$A44,Stations!$K:$K,\"=\"&$B44))","v":0}]
[]
["By Agency Size (Vehicles)"]
[null,null,null,"enter bins below","Column1","VOMS","ADA Accessible","Non-ADA Accessible","Total Stations","Elevators","Escalators"]
["Under",{"$f":"D48","v":10},null,10,{"$f":"IFERROR(IF(A48=\"Between\",A48&\" \"&FIXED(B48,0,0)&\" \"&C48&\" \"&FIXED(D48,0,0),A48&\" \"&FIXED(B48,0,0)),\"invalid bin\")","v":"Under 10"},{"$f":"IF($N$1,SUMIFS(Stations!L:L,Stations!$I:$I,\"<\"&$D48,Stations!$W:$W,\"=No\"),SUMIFS(Stations!L:L,Stations!$I:$I,\"<\"&$D48))","v":695},{"$f":"IF($N$1,SUMIFS(Stations!M:M,Stations!$I:$I,\"<\"&$D48,Stations!$W:$W,\"=No\"),SUMIFS(Stations!M:M,Stations!$I:$I,\"<\"&$D48))","v":92},{"$f":"IF($N$1,SUMIFS(Stations!O:O,Stations!$I:$I,\"<\"&$D48,Stations!$W:$W,\"=No\"),SUMIFS(Stations!O:O,Stations!$I:$I,\"<\"&$D48))","v":4},{"$f":"IF($N$1,SUMIFS(Stations!Q:Q,Stations!$I:$I,\"<\"&$D48,Stations!$W:$W,\"=No\"),SUMIFS(Stations!Q:Q,Stations!$I:$I,\"<\"&$D48))","v":96},{"$f":"IF($N$1,SUMIFS(Stations!S:S,Stations!$I:$I,\"<\"&$D48,Stations!$W:$W,\"=No\"),SUMIFS(Stations!S:S,Stations!$I:$I,\"<\"&$D48))","v":17},{"$f":"IF($N$1,SUMIFS(Stations!U:U,Stations!$I:$I,\"<\"&$D48,Stations!$W:$W,\"=No\"),SUMIFS(Stations!U:U,Stations!$I:$I,\"<\"&$D48))","v":2}]
[{"$f":"IF(D49<>\"\",\"Between\",\"Over\")","v":"Between"},{"$f":"D48","v":10},{"$f":"IF(D49<>\"\",\"and\",\"\")","v":"and"},25,"Between 10 and 25",{"$f":"IF($N$1,IF($A49=\"Between\",SUMIFS(Stations!L:L,Stations!$I:$I,\">=\"&$B49,Stations!$I:$I,\"<\"&$D49,Stations!$W:$W,\"=No\"),SUMIFS(Stations!L:L,Stations!$I:$I,\">=\"&$B49,Stations!$W:$W,\"=No\")),IF($A49=\"Between\",SUMIFS(Stations!L:L,Stations!$I:$I,\">=\"&$B49,Stations!$I:$I,\"<\"&$D49),SUMIFS(Stations!L:L,Stations!$I:$I,\">=\"&$B49)))","v":2300},{"$f":"IF($N$1,IF($A49=\"Between\",SUMIFS(Stations!M:M,Stations!$I:$I,\">=\"&$B49,Stations!$I:$I,\"<\"&$D49,Stations!$W:$W,\"=No\"),SUMIFS(Stations!M:M,Stations!$I:$I,\">=\"&$B49,Stations!$W:$W,\"=No\")),IF($A49=\"Between\",SUMIFS(Stations!M:M,Stations!$I:$I,\">=\"&$B49,Stations!$I:$I,\"<\"&$D49),SUMIFS(Stations!M:M,Stations!$I:$I,\">=\"&$B49)))","v":249},{"$f":"IF($N$1,IF($A49=\"Between\",SUMIFS(Stations!O:O,Stations!$I:$I,\">=\"&$B49,Stations!$I:$I,\"<\"&$D49,Stations!$W:$W,\"=No\"),SUMIFS(Stations!O:O,Stations!$I:$I,\">=\"&$B49,Stations!$W:$W,\"=No\")),IF($A49=\"Between\",SUMIFS(Stations!O:O,Stations!$I:$I,\">=\"&$B49,Stations!$I:$I,\"<\"&$D49),SUMIFS(Stations!O:O,Stations!$I:$I,\">=\"&$B49)))","v":8},{"$f":"IF($N$1,IF($A49=\"Between\",SUMIFS(Stations!Q:Q,Stations!$I:$I,\">=\"&$B49,Stations!$I:$I,\"<\"&$D49,Stations!$W:$W,\"=No\"),SUMIFS(Stations!Q:Q,Stations!$I:$I,\">=\"&$B49,Stations!$W:$W,\"=No\")),IF($A49=\"Between\",SUMIFS(Stations!Q:Q,Stations!$I:$I,\">=\"&$B49,Stations!$I:$I,\"<\"&$D49),SUMIFS(Stations!Q:Q,Stations!$I:$I,\">=\"&$B49)))","v":257},{"$f":"IF($N$1,IF($A49=\"Between\",SUMIFS(Stations!S:S,Stations!$I:$I,\">=\"&$B49,Stations!$I:$I,\"<\"&$D49,Stations!$W:$W,\"=No\"),SUMIFS(Stations!S:S,Stations!$I:$I,\">=\"&$B49,Stations!$W:$W,\"=No\")),IF($A49=\"Between\",SUMIFS(Stations!S:S,Stations!$I:$I,\">=\"&$B49,Stations!$I:$I,\"<\"&$D49),SUMIFS(Stations!S:S,Stations!$I:$I,\">=\"&$B49)))","v":78},{"$f":"IF($N$1,IF($A49=\"Between\",SUMIFS(Stations!U:U,Stations!$I:$I,\">=\"&$B49,Stations!$I:$I,\"<\"&$D49,Stations!$W:$W,\"=No\"),SUMIFS(Stations!U:U,Stations!$I:$I,\">=\"&$B49,Stations!$W:$W,\"=No\")),IF($A49=\"Between\",SUMIFS(Stations!U:U,Stations!$I:$I,\">=\"&$B49,Stations!$I:$I,\"<\"&$D49),SUMIFS(Stations!U:U,Stations!$I:$I,\">=\"&$B49)))","v":33}]
[{"$f":"IF(OR(A49=\"Over\",A49=\"\"),\"\",IF(D50=\"\",\"Over\",\"Between\"))","v":"Between"},{"$f":"IF(D49=\"\",\"\",D49)","v":25},{"$f":"IF(D50<>\"\",\"and\",\"\")","v":"and"},50,"Between 25 and 50",{"$f":"IF($N$1,IF($A50=\"\",\"\",IF($A50=\"Between\",SUMIFS(Stations!L:L,Stations!$I:$I,\">=\"&$B50,Stations!$I:$I,\"<\"&$D50,Stations!$W:$W,\"=No\"),SUMIFS(Stations!L:L,Stations!$I:$I,\">=\"&$B50,Stations!$W:$W,\"=No\"))),IF($A50=\"\",\"\",IF($A50=\"Between\",SUMIFS(Stations!L:L,Stations!$I:$I,\">=\"&$B50,Stations!$I:$I,\"<\"&$D50),SUMIFS(Stations!L:L,Stations!$I:$I,\">=\"&$B50))))","v":3467},{"$f":"IF($N$1,IF($A50=\"\",\"\",IF($A50=\"Between\",SUMIFS(Stations!M:M,Stations!$I:$I,\">=\"&$B50,Stations!$I:$I,\"<\"&$D50,Stations!$W:$W,\"=No\"),SUMIFS(Stations!M:M,Stations!$I:$I,\">=\"&$B50,Stations!$W:$W,\"=No\"))),IF($A50=\"\",\"\",IF($A50=\"Between\",SUMIFS(Stations!M:M,Stations!$I:$I,\">=\"&$B50,Stations!$I:$I,\"<\"&$D50),SUMIFS(Stations!M:M,Stations!$I:$I,\">=\"&$B50))))","v":275},{"$f":"IF($N$1,IF($A50=\"\",\"\",IF($A50=\"Between\",SUMIFS(Stations!O:O,Stations!$I:$I,\">=\"&$B50,Stations!$I:$I,\"<\"&$D50,Stations!$W:$W,\"=No\"),SUMIFS(Stations!O:O,Stations!$I:$I,\">=\"&$B50,Stations!$W:$W,\"=No\"))),IF($A50=\"\",\"\",IF($A50=\"Between\",SUMIFS(Stations!O:O,Stations!$I:$I,\">=\"&$B50,Stations!$I:$I,\"<\"&$D50),SUMIFS(Stations!O:O,Stations!$I:$I,\">=\"&$B50))))","v":28},{"$f":"IF($N$1,IF($A50=\"\",\"\",IF($A50=\"Between\",SUMIFS(Stations!Q:Q,Stations!$I:$I,\">=\"&$B50,Stations!$I:$I,\"<\"&$D50,Stations!$W:$W,\"=No\"),SUMIFS(Stations!Q:Q,Stations!$I:$I,\">=\"&$B50,Stations!$W:$W,\"=No\"))),IF($A50=\"\",\"\",IF($A50=\"Between\",SUMIFS(Stations!Q:Q,Stations!$I:$I,\">=\"&$B50,Stations!$I:$I,\"<\"&$D50),SUMIFS(Stations!Q:Q,Stations!$I:$I,\">=\"&$B50))))","v":303},{"$f":"IF($N$1,IF($A50=\"\",\"\",IF($A50=\"Between\",SUMIFS(Stations!S:S,Stations!$I:$I,\">=\"&$B50,Stations!$I:$I,\"<\"&$D50,Stations!$W:$W,\"=No\"),SUMIFS(Stations!S:S,Stations!$I:$I,\">=\"&$B50,Stations!$W:$W,\"=No\"))),IF($A50=\"\",\"\",IF($A50=\"Between\",SUMIFS(Stations!S:S,Stations!$I:$I,\">=\"&$B50,Stations!$I:$I,\"<\"&$D50),SUMIFS(Stations!S:S,Stations!$I:$I,\">=\"&$B50))))","v":97},{"$f":"IF($N$1,IF($A50=\"\",\"\",IF($A50=\"Between\",SUMIFS(Stations!U:U,Stations!$I:$I,\">=\"&$B50,Stations!$I:$I,\"<\"&$D50,Stations!$W:$W,\"=No\"),SUMIFS(Stations!U:U,Stations!$I:$I,\">=\"&$B50,Stations!$W:$W,\"=No\"))),IF($A50=\"\",\"\",IF($A50=\"Between\",SUMIFS(Stations!U:U,Stations!$I:$I,\">=\"&$B50,Stations!$I:$I,\"<\"&$D50),SUMIFS(Stations!U:U,Stations!$I:$I,\">=\"&$B50))))","v":34}]
["Between",50,{"$f":"IF(D51<>\"\",\"and\",\"\")","v":"and"},100,"Between 50 and 100",{"$f":"IF($N$1,IF($A51=\"\",\"\",IF($A51=\"Between\",SUMIFS(Stations!L:L,Stations!$I:$I,\">=\"&$B51,Stations!$I:$I,\"<\"&$D51,Stations!$W:$W,\"=No\"),SUMIFS(Stations!L:L,Stations!$I:$I,\">=\"&$B51,Stations!$W:$W,\"=No\"))),IF($A51=\"\",\"\",IF($A51=\"Between\",SUMIFS(Stations!L:L,Stations!$I:$I,\">=\"&$B51,Stations!$I:$I,\"<\"&$D51),SUMIFS(Stations!L:L,Stations!$I:$I,\">=\"&$B51))))","v":5113},{"$f":"IF($N$1,IF($A51=\"\",\"\",IF($A51=\"Between\",SUMIFS(Stations!M:M,Stations!$I:$I,\">=\"&$B51,Stations!$I:$I,\"<\"&$D51,Stations!$W:$W,\"=No\"),SUMIFS(Stations!M:M,Stations!$I:$I,\">=\"&$B51,Stations!$W:$W,\"=No\"))),IF($A51=\"\",\"\",IF($A51=\"Between\",SUMIFS(Stations!M:M,Stations!$I:$I,\">=\"&$B51,Stations!$I:$I,\"<\"&$D51),SUMIFS(Stations!M:M,Stations!$I:$I,\">=\"&$B51))))","v":304},{"$f":"IF($N$1,IF($A51=\"\",\"\",IF($A51=\"Between\",SUMIFS(Stations!O:O,Stations!$I:$I,\">=\"&$B51,Stations!$I:$I,\"<\"&$D51,Stations!$W:$W,\"=No\"),SUMIFS(Stations!O:O,Stations!$I:$I,\">=\"&$B51,Stations!$W:$W,\"=No\"))),IF($A51=\"\",\"\",IF($A51=\"Between\",SUMIFS(Stations!O:O,Stations!$I:$I,\">=\"&$B51,Stations!$I:$I,\"<\"&$D51),SUMIFS(Stations!O:O,Stations!$I:$I,\">=\"&$B51))))","v":12},{"$f":"IF($N$1,IF($A51=\"\",\"\",IF($A51=\"Between\",SUMIFS(Stations!Q:Q,Stations!$I:$I,\">=\"&$B51,Stations!$I:$I,\"<\"&$D51,Stations!$W:$W,\"=No\"),SUMIFS(Stations!Q:Q,Stations!$I:$I,\">=\"&$B51,Stations!$W:$W,\"=No\"))),IF($A51=\"\",\"\",IF($A51=\"Between\",SUMIFS(Stations!Q:Q,Stations!$I:$I,\">=\"&$B51,Stations!$I:$I,\"<\"&$D51),SUMIFS(Stations!Q:Q,Stations!$I:$I,\">=\"&$B51))))","v":316},{"$f":"IF($N$1,IF($A51=\"\",\"\",IF($A51=\"Between\",SUMIFS(Stations!S:S,Stations!$I:$I,\">=\"&$B51,Stations!$I:$I,\"<\"&$D51,Stations!$W:$W,\"=No\"),SUMIFS(Stations!S:S,Stations!$I:$I,\">=\"&$B51,Stations!$W:$W,\"=No\"))),IF($A51=\"\",\"\",IF($A51=\"Between\",SUMIFS(Stations!S:S,Stations!$I:$I,\">=\"&$B51,Stations!$I:$I,\"<\"&$D51),SUMIFS(Stations!S:S,Stations!$I:$I,\">=\"&$B51))))","v":143},{"$f":"IF($N$1,IF($A51=\"\",\"\",IF($A51=\"Between\",SUMIFS(Stations!U:U,Stations!$I:$I,\">=\"&$B51,Stations!$I:$I,\"<\"&$D51,Stations!$W:$W,\"=No\"),SUMIFS(Stations!U:U,Stations!$I:$I,\">=\"&$B51,Stations!$W:$W,\"=No\"))),IF($A51=\"\",\"\",IF($A51=\"Between\",SUMIFS(Stations!U:U,Stations!$I:$I,\">=\"&$B51,Stations!$I:$I,\"<\"&$D51),SUMIFS(Stations!U:U,Stations!$I:$I,\">=\"&$B51))))","v":91}]
["Between",100,"and",250,"Between 100 and 250",{"$f":"IF($N$1,IF($A52=\"\",\"\",IF($A52=\"Between\",SUMIFS(Stations!L:L,Stations!$I:$I,\">=\"&$B52,Stations!$I:$I,\"<\"&$D52,Stations!$W:$W,\"=No\"),SUMIFS(Stations!L:L,Stations!$I:$I,\">=\"&$B52,Stations!$W:$W,\"=No\"))),IF($A52=\"\",\"\",IF($A52=\"Between\",SUMIFS(Stations!L:L,Stations!$I:$I,\">=\"&$B52,Stations!$I:$I,\"<\"&$D52),SUMIFS(Stations!L:L,Stations!$I:$I,\">=\"&$B52))))","v":6954},{"$f":"IF($N$1,IF($A52=\"\",\"\",IF($A52=\"Between\",SUMIFS(Stations!M:M,Stations!$I:$I,\">=\"&$B52,Stations!$I:$I,\"<\"&$D52,Stations!$W:$W,\"=No\"),SUMIFS(Stations!M:M,Stations!$I:$I,\">=\"&$B52,Stations!$W:$W,\"=No\"))),IF($A52=\"\",\"\",IF($A52=\"Between\",SUMIFS(Stations!M:M,Stations!$I:$I,\">=\"&$B52,Stations!$I:$I,\"<\"&$D52),SUMIFS(Stations!M:M,Stations!$I:$I,\">=\"&$B52))))","v":457},{"$f":"IF($N$1,IF($A52=\"\",\"\",IF($A52=\"Between\",SUMIFS(Stations!O:O,Stations!$I:$I,\">=\"&$B52,Stations!$I:$I,\"<\"&$D52,Stations!$W:$W,\"=No\"),SUMIFS(Stations!O:O,Stations!$I:$I,\">=\"&$B52,Stations!$W:$W,\"=No\"))),IF($A52=\"\",\"\",IF($A52=\"Between\",SUMIFS(Stations!O:O,Stations!$I:$I,\">=\"&$B52,Stations!$I:$I,\"<\"&$D52),SUMIFS(Stations!O:O,Stations!$I:$I,\">=\"&$B52))))","v":6},{"$f":"IF($N$1,IF($A52=\"\",\"\",IF($A52=\"Between\",SUMIFS(Stations!Q:Q,Stations!$I:$I,\">=\"&$B52,Stations!$I:$I,\"<\"&$D52,Stations!$W:$W,\"=No\"),SUMIFS(Stations!Q:Q,Stations!$I:$I,\">=\"&$B52,Stations!$W:$W,\"=No\"))),IF($A52=\"\",\"\",IF($A52=\"Between\",SUMIFS(Stations!Q:Q,Stations!$I:$I,\">=\"&$B52,Stations!$I:$I,\"<\"&$D52),SUMIFS(Stations!Q:Q,Stations!$I:$I,\">=\"&$B52))))","v":463},{"$f":"IF($N$1,IF($A52=\"\",\"\",IF($A52=\"Between\",SUMIFS(Stations!S:S,Stations!$I:$I,\">=\"&$B52,Stations!$I:$I,\"<\"&$D52,Stations!$W:$W,\"=No\"),SUMIFS(Stations!S:S,Stations!$I:$I,\">=\"&$B52,Stations!$W:$W,\"=No\"))),IF($A52=\"\",\"\",IF($A52=\"Between\",SUMIFS(Stations!S:S,Stations!$I:$I,\">=\"&$B52,Stations!$I:$I,\"<\"&$D52),SUMIFS(Stations!S:S,Stations!$I:$I,\">=\"&$B52))))","v":154},{"$f":"IF($N$1,IF($A52=\"\",\"\",IF($A52=\"Between\",SUMIFS(Stations!U:U,Stations!$I:$I,\">=\"&$B52,Stations!$I:$I,\"<\"&$D52,Stations!$W:$W,\"=No\"),SUMIFS(Stations!U:U,Stations!$I:$I,\">=\"&$B52,Stations!$W:$W,\"=No\"))),IF($A52=\"\",\"\",IF($A52=\"Between\",SUMIFS(Stations!U:U,Stations!$I:$I,\">=\"&$B52,Stations!$I:$I,\"<\"&$D52),SUMIFS(Stations!U:U,Stations!$I:$I,\">=\"&$B52))))","v":112}]
["Between",250,"and",500,"Between 250 and 500",{"$f":"IF($N$1,IF($A53=\"\",\"\",IF($A53=\"Between\",SUMIFS(Stations!L:L,Stations!$I:$I,\">=\"&$B53,Stations!$I:$I,\"<\"&$D53,Stations!$W:$W,\"=No\"),SUMIFS(Stations!L:L,Stations!$I:$I,\">=\"&$B53,Stations!$W:$W,\"=No\"))),IF($A53=\"\",\"\",IF($A53=\"Between\",SUMIFS(Stations!L:L,Stations!$I:$I,\">=\"&$B53,Stations!$I:$I,\"<\"&$D53),SUMIFS(Stations!L:L,Stations!$I:$I,\">=\"&$B53))))","v":8908},{"$f":"IF($N$1,IF($A53=\"\",\"\",IF($A53=\"Between\",SUMIFS(Stations!M:M,Stations!$I:$I,\">=\"&$B53,Stations!$I:$I,\"<\"&$D53,Stations!$W:$W,\"=No\"),SUMIFS(Stations!M:M,Stations!$I:$I,\">=\"&$B53,Stations!$W:$W,\"=No\"))),IF($A53=\"\",\"\",IF($A53=\"Between\",SUMIFS(Stations!M:M,Stations!$I:$I,\">=\"&$B53,Stations!$I:$I,\"<\"&$D53),SUMIFS(Stations!M:M,Stations!$I:$I,\">=\"&$B53))))","v":360},{"$f":"IF($N$1,IF($A53=\"\",\"\",IF($A53=\"Between\",SUMIFS(Stations!O:O,Stations!$I:$I,\">=\"&$B53,Stations!$I:$I,\"<\"&$D53,Stations!$W:$W,\"=No\"),SUMIFS(Stations!O:O,Stations!$I:$I,\">=\"&$B53,Stations!$W:$W,\"=No\"))),IF($A53=\"\",\"\",IF($A53=\"Between\",SUMIFS(Stations!O:O,Stations!$I:$I,\">=\"&$B53,Stations!$I:$I,\"<\"&$D53),SUMIFS(Stations!O:O,Stations!$I:$I,\">=\"&$B53))))","v":8},{"$f":"IF($N$1,IF($A53=\"\",\"\",IF($A53=\"Between\",SUMIFS(Stations!Q:Q,Stations!$I:$I,\">=\"&$B53,Stations!$I:$I,\"<\"&$D53,Stations!$W:$W,\"=No\"),SUMIFS(Stations!Q:Q,Stations!$I:$I,\">=\"&$B53,Stations!$W:$W,\"=No\"))),IF($A53=\"\",\"\",IF($A53=\"Between\",SUMIFS(Stations!Q:Q,Stations!$I:$I,\">=\"&$B53,Stations!$I:$I,\"<\"&$D53),SUMIFS(Stations!Q:Q,Stations!$I:$I,\">=\"&$B53))))","v":368},{"$f":"IF($N$1,IF($A53=\"\",\"\",IF($A53=\"Between\",SUMIFS(Stations!S:S,Stations!$I:$I,\">=\"&$B53,Stations!$I:$I,\"<\"&$D53,Stations!$W:$W,\"=No\"),SUMIFS(Stations!S:S,Stations!$I:$I,\">=\"&$B53,Stations!$W:$W,\"=No\"))),IF($A53=\"\",\"\",IF($A53=\"Between\",SUMIFS(Stations!S:S,Stations!$I:$I,\">=\"&$B53,Stations!$I:$I,\"<\"&$D53),SUMIFS(Stations!S:S,Stations!$I:$I,\">=\"&$B53))))","v":170},{"$f":"IF($N$1,IF($A53=\"\",\"\",IF($A53=\"Between\",SUMIFS(Stations!U:U,Stations!$I:$I,\">=\"&$B53,Stations!$I:$I,\"<\"&$D53,Stations!$W:$W,\"=No\"),SUMIFS(Stations!U:U,Stations!$I:$I,\">=\"&$B53,Stations!$W:$W,\"=No\"))),IF($A53=\"\",\"\",IF($A53=\"Between\",SUMIFS(Stations!U:U,Stations!$I:$I,\">=\"&$B53,Stations!$I:$I,\"<\"&$D53),SUMIFS(Stations!U:U,Stations!$I:$I,\">=\"&$B53))))","v":166}]
["Between",500,"and",1000,"Between 500 and 1,000",{"$f":"IF($N$1,IF($A54=\"\",\"\",IF($A54=\"Between\",SUMIFS(Stations!L:L,Stations!$I:$I,\">=\"&$B54,Stations!$I:$I,\"<\"&$D54,Stations!$W:$W,\"=No\"),SUMIFS(Stations!L:L,Stations!$I:$I,\">=\"&$B54,Stations!$W:$W,\"=No\"))),IF($A54=\"\",\"\",IF($A54=\"Between\",SUMIFS(Stations!L:L,Stations!$I:$I,\">=\"&$B54,Stations!$I:$I,\"<\"&$D54),SUMIFS(Stations!L:L,Stations!$I:$I,\">=\"&$B54))))","v":8217},{"$f":"IF($N$1,IF($A54=\"\",\"\",IF($A54=\"Between\",SUMIFS(Stations!M:M,Stations!$I:$I,\">=\"&$B54,Stations!$I:$I,\"<\"&$D54,Stations!$W:$W,\"=No\"),SUMIFS(Stations!M:M,Stations!$I:$I,\">=\"&$B54,Stations!$W:$W,\"=No\"))),IF($A54=\"\",\"\",IF($A54=\"Between\",SUMIFS(Stations!M:M,Stations!$I:$I,\">=\"&$B54,Stations!$I:$I,\"<\"&$D54),SUMIFS(Stations!M:M,Stations!$I:$I,\">=\"&$B54))))","v":478},{"$f":"IF($N$1,IF($A54=\"\",\"\",IF($A54=\"Between\",SUMIFS(Stations!O:O,Stations!$I:$I,\">=\"&$B54,Stations!$I:$I,\"<\"&$D54,Stations!$W:$W,\"=No\"),SUMIFS(Stations!O:O,Stations!$I:$I,\">=\"&$B54,Stations!$W:$W,\"=No\"))),IF($A54=\"\",\"\",IF($A54=\"Between\",SUMIFS(Stations!O:O,Stations!$I:$I,\">=\"&$B54,Stations!$I:$I,\"<\"&$D54),SUMIFS(Stations!O:O,Stations!$I:$I,\">=\"&$B54))))","v":24},{"$f":"IF($N$1,IF($A54=\"\",\"\",IF($A54=\"Between\",SUMIFS(Stations!Q:Q,Stations!$I:$I,\">=\"&$B54,Stations!$I:$I,\"<\"&$D54,Stations!$W:$W,\"=No\"),SUMIFS(Stations!Q:Q,Stations!$I:$I,\">=\"&$B54,Stations!$W:$W,\"=No\"))),IF($A54=\"\",\"\",IF($A54=\"Between\",SUMIFS(Stations!Q:Q,Stations!$I:$I,\">=\"&$B54,Stations!$I:$I,\"<\"&$D54),SUMIFS(Stations!Q:Q,Stations!$I:$I,\">=\"&$B54))))","v":502},{"$f":"IF($N$1,IF($A54=\"\",\"\",IF($A54=\"Between\",SUMIFS(Stations!S:S,Stations!$I:$I,\">=\"&$B54,Stations!$I:$I,\"<\"&$D54,Stations!$W:$W,\"=No\"),SUMIFS(Stations!S:S,Stations!$I:$I,\">=\"&$B54,Stations!$W:$W,\"=No\"))),IF($A54=\"\",\"\",IF($A54=\"Between\",SUMIFS(Stations!S:S,Stations!$I:$I,\">=\"&$B54,Stations!$I:$I,\"<\"&$D54),SUMIFS(Stations!S:S,Stations!$I:$I,\">=\"&$B54))))","v":317},{"$f":"IF($N$1,IF($A54=\"\",\"\",IF($A54=\"Between\",SUMIFS(Stations!U:U,Stations!$I:$I,\">=\"&$B54,Stations!$I:$I,\"<\"&$D54,Stations!$W:$W,\"=No\"),SUMIFS(Stations!U:U,Stations!$I:$I,\">=\"&$B54,Stations!$W:$W,\"=No\"))),IF($A54=\"\",\"\",IF($A54=\"Between\",SUMIFS(Stations!U:U,Stations!$I:$I,\">=\"&$B54,Stations!$I:$I,\"<\"&$D54),SUMIFS(Stations!U:U,Stations!$I:$I,\">=\"&$B54))))","v":280}]
["Between",1000,"and",2000,"Between 1,000 and 2,000",{"$f":"IF($N$1,IF($A55=\"\",\"\",IF($A55=\"Between\",SUMIFS(Stations!L:L,Stations!$I:$I,\">=\"&$B55,Stations!$I:$I,\"<\"&$D55,Stations!$W:$W,\"=No\"),SUMIFS(Stations!L:L,Stations!$I:$I,\">=\"&$B55,Stations!$W:$W,\"=No\"))),IF($A55=\"\",\"\",IF($A55=\"Between\",SUMIFS(Stations!L:L,Stations!$I:$I,\">=\"&$B55,Stations!$I:$I,\"<\"&$D55),SUMIFS(Stations!L:L,Stations!$I:$I,\">=\"&$B55))))","v":10363},{"$f":"IF($N$1,IF($A55=\"\",\"\",IF($A55=\"Between\",SUMIFS(Stations!M:M,Stations!$I:$I,\">=\"&$B55,Stations!$I:$I,\"<\"&$D55,Stations!$W:$W,\"=No\"),SUMIFS(Stations!M:M,Stations!$I:$I,\">=\"&$B55,Stations!$W:$W,\"=No\"))),IF($A55=\"\",\"\",IF($A55=\"Between\",SUMIFS(Stations!M:M,Stations!$I:$I,\">=\"&$B55,Stations!$I:$I,\"<\"&$D55),SUMIFS(Stations!M:M,Stations!$I:$I,\">=\"&$B55))))","v":935},{"$f":"IF($N$1,IF($A55=\"\",\"\",IF($A55=\"Between\",SUMIFS(Stations!O:O,Stations!$I:$I,\">=\"&$B55,Stations!$I:$I,\"<\"&$D55,Stations!$W:$W,\"=No\"),SUMIFS(Stations!O:O,Stations!$I:$I,\">=\"&$B55,Stations!$W:$W,\"=No\"))),IF($A55=\"\",\"\",IF($A55=\"Between\",SUMIFS(Stations!O:O,Stations!$I:$I,\">=\"&$B55,Stations!$I:$I,\"<\"&$D55),SUMIFS(Stations!O:O,Stations!$I:$I,\">=\"&$B55))))","v":197},{"$f":"IF($N$1,IF($A55=\"\",\"\",IF($A55=\"Between\",SUMIFS(Stations!Q:Q,Stations!$I:$I,\">=\"&$B55,Stations!$I:$I,\"<\"&$D55,Stations!$W:$W,\"=No\"),SUMIFS(Stations!Q:Q,Stations!$I:$I,\">=\"&$B55,Stations!$W:$W,\"=No\"))),IF($A55=\"\",\"\",IF($A55=\"Between\",SUMIFS(Stations!Q:Q,Stations!$I:$I,\">=\"&$B55,Stations!$I:$I,\"<\"&$D55),SUMIFS(Stations!Q:Q,Stations!$I:$I,\">=\"&$B55))))","v":1132},{"$f":"IF($N$1,IF($A55=\"\",\"\",IF($A55=\"Between\",SUMIFS(Stations!S:S,Stations!$I:$I,\">=\"&$B55,Stations!$I:$I,\"<\"&$D55,Stations!$W:$W,\"=No\"),SUMIFS(Stations!S:S,Stations!$I:$I,\">=\"&$B55,Stations!$W:$W,\"=No\"))),IF($A55=\"\",\"\",IF($A55=\"Between\",SUMIFS(Stations!S:S,Stations!$I:$I,\">=\"&$B55,Stations!$I:$I,\"<\"&$D55),SUMIFS(Stations!S:S,Stations!$I:$I,\">=\"&$B55))))","v":599},{"$f":"IF($N$1,IF($A55=\"\",\"\",IF($A55=\"Between\",SUMIFS(Stations!U:U,Stations!$I:$I,\">=\"&$B55,Stations!$I:$I,\"<\"&$D55,Stations!$W:$W,\"=No\"),SUMIFS(Stations!U:U,Stations!$I:$I,\">=\"&$B55,Stations!$W:$W,\"=No\"))),IF($A55=\"\",\"\",IF($A55=\"Between\",SUMIFS(Stations!U:U,Stations!$I:$I,\">=\"&$B55,Stations!$I:$I,\"<\"&$D55),SUMIFS(Stations!U:U,Stations!$I:$I,\">=\"&$B55))))","v":441}]
["Over",2000,"",null,"Over 2,000",{"$f":"IF($N$1,IF($A56=\"\",\"\",IF($A56=\"Between\",SUMIFS(Stations!L:L,Stations!$I:$I,\">=\"&$B56,Stations!$I:$I,\"<\"&$D56,Stations!$W:$W,\"=No\"),SUMIFS(Stations!L:L,Stations!$I:$I,\">=\"&$B56,Stations!$W:$W,\"=No\"))),IF($A56=\"\",\"\",IF($A56=\"Between\",SUMIFS(Stations!L:L,Stations!$I:$I,\">=\"&$B56,Stations!$I:$I,\"<\"&$D56),SUMIFS(Stations!L:L,Stations!$I:$I,\">=\"&$B56))))","v":25615},{"$f":"IF($N$1,IF($A56=\"\",\"\",IF($A56=\"Between\",SUMIFS(Stations!M:M,Stations!$I:$I,\">=\"&$B56,Stations!$I:$I,\"<\"&$D56,Stations!$W:$W,\"=No\"),SUMIFS(Stations!M:M,Stations!$I:$I,\">=\"&$B56,Stations!$W:$W,\"=No\"))),IF($A56=\"\",\"\",IF($A56=\"Between\",SUMIFS(Stations!M:M,Stations!$I:$I,\">=\"&$B56,Stations!$I:$I,\"<\"&$D56),SUMIFS(Stations!M:M,Stations!$I:$I,\">=\"&$B56))))","v":1179},{"$f":"IF($N$1,IF($A56=\"\",\"\",IF($A56=\"Between\",SUMIFS(Stations!O:O,Stations!$I:$I,\">=\"&$B56,Stations!$I:$I,\"<\"&$D56,Stations!$W:$W,\"=No\"),SUMIFS(Stations!O:O,Stations!$I:$I,\">=\"&$B56,Stations!$W:$W,\"=No\"))),IF($A56=\"\",\"\",IF($A56=\"Between\",SUMIFS(Stations!O:O,Stations!$I:$I,\">=\"&$B56,Stations!$I:$I,\"<\"&$D56),SUMIFS(Stations!O:O,Stations!$I:$I,\">=\"&$B56))))","v":743},{"$f":"IF($N$1,IF($A56=\"\",\"\",IF($A56=\"Between\",SUMIFS(Stations!Q:Q,Stations!$I:$I,\">=\"&$B56,Stations!$I:$I,\"<\"&$D56,Stations!$W:$W,\"=No\"),SUMIFS(Stations!Q:Q,Stations!$I:$I,\">=\"&$B56,Stations!$W:$W,\"=No\"))),IF($A56=\"\",\"\",IF($A56=\"Between\",SUMIFS(Stations!Q:Q,Stations!$I:$I,\">=\"&$B56,Stations!$I:$I,\"<\"&$D56),SUMIFS(Stations!Q:Q,Stations!$I:$I,\">=\"&$B56))))","v":1922},{"$f":"IF($N$1,IF($A56=\"\",\"\",IF($A56=\"Between\",SUMIFS(Stations!S:S,Stations!$I:$I,\">=\"&$B56,Stations!$I:$I,\"<\"&$D56,Stations!$W:$W,\"=No\"),SUMIFS(Stations!S:S,Stations!$I:$I,\">=\"&$B56,Stations!$W:$W,\"=No\"))),IF($A56=\"\",\"\",IF($A56=\"Between\",SUMIFS(Stations!S:S,Stations!$I:$I,\">=\"&$B56,Stations!$I:$I,\"<\"&$D56),SUMIFS(Stations!S:S,Stations!$I:$I,\">=\"&$B56))))","v":1355},{"$f":"IF($N$1,IF($A56=\"\",\"\",IF($A56=\"Between\",SUMIFS(Stations!U:U,Stations!$I:$I,\">=\"&$B56,Stations!$I:$I,\"<\"&$D56,Stations!$W:$W,\"=No\"),SUMIFS(Stations!U:U,Stations!$I:$I,\">=\"&$B56,Stations!$W:$W,\"=No\"))),IF($A56=\"\",\"\",IF($A56=\"Between\",SUMIFS(Stations!U:U,Stations!$I:$I,\">=\"&$B56,Stations!$I:$I,\"<\"&$D56),SUMIFS(Stations!U:U,Stations!$I:$I,\">=\"&$B56))))","v":1557}]
[]
[]
["By State"]
[null,null,"Abbreviation","State","Column1","VOMS","ADA Accessible","Non-ADA Accessible","Total Stations","Elevators","Escalators"]
[null,null,"AK","Alaska",null,{"$f":"IF($N$1,SUMIFS(Stations!L:L,Stations!$C:$C,\"=\"&$C61,Stations!$W:$W,\"=No\"),SUMIFS(Stations!L:L,Stations!$C:$C,\"=\"&$C61))","v":101},{"$f":"IF($N$1,SUMIFS(Stations!M:M,Stations!$C:$C,\"=\"&$C61,Stations!$W:$W,\"=No\"),SUMIFS(Stations!M:M,Stations!$C:$C,\"=\"&$C61))","v":16},{"$f":"IF($N$1,SUMIFS(Stations!O:O,Stations!$C:$C,\"=\"&$C61,Stations!$W:$W,\"=No\"),SUMIFS(Stations!O:O,Stations!$C:$C,\"=\"&$C61))","v":0},{"$f":"IF($N$1,SUMIFS(Stations!Q:Q,Stations!$C:$C,\"=\"&$C61,Stations!$W:$W,\"=No\"),SUMIFS(Stations!Q:Q,Stations!$C:$C,\"=\"&$C61))","v":16},{"$f":"IF($N$1,SUMIFS(Stations!S:S,Stations!$C:$C,\"=\"&$C61,Stations!$W:$W,\"=No\"),SUMIFS(Stations!S:S,Stations!$C:$C,\"=\"&$C61))","v":2},{"$f":"IF($N$1,SUMIFS(Stations!U:U,Stations!$C:$C,\"=\"&$C61,Stations!$W:$W,\"=No\"),SUMIFS(Stations!U:U,Stations!$C:$C,\"=\"&$C61))","v":2}]
[null,null,"AL","Alabama",null,{"$f":"IF($N$1,SUMIFS(Stations!L:L,Stations!$C:$C,\"=\"&$C62,Stations!$W:$W,\"=No\"),SUMIFS(Stations!L:L,Stations!$C:$C,\"=\"&$C62))","v":147},{"$f":"IF($N$1,SUMIFS(Stations!M:M,Stations!$C:$C,\"=\"&$C62,Stations!$W:$W,\"=No\"),SUMIFS(Stations!M:M,Stations!$C:$C,\"=\"&$C62))","v":11},{"$f":"IF($N$1,SUMIFS(Stations!O:O,Stations!$C:$C,\"=\"&$C62,Stations!$W:$W,\"=No\"),SUMIFS(Stations!O:O,Stations!$C:$C,\"=\"&$C62))","v":0},{"$f":"IF($N$1,SUMIFS(Stations!Q:Q,Stations!$C:$C,\"=\"&$C62,Stations!$W:$W,\"=No\"),SUMIFS(Stations!Q:Q,Stations!$C:$C,\"=\"&$C62))","v":11},{"$f":"IF($N$1,SUMIFS(Stations!S:S,Stations!$C:$C,\"=\"&$C62,Stations!$W:$W,\"=No\"),SUMIFS(Stations!S:S,Stations!$C:$C,\"=\"&$C62))","v":6},{"$f":"IF($N$1,SUMIFS(Stations!U:U,Stations!$C:$C,\"=\"&$C62,Stations!$W:$W,\"=No\"),SUMIFS(Stations!U:U,Stations!$C:$C,\"=\"&$C62))","v":1}]
[null,null,"AR","Arkansas",null,{"$f":"IF($N$1,SUMIFS(Stations!L:L,Stations!$C:$C,\"=\"&$C63,Stations!$W:$W,\"=No\"),SUMIFS(Stations!L:L,Stations!$C:$C,\"=\"&$C63))","v":112},{"$f":"IF($N$1,SUMIFS(Stations!M:M,Stations!$C:$C,\"=\"&$C63,Stations!$W:$W,\"=No\"),SUMIFS(Stations!M:M,Stations!$C:$C,\"=\"&$C63))","v":5},{"$f":"IF($N$1,SUMIFS(Stations!O:O,Stations!$C:$C,\"=\"&$C63,Stations!$W:$W,\"=No\"),SUMIFS(Stations!O:O,Stations!$C:$C,\"=\"&$C63))","v":0},{"$f":"IF($N$1,SUMIFS(Stations!Q:Q,Stations!$C:$C,\"=\"&$C63,Stations!$W:$W,\"=No\"),SUMIFS(Stations!Q:Q,Stations!$C:$C,\"=\"&$C63))","v":5},{"$f":"IF($N$1,SUMIFS(Stations!S:S,Stations!$C:$C,\"=\"&$C63,Stations!$W:$W,\"=No\"),SUMIFS(Stations!S:S,Stations!$C:$C,\"=\"&$C63))","v":2},{"$f":"IF($N$1,SUMIFS(Stations!U:U,Stations!$C:$C,\"=\"&$C63,Stations!$W:$W,\"=No\"),SUMIFS(Stations!U:U,Stations!$C:$C,\"=\"&$C63))","v":0}]
[null,null,"AS","American Samoa",null,{"$f":"IF($N$1,SUMIFS(Stations!L:L,Stations!$C:$C,\"=\"&$C64,Stations!$W:$W,\"=No\"),SUMIFS(Stations!L:L,Stations!$C:$C,\"=\"&$C64))","v":0},{"$f":"IF($N$1,SUMIFS(Stations!M:M,Stations!$C:$C,\"=\"&$C64,Stations!$W:$W,\"=No\"),SUMIFS(Stations!M:M,Stations!$C:$C,\"=\"&$C64))","v":0},{"$f":"IF($N$1,SUMIFS(Stations!O:O,Stations!$C:$C,\"=\"&$C64,Stations!$W:$W,\"=No\"),SUMIFS(Stations!O:O,Stations!$C:$C,\"=\"&$C64))","v":0},{"$f":"IF($N$1,SUMIFS(Stations!Q:Q,Stations!$C:$C,\"=\"&$C64,Stations!$W:$W,\"=No\"),SUMIFS(Stations!Q:Q,Stations!$C:$C,\"=\"&$C64))","v":0},{"$f":"IF($N$1,SUMIFS(Stations!S:S,Stations!$C:$C,\"=\"&$C64,Stations!$W:$W,\"=No\"),SUMIFS(Stations!S:S,Stations!$C:$C,\"=\"&$C64))","v":0},{"$f":"IF($N$1,SUMIFS(Stations!U:U,Stations!$C:$C,\"=\"&$C64,Stations!$W:$W,\"=No\"),SUMIFS(Stations!U:U,Stations!$C:$C,\"=\"&$C64))","v":0}]
[null,null,"AZ","Arizona",null,{"$f":"IF($N$1,SUMIFS(Stations!L:L,Stations!$C:$C,\"=\"&$C65,Stations!$W:$W,\"=No\"),SUMIFS(Stations!L:L,Stations!$C:$C,\"=\"&$C65))","v":1066},{"$f":"IF($N$1,SUMIFS(Stations!M:M,Stations!$C:$C,\"=\"&$C65,Stations!$W:$W,\"=No\"),SUMIFS(Stations!M:M,Stations!$C:$C,\"=\"&$C65))","v":55},{"$f":"IF($N$1,SUMIFS(Stations!O:O,Stations!$C:$C,\"=\"&$C65,Stations!$W:$W,\"=No\"),SUMIFS(Stations!O:O,Stations!$C:$C,\"=\"&$C65))","v":0},{"$f":"IF($N$1,SUMIFS(Stations!Q:Q,Stations!$C:$C,\"=\"&$C65,Stations!$W:$W,\"=No\"),SUMIFS(Stations!Q:Q,Stations!$C:$C,\"=\"&$C65))","v":55},{"$f":"IF($N$1,SUMIFS(Stations!S:S,Stations!$C:$C,\"=\"&$C65,Stations!$W:$W,\"=No\"),SUMIFS(Stations!S:S,Stations!$C:$C,\"=\"&$C65))","v":1},{"$f":"IF($N$1,SUMIFS(Stations!U:U,Stations!$C:$C,\"=\"&$C65,Stations!$W:$W,\"=No\"),SUMIFS(Stations!U:U,Stations!$C:$C,\"=\"&$C65))","v":1}]
[null,null,"CA","California",null,{"$f":"IF($N$1,SUMIFS(Stations!L:L,Stations!$C:$C,\"=\"&$C66,Stations!$W:$W,\"=No\"),SUMIFS(Stations!L:L,Stations!$C:$C,\"=\"&$C66))","v":10434},{"$f":"IF($N$1,SUMIFS(Stations!M:M,Stations!$C:$C,\"=\"&$C66,Stations!$W:$W,\"=No\"),SUMIFS(Stations!M:M,Stations!$C:$C,\"=\"&$C66))","v":768},{"$f":"IF($N$1,SUMIFS(Stations!O:O,Stations!$C:$C,\"=\"&$C66,Stations!$W:$W,\"=No\"),SUMIFS(Stations!O:O,Stations!$C:$C,\"=\"&$C66))","v":9},{"$f":"IF($N$1,SUMIFS(Stations!Q:Q,Stations!$C:$C,\"=\"&$C66,Stations!$W:$W,\"=No\"),SUMIFS(Stations!Q:Q,Stations!$C:$C,\"=\"&$C66))","v":777},{"$f":"IF($N$1,SUMIFS(Stations!S:S,Stations!$C:$C,\"=\"&$C66,Stations!$W:$W,\"=No\"),SUMIFS(Stations!S:S,Stations!$C:$C,\"=\"&$C66))","v":516},{"$f":"IF($N$1,SUMIFS(Stations!U:U,Stations!$C:$C,\"=\"&$C66,Stations!$W:$W,\"=No\"),SUMIFS(Stations!U:U,Stations!$C:$C,\"=\"&$C66))","v":444}]
[null,null,"CO","Colorado",null,{"$f":"IF($N$1,SUMIFS(Stations!L:L,Stations!$C:$C,\"=\"&$C67,Stations!$W:$W,\"=No\"),SUMIFS(Stations!L:L,Stations!$C:$C,\"=\"&$C67))","v":1159},{"$f":"IF($N$1,SUMIFS(Stations!M:M,Stations!$C:$C,\"=\"&$C67,Stations!$W:$W,\"=No\"),SUMIFS(Stations!M:M,Stations!$C:$C,\"=\"&$C67))","v":68},{"$f":"IF($N$1,SUMIFS(Stations!O:O,Stations!$C:$C,\"=\"&$C67,Stations!$W:$W,\"=No\"),SUMIFS(Stations!O:O,Stations!$C:$C,\"=\"&$C67))","v":0},{"$f":"IF($N$1,SUMIFS(Stations!Q:Q,Stations!$C:$C,\"=\"&$C67,Stations!$W:$W,\"=No\"),SUMIFS(Stations!Q:Q,Stations!$C:$C,\"=\"&$C67))","v":68},{"$f":"IF($N$1,SUMIFS(Stations!S:S,Stations!$C:$C,\"=\"&$C67,Stations!$W:$W,\"=No\"),SUMIFS(Stations!S:S,Stations!$C:$C,\"=\"&$C67))","v":68},{"$f":"IF($N$1,SUMIFS(Stations!U:U,Stations!$C:$C,\"=\"&$C67,Stations!$W:$W,\"=No\"),SUMIFS(Stations!U:U,Stations!$C:$C,\"=\"&$C67))","v":10}]
[null,null,"CT","Connecticut",null,{"$f":"IF($N$1,SUMIFS(Stations!L:L,Stations!$C:$C,\"=\"&$C68,Stations!$W:$W,\"=No\"),SUMIFS(Stations!L:L,Stations!$C:$C,\"=\"&$C68))","v":649},{"$f":"IF($N$1,SUMIFS(Stations!M:M,Stations!$C:$C,\"=\"&$C68,Stations!$W:$W,\"=No\"),SUMIFS(Stations!M:M,Stations!$C:$C,\"=\"&$C68))","v":12},{"$f":"IF($N$1,SUMIFS(Stations!O:O,Stations!$C:$C,\"=\"&$C68,Stations!$W:$W,\"=No\"),SUMIFS(Stations!O:O,Stations!$C:$C,\"=\"&$C68))","v":1},{"$f":"IF($N$1,SUMIFS(Stations!Q:Q,Stations!$C:$C,\"=\"&$C68,Stations!$W:$W,\"=No\"),SUMIFS(Stations!Q:Q,Stations!$C:$C,\"=\"&$C68))","v":13},{"$f":"IF($N$1,SUMIFS(Stations!S:S,Stations!$C:$C,\"=\"&$C68,Stations!$W:$W,\"=No\"),SUMIFS(Stations!S:S,Stations!$C:$C,\"=\"&$C68))","v":5},{"$f":"IF($N$1,SUMIFS(Stations!U:U,Stations!$C:$C,\"=\"&$C68,Stations!$W:$W,\"=No\"),SUMIFS(Stations!U:U,Stations!$C:$C,\"=\"&$C68))","v":1}]
[null,null,"DC","District of Columbia",null,{"$f":"IF($N$1,SUMIFS(Stations!L:L,Stations!$C:$C,\"=\"&$C69,Stations!$W:$W,\"=No\"),SUMIFS(Stations!L:L,Stations!$C:$C,\"=\"&$C69))","v":2312},{"$f":"IF($N$1,SUMIFS(Stations!M:M,Stations!$C:$C,\"=\"&$C69,Stations!$W:$W,\"=No\"),SUMIFS(Stations!M:M,Stations!$C:$C,\"=\"&$C69))","v":94},{"$f":"IF($N$1,SUMIFS(Stations!O:O,Stations!$C:$C,\"=\"&$C69,Stations!$W:$W,\"=No\"),SUMIFS(Stations!O:O,Stations!$C:$C,\"=\"&$C69))","v":0},{"$f":"IF($N$1,SUMIFS(Stations!Q:Q,Stations!$C:$C,\"=\"&$C69,Stations!$W:$W,\"=No\"),SUMIFS(Stations!Q:Q,Stations!$C:$C,\"=\"&$C69))","v":94},{"$f":"IF($N$1,SUMIFS(Stations!S:S,Stations!$C:$C,\"=\"&$C69,Stations!$W:$W,\"=No\"),SUMIFS(Stations!S:S,Stations!$C:$C,\"=\"&$C69))","v":278},{"$f":"IF($N$1,SUMIFS(Stations!U:U,Stations!$C:$C,\"=\"&$C69,Stations!$W:$W,\"=No\"),SUMIFS(Stations!U:U,Stations!$C:$C,\"=\"&$C69))","v":618}]
[null,null,"DE","Delaware",null,{"$f":"IF($N$1,SUMIFS(Stations!L:L,Stations!$C:$C,\"=\"&$C70,Stations!$W:$W,\"=No\"),SUMIFS(Stations!L:L,Stations!$C:$C,\"=\"&$C70))","v":204},{"$f":"IF($N$1,SUMIFS(Stations!M:M,Stations!$C:$C,\"=\"&$C70,Stations!$W:$W,\"=No\"),SUMIFS(Stations!M:M,Stations!$C:$C,\"=\"&$C70))","v":7},{"$f":"IF($N$1,SUMIFS(Stations!O:O,Stations!$C:$C,\"=\"&$C70,Stations!$W:$W,\"=No\"),SUMIFS(Stations!O:O,Stations!$C:$C,\"=\"&$C70))","v":0},{"$f":"IF($N$1,SUMIFS(Stations!Q:Q,Stations!$C:$C,\"=\"&$C70,Stations!$W:$W,\"=No\"),SUMIFS(Stations!Q:Q,Stations!$C:$C,\"=\"&$C70))","v":7},{"$f":"IF($N$1,SUMIFS(Stations!S:S,Stations!$C:$C,\"=\"&$C70,Stations!$W:$W,\"=No\"),SUMIFS(Stations!S:S,Stations!$C:$C,\"=\"&$C70))","v":2},{"$f":"IF($N$1,SUMIFS(Stations!U:U,Stations!$C:$C,\"=\"&$C70,Stations!$W:$W,\"=No\"),SUMIFS(Stations!U:U,Stations!$C:$C,\"=\"&$C70))","v":2}]
[null,null,"FL","Florida",null,{"$f":"IF($N$1,SUMIFS(Stations!L:L,Stations!$C:$C,\"=\"&$C71,Stations!$W:$W,\"=No\"),SUMIFS(Stations!L:L,Stations!$C:$C,\"=\"&$C71))","v":2765},{"$f":"IF($N$1,SUMIFS(Stations!M:M,Stations!$C:$C,\"=\"&$C71,Stations!$W:$W,\"=No\"),SUMIFS(Stations!M:M,Stations!$C:$C,\"=\"&$C71))","v":146},{"$f":"IF($N$1,SUMIFS(Stations!O:O,Stations!$C:$C,\"=\"&$C71,Stations!$W:$W,\"=No\"),SUMIFS(Stations!O:O,Stations!$C:$C,\"=\"&$C71))","v":0},{"$f":"IF($N$1,SUMIFS(Stations!Q:Q,Stations!$C:$C,\"=\"&$C71,Stations!$W:$W,\"=No\"),SUMIFS(Stations!Q:Q,Stations!$C:$C,\"=\"&$C71))","v":146},{"$f":"IF($N$1,SUMIFS(Stations!S:S,Stations!$C:$C,\"=\"&$C71,Stations!$W:$W,\"=No\"),SUMIFS(Stations!S:S,Stations!$C:$C,\"=\"&$C71))","v":128},{"$f":"IF($N$1,SUMIFS(Stations!U:U,Stations!$C:$C,\"=\"&$C71,Stations!$W:$W,\"=No\"),SUMIFS(Stations!U:U,Stations!$C:$C,\"=\"&$C71))","v":107}]
[null,null,"GA","Georgia",null,{"$f":"IF($N$1,SUMIFS(Stations!L:L,Stations!$C:$C,\"=\"&$C72,Stations!$W:$W,\"=No\"),SUMIFS(Stations!L:L,Stations!$C:$C,\"=\"&$C72))","v":1139},{"$f":"IF($N$1,SUMIFS(Stations!M:M,Stations!$C:$C,\"=\"&$C72,Stations!$W:$W,\"=No\"),SUMIFS(Stations!M:M,Stations!$C:$C,\"=\"&$C72))","v":68},{"$f":"IF($N$1,SUMIFS(Stations!O:O,Stations!$C:$C,\"=\"&$C72,Stations!$W:$W,\"=No\"),SUMIFS(Stations!O:O,Stations!$C:$C,\"=\"&$C72))","v":0},{"$f":"IF($N$1,SUMIFS(Stations!Q:Q,Stations!$C:$C,\"=\"&$C72,Stations!$W:$W,\"=No\"),SUMIFS(Stations!Q:Q,Stations!$C:$C,\"=\"&$C72))","v":68},{"$f":"IF($N$1,SUMIFS(Stations!S:S,Stations!$C:$C,\"=\"&$C72,Stations!$W:$W,\"=No\"),SUMIFS(Stations!S:S,Stations!$C:$C,\"=\"&$C72))","v":139},{"$f":"IF($N$1,SUMIFS(Stations!U:U,Stations!$C:$C,\"=\"&$C72,Stations!$W:$W,\"=No\"),SUMIFS(Stations!U:U,Stations!$C:$C,\"=\"&$C72))","v":230}]
[null,null,"GU","Guam",null,{"$f":"IF($N$1,SUMIFS(Stations!L:L,Stations!$C:$C,\"=\"&$C73,Stations!$W:$W,\"=No\"),SUMIFS(Stations!L:L,Stations!$C:$C,\"=\"&$C73))","v":0},{"$f":"IF($N$1,SUMIFS(Stations!M:M,Stations!$C:$C,\"=\"&$C73,Stations!$W:$W,\"=No\"),SUMIFS(Stations!M:M,Stations!$C:$C,\"=\"&$C73))","v":0},{"$f":"IF($N$1,SUMIFS(Stations!O:O,Stations!$C:$C,\"=\"&$C73,Stations!$W:$W,\"=No\"),SUMIFS(Stations!O:O,Stations!$C:$C,\"=\"&$C73))","v":0},{"$f":"IF($N$1,SUMIFS(Stations!Q:Q,Stations!$C:$C,\"=\"&$C73,Stations!$W:$W,\"=No\"),SUMIFS(Stations!Q:Q,Stations!$C:$C,\"=\"&$C73))","v":0},{"$f":"IF($N$1,SUMIFS(Stations!S:S,Stations!$C:$C,\"=\"&$C73,Stations!$W:$W,\"=No\"),SUMIFS(Stations!S:S,Stations!$C:$C,\"=\"&$C73))","v":0},{"$f":"IF($N$1,SUMIFS(Stations!U:U,Stations!$C:$C,\"=\"&$C73,Stations!$W:$W,\"=No\"),SUMIFS(Stations!U:U,Stations!$C:$C,\"=\"&$C73))","v":0}]
[null,null,"HI","Hawaii",null,{"$f":"IF($N$1,SUMIFS(Stations!L:L,Stations!$C:$C,\"=\"&$C74,Stations!$W:$W,\"=No\"),SUMIFS(Stations!L:L,Stations!$C:$C,\"=\"&$C74))","v":478},{"$f":"IF($N$1,SUMIFS(Stations!M:M,Stations!$C:$C,\"=\"&$C74,Stations!$W:$W,\"=No\"),SUMIFS(Stations!M:M,Stations!$C:$C,\"=\"&$C74))","v":2},{"$f":"IF($N$1,SUMIFS(Stations!O:O,Stations!$C:$C,\"=\"&$C74,Stations!$W:$W,\"=No\"),SUMIFS(Stations!O:O,Stations!$C:$C,\"=\"&$C74))","v":0},{"$f":"IF($N$1,SUMIFS(Stations!Q:Q,Stations!$C:$C,\"=\"&$C74,Stations!$W:$W,\"=No\"),SUMIFS(Stations!Q:Q,Stations!$C:$C,\"=\"&$C74))","v":2},{"$f":"IF($N$1,SUMIFS(Stations!S:S,Stations!$C:$C,\"=\"&$C74,Stations!$W:$W,\"=No\"),SUMIFS(Stations!S:S,Stations!$C:$C,\"=\"&$C74))","v":0},{"$f":"IF($N$1,SUMIFS(Stations!U:U,Stations!$C:$C,\"=\"&$C74,Stations!$W:$W,\"=No\"),SUMIFS(Stations!U:U,Stations!$C:$C,\"=\"&$C74))","v":0}]
[null,null,"IA","Iowa",null,{"$f":"IF($N$1,SUMIFS(Stations!L:L,Stations!$C:$C,\"=\"&$C75,Stations!$W:$W,\"=No\"),SUMIFS(Stations!L:L,Stations!$C:$C,\"=\"&$C75))","v":346},{"$f":"IF($N$1,SUMIFS(Stations!M:M,Stations!$C:$C,\"=\"&$C75,Stations!$W:$W,\"=No\"),SUMIFS(Stations!M:M,Stations!$C:$C,\"=\"&$C75))","v":10},{"$f":"IF($N$1,SUMIFS(Stations!O:O,Stations!$C:$C,\"=\"&$C75,Stations!$W:$W,\"=No\"),SUMIFS(Stations!O:O,Stations!$C:$C,\"=\"&$C75))","v":0},{"$f":"IF($N$1,SUMIFS(Stations!Q:Q,Stations!$C:$C,\"=\"&$C75,Stations!$W:$W,\"=No\"),SUMIFS(Stations!Q:Q,Stations!$C:$C,\"=\"&$C75))","v":10},{"$f":"IF($N$1,SUMIFS(Stations!S:S,Stations!$C:$C,\"=\"&$C75,Stations!$W:$W,\"=No\"),SUMIFS(Stations!S:S,Stations!$C:$C,\"=\"&$C75))","v":9},{"$f":"IF($N$1,SUMIFS(Stations!U:U,Stations!$C:$C,\"=\"&$C75,Stations!$W:$W,\"=No\"),SUMIFS(Stations!U:U,Stations!$C:$C,\"=\"&$C75))","v":0}]
[null,null,"ID","Idaho",null,{"$f":"IF($N$1,SUMIFS(Stations!L:L,Stations!$C:$C,\"=\"&$C76,Stations!$W:$W,\"=No\"),SUMIFS(Stations!L:L,Stations!$C:$C,\"=\"&$C76))","v":77},{"$f":"IF($N$1,SUMIFS(Stations!M:M,Stations!$C:$C,\"=\"&$C76,Stations!$W:$W,\"=No\"),SUMIFS(Stations!M:M,Stations!$C:$C,\"=\"&$C76))","v":3},{"$f":"IF($N$1,SUMIFS(Stations!O:O,Stations!$C:$C,\"=\"&$C76,Stations!$W:$W,\"=No\"),SUMIFS(Stations!O:O,Stations!$C:$C,\"=\"&$C76))","v":0},{"$f":"IF($N$1,SUMIFS(Stations!Q:Q,Stations!$C:$C,\"=\"&$C76,Stations!$W:$W,\"=No\"),SUMIFS(Stations!Q:Q,Stations!$C:$C,\"=\"&$C76))","v":3},{"$f":"IF($N$1,SUMIFS(Stations!S:S,Stations!$C:$C,\"=\"&$C76,Stations!$W:$W,\"=No\"),SUMIFS(Stations!S:S,Stations!$C:$C,\"=\"&$C76))","v":0},{"$f":"IF($N$1,SUMIFS(Stations!U:U,Stations!$C:$C,\"=\"&$C76,Stations!$W:$W,\"=No\"),SUMIFS(Stations!U:U,Stations!$C:$C,\"=\"&$C76))","v":0}]
[null,null,"IL","Illinois",null,{"$f":"IF($N$1,SUMIFS(Stations!L:L,Stations!$C:$C,\"=\"&$C77,Stations!$W:$W,\"=No\"),SUMIFS(Stations!L:L,Stations!$C:$C,\"=\"&$C77))","v":4953},{"$f":"IF($N$1,SUMIFS(Stations!M:M,Stations!$C:$C,\"=\"&$C77,Stations!$W:$W,\"=No\"),SUMIFS(Stations!M:M,Stations!$C:$C,\"=\"&$C77))","v":459},{"$f":"IF($N$1,SUMIFS(Stations!O:O,Stations!$C:$C,\"=\"&$C77,Stations!$W:$W,\"=No\"),SUMIFS(Stations!O:O,Stations!$C:$C,\"=\"&$C77))","v":137},{"$f":"IF($N$1,SUMIFS(Stations!Q:Q,Stations!$C:$C,\"=\"&$C77,Stations!$W:$W,\"=No\"),SUMIFS(Stations!Q:Q,Stations!$C:$C,\"=\"&$C77))","v":596},{"$f":"IF($N$1,SUMIFS(Stations!S:S,Stations!$C:$C,\"=\"&$C77,Stations!$W:$W,\"=No\"),SUMIFS(Stations!S:S,Stations!$C:$C,\"=\"&$C77))","v":213},{"$f":"IF($N$1,SUMIFS(Stations!U:U,Stations!$C:$C,\"=\"&$C77,Stations!$W:$W,\"=No\"),SUMIFS(Stations!U:U,Stations!$C:$C,\"=\"&$C77))","v":205}]
[null,null,"IN","Indiana",null,{"$f":"IF($N$1,SUMIFS(Stations!L:L,Stations!$C:$C,\"=\"&$C78,Stations!$W:$W,\"=No\"),SUMIFS(Stations!L:L,Stations!$C:$C,\"=\"&$C78))","v":476},{"$f":"IF($N$1,SUMIFS(Stations!M:M,Stations!$C:$C,\"=\"&$C78,Stations!$W:$W,\"=No\"),SUMIFS(Stations!M:M,Stations!$C:$C,\"=\"&$C78))","v":28},{"$f":"IF($N$1,SUMIFS(Stations!O:O,Stations!$C:$C,\"=\"&$C78,Stations!$W:$W,\"=No\"),SUMIFS(Stations!O:O,Stations!$C:$C,\"=\"&$C78))","v":6},{"$f":"IF($N$1,SUMIFS(Stations!Q:Q,Stations!$C:$C,\"=\"&$C78,Stations!$W:$W,\"=No\"),SUMIFS(Stations!Q:Q,Stations!$C:$C,\"=\"&$C78))","v":34},{"$f":"IF($N$1,SUMIFS(Stations!S:S,Stations!$C:$C,\"=\"&$C78,Stations!$W:$W,\"=No\"),SUMIFS(Stations!S:S,Stations!$C:$C,\"=\"&$C78))","v":10},{"$f":"IF($N$1,SUMIFS(Stations!U:U,Stations!$C:$C,\"=\"&$C78,Stations!$W:$W,\"=No\"),SUMIFS(Stations!U:U,Stations!$C:$C,\"=\"&$C78))","v":2}]
[null,null,"KS","Kansas",null,{"$f":"IF($N$1,SUMIFS(Stations!L:L,Stations!$C:$C,\"=\"&$C79,Stations!$W:$W,\"=No\"),SUMIFS(Stations!L:L,Stations!$C:$C,\"=\"&$C79))","v":173},{"$f":"IF($N$1,SUMIFS(Stations!M:M,Stations!$C:$C,\"=\"&$C79,Stations!$W:$W,\"=No\"),SUMIFS(Stations!M:M,Stations!$C:$C,\"=\"&$C79))","v":3},{"$f":"IF($N$1,SUMIFS(Stations!O:O,Stations!$C:$C,\"=\"&$C79,Stations!$W:$W,\"=No\"),SUMIFS(Stations!O:O,Stations!$C:$C,\"=\"&$C79))","v":0},{"$f":"IF($N$1,SUMIFS(Stations!Q:Q,Stations!$C:$C,\"=\"&$C79,Stations!$W:$W,\"=No\"),SUMIFS(Stations!Q:Q,Stations!$C:$C,\"=\"&$C79))","v":3},{"$f":"IF($N$1,SUMIFS(Stations!S:S,Stations!$C:$C,\"=\"&$C79,Stations!$W:$W,\"=No\"),SUMIFS(Stations!S:S,Stations!$C:$C,\"=\"&$C79))","v":0},{"$f":"IF($N$1,SUMIFS(Stations!U:U,Stations!$C:$C,\"=\"&$C79,Stations!$W:$W,\"=No\"),SUMIFS(Stations!U:U,Stations!$C:$C,\"=\"&$C79))","v":0}]
[null,null,"KY","Kentucky",null,{"$f":"IF($N$1,SUMIFS(Stations!L:L,Stations!$C:$C,\"=\"&$C80,Stations!$W:$W,\"=No\"),SUMIFS(Stations!L:L,Stations!$C:$C,\"=\"&$C80))","v":350},{"$f":"IF($N$1,SUMIFS(Stations!M:M,Stations!$C:$C,\"=\"&$C80,Stations!$W:$W,\"=No\"),SUMIFS(Stations!M:M,Stations!$C:$C,\"=\"&$C80))","v":5},{"$f":"IF($N$1,SUMIFS(Stations!O:O,Stations!$C:$C,\"=\"&$C80,Stations!$W:$W,\"=No\"),SUMIFS(Stations!O:O,Stations!$C:$C,\"=\"&$C80))","v":0},{"$f":"IF($N$1,SUMIFS(Stations!Q:Q,Stations!$C:$C,\"=\"&$C80,Stations!$W:$W,\"=No\"),SUMIFS(Stations!Q:Q,Stations!$C:$C,\"=\"&$C80))","v":5},{"$f":"IF($N$1,SUMIFS(Stations!S:S,Stations!$C:$C,\"=\"&$C80,Stations!$W:$W,\"=No\"),SUMIFS(Stations!S:S,Stations!$C:$C,\"=\"&$C80))","v":1},{"$f":"IF($N$1,SUMIFS(Stations!U:U,Stations!$C:$C,\"=\"&$C80,Stations!$W:$W,\"=No\"),SUMIFS(Stations!U:U,Stations!$C:$C,\"=\"&$C80))","v":0}]
[null,null,"LA","Lousiana",null,{"$f":"IF($N$1,SUMIFS(Stations!L:L,Stations!$C:$C,\"=\"&$C81,Stations!$W:$W,\"=No\"),SUMIFS(Stations!L:L,Stations!$C:$C,\"=\"&$C81))","v":304},{"$f":"IF($N$1,SUMIFS(Stations!M:M,Stations!$C:$C,\"=\"&$C81,Stations!$W:$W,\"=No\"),SUMIFS(Stations!M:M,Stations!$C:$C,\"=\"&$C81))","v":33},{"$f":"IF($N$1,SUMIFS(Stations!O:O,Stations!$C:$C,\"=\"&$C81,Stations!$W:$W,\"=No\"),SUMIFS(Stations!O:O,Stations!$C:$C,\"=\"&$C81))","v":0},{"$f":"IF($N$1,SUMIFS(Stations!Q:Q,Stations!$C:$C,\"=\"&$C81,Stations!$W:$W,\"=No\"),SUMIFS(Stations!Q:Q,Stations!$C:$C,\"=\"&$C81))","v":33},{"$f":"IF($N$1,SUMIFS(Stations!S:S,Stations!$C:$C,\"=\"&$C81,Stations!$W:$W,\"=No\"),SUMIFS(Stations!S:S,Stations!$C:$C,\"=\"&$C81))","v":2},{"$f":"IF($N$1,SUMIFS(Stations!U:U,Stations!$C:$C,\"=\"&$C81,Stations!$W:$W,\"=No\"),SUMIFS(Stations!U:U,Stations!$C:$C,\"=\"&$C81))","v":0}]
[null,null,"MA","Massachusetts",null,{"$f":"IF($N$1,SUMIFS(Stations!L:L,Stations!$C:$C,\"=\"&$C82,Stations!$W:$W,\"=No\"),SUMIFS(Stations!L:L,Stations!$C:$C,\"=\"&$C82))","v":2375},{"$f":"IF($N$1,SUMIFS(Stations!M:M,Stations!$C:$C,\"=\"&$C82,Stations!$W:$W,\"=No\"),SUMIFS(Stations!M:M,Stations!$C:$C,\"=\"&$C82))","v":298},{"$f":"IF($N$1,SUMIFS(Stations!O:O,Stations!$C:$C,\"=\"&$C82,Stations!$W:$W,\"=No\"),SUMIFS(Stations!O:O,Stations!$C:$C,\"=\"&$C82))","v":73},{"$f":"IF($N$1,SUMIFS(Stations!Q:Q,Stations!$C:$C,\"=\"&$C82,Stations!$W:$W,\"=No\"),SUMIFS(Stations!Q:Q,Stations!$C:$C,\"=\"&$C82))","v":371},{"$f":"IF($N$1,SUMIFS(Stations!S:S,Stations!$C:$C,\"=\"&$C82,Stations!$W:$W,\"=No\"),SUMIFS(Stations!S:S,Stations!$C:$C,\"=\"&$C82))","v":202},{"$f":"IF($N$1,SUMIFS(Stations!U:U,Stations!$C:$C,\"=\"&$C82,Stations!$W:$W,\"=No\"),SUMIFS(Stations!U:U,Stations!$C:$C,\"=\"&$C82))","v":199}]
[null,null,"MD","Maryland",null,{"$f":"IF($N$1,SUMIFS(Stations!L:L,Stations!$C:$C,\"=\"&$C83,Stations!$W:$W,\"=No\"),SUMIFS(Stations!L:L,Stations!$C:$C,\"=\"&$C83))","v":1658},{"$f":"IF($N$1,SUMIFS(Stations!M:M,Stations!$C:$C,\"=\"&$C83,Stations!$W:$W,\"=No\"),SUMIFS(Stations!M:M,Stations!$C:$C,\"=\"&$C83))","v":82},{"$f":"IF($N$1,SUMIFS(Stations!O:O,Stations!$C:$C,\"=\"&$C83,Stations!$W:$W,\"=No\"),SUMIFS(Stations!O:O,Stations!$C:$C,\"=\"&$C83))","v":23},{"$f":"IF($N$1,SUMIFS(Stations!Q:Q,Stations!$C:$C,\"=\"&$C83,Stations!$W:$W,\"=No\"),SUMIFS(Stations!Q:Q,Stations!$C:$C,\"=\"&$C83))","v":105},{"$f":"IF($N$1,SUMIFS(Stations!S:S,Stations!$C:$C,\"=\"&$C83,Stations!$W:$W,\"=No\"),SUMIFS(Stations!S:S,Stations!$C:$C,\"=\"&$C83))","v":41},{"$f":"IF($N$1,SUMIFS(Stations!U:U,Stations!$C:$C,\"=\"&$C83,Stations!$W:$W,\"=No\"),SUMIFS(Stations!U:U,Stations!$C:$C,\"=\"&$C83))","v":84}]
[null,null,"ME","Maine",null,{"$f":"IF($N$1,SUMIFS(Stations!L:L,Stations!$C:$C,\"=\"&$C84,Stations!$W:$W,\"=No\"),SUMIFS(Stations!L:L,Stations!$C:$C,\"=\"&$C84))","v":102},{"$f":"IF($N$1,SUMIFS(Stations!M:M,Stations!$C:$C,\"=\"&$C84,Stations!$W:$W,\"=No\"),SUMIFS(Stations!M:M,Stations!$C:$C,\"=\"&$C84))","v":17},{"$f":"IF($N$1,SUMIFS(Stations!O:O,Stations!$C:$C,\"=\"&$C84,Stations!$W:$W,\"=No\"),SUMIFS(Stations!O:O,Stations!$C:$C,\"=\"&$C84))","v":0},{"$f":"IF($N$1,SUMIFS(Stations!Q:Q,Stations!$C:$C,\"=\"&$C84,Stations!$W:$W,\"=No\"),SUMIFS(Stations!Q:Q,Stations!$C:$C,\"=\"&$C84))","v":17},{"$f":"IF($N$1,SUMIFS(Stations!S:S,Stations!$C:$C,\"=\"&$C84,Stations!$W:$W,\"=No\"),SUMIFS(Stations!S:S,Stations!$C:$C,\"=\"&$C84))","v":2},{"$f":"IF($N$1,SUMIFS(Stations!U:U,Stations!$C:$C,\"=\"&$C84,Stations!$W:$W,\"=No\"),SUMIFS(Stations!U:U,Stations!$C:$C,\"=\"&$C84))","v":1}]
[null,null,"MI","Michigan",null,{"$f":"IF($N$1,SUMIFS(Stations!L:L,Stations!$C:$C,\"=\"&$C85,Stations!$W:$W,\"=No\"),SUMIFS(Stations!L:L,Stations!$C:$C,\"=\"&$C85))","v":1037},{"$f":"IF($N$1,SUMIFS(Stations!M:M,Stations!$C:$C,\"=\"&$C85,Stations!$W:$W,\"=No\"),SUMIFS(Stations!M:M,Stations!$C:$C,\"=\"&$C85))","v":36},{"$f":"IF($N$1,SUMIFS(Stations!O:O,Stations!$C:$C,\"=\"&$C85,Stations!$W:$W,\"=No\"),SUMIFS(Stations!O:O,Stations!$C:$C,\"=\"&$C85))","v":0},{"$f":"IF($N$1,SUMIFS(Stations!Q:Q,Stations!$C:$C,\"=\"&$C85,Stations!$W:$W,\"=No\"),SUMIFS(Stations!Q:Q,Stations!$C:$C,\"=\"&$C85))","v":36},{"$f":"IF($N$1,SUMIFS(Stations!S:S,Stations!$C:$C,\"=\"&$C85,Stations!$W:$W,\"=No\"),SUMIFS(Stations!S:S,Stations!$C:$C,\"=\"&$C85))","v":15},{"$f":"IF($N$1,SUMIFS(Stations!U:U,Stations!$C:$C,\"=\"&$C85,Stations!$W:$W,\"=No\"),SUMIFS(Stations!U:U,Stations!$C:$C,\"=\"&$C85))","v":16}]
[null,null,"MN","Minnesota",null,{"$f":"IF($N$1,SUMIFS(Stations!L:L,Stations!$C:$C,\"=\"&$C86,Stations!$W:$W,\"=No\"),SUMIFS(Stations!L:L,Stations!$C:$C,\"=\"&$C86))","v":1306},{"$f":"IF($N$1,SUMIFS(Stations!M:M,Stations!$C:$C,\"=\"&$C86,Stations!$W:$W,\"=No\"),SUMIFS(Stations!M:M,Stations!$C:$C,\"=\"&$C86))","v":107},{"$f":"IF($N$1,SUMIFS(Stations!O:O,Stations!$C:$C,\"=\"&$C86,Stations!$W:$W,\"=No\"),SUMIFS(Stations!O:O,Stations!$C:$C,\"=\"&$C86))","v":0},{"$f":"IF($N$1,SUMIFS(Stations!Q:Q,Stations!$C:$C,\"=\"&$C86,Stations!$W:$W,\"=No\"),SUMIFS(Stations!Q:Q,Stations!$C:$C,\"=\"&$C86))","v":107},{"$f":"IF($N$1,SUMIFS(Stations!S:S,Stations!$C:$C,\"=\"&$C86,Stations!$W:$W,\"=No\"),SUMIFS(Stations!S:S,Stations!$C:$C,\"=\"&$C86))","v":84},{"$f":"IF($N$1,SUMIFS(Stations!U:U,Stations!$C:$C,\"=\"&$C86,Stations!$W:$W,\"=No\"),SUMIFS(Stations!U:U,Stations!$C:$C,\"=\"&$C86))","v":36}]
[null,null,"MO","Missouri",null,{"$f":"IF($N$1,SUMIFS(Stations!L:L,Stations!$C:$C,\"=\"&$C87,Stations!$W:$W,\"=No\"),SUMIFS(Stations!L:L,Stations!$C:$C,\"=\"&$C87))","v":655},{"$f":"IF($N$1,SUMIFS(Stations!M:M,Stations!$C:$C,\"=\"&$C87,Stations!$W:$W,\"=No\"),SUMIFS(Stations!M:M,Stations!$C:$C,\"=\"&$C87))","v":71},{"$f":"IF($N$1,SUMIFS(Stations!O:O,Stations!$C:$C,\"=\"&$C87,Stations!$W:$W,\"=No\"),SUMIFS(Stations!O:O,Stations!$C:$C,\"=\"&$C87))","v":0},{"$f":"IF($N$1,SUMIFS(Stations!Q:Q,Stations!$C:$C,\"=\"&$C87,Stations!$W:$W,\"=No\"),SUMIFS(Stations!Q:Q,Stations!$C:$C,\"=\"&$C87))","v":71},{"$f":"IF($N$1,SUMIFS(Stations!S:S,Stations!$C:$C,\"=\"&$C87,Stations!$W:$W,\"=No\"),SUMIFS(Stations!S:S,Stations!$C:$C,\"=\"&$C87))","v":8},{"$f":"IF($N$1,SUMIFS(Stations!U:U,Stations!$C:$C,\"=\"&$C87,Stations!$W:$W,\"=No\"),SUMIFS(Stations!U:U,Stations!$C:$C,\"=\"&$C87))","v":19}]
[null,null,"MP","Northern Marianas",null,{"$f":"IF($N$1,SUMIFS(Stations!L:L,Stations!$C:$C,\"=\"&$C88,Stations!$W:$W,\"=No\"),SUMIFS(Stations!L:L,Stations!$C:$C,\"=\"&$C88))","v":0},{"$f":"IF($N$1,SUMIFS(Stations!M:M,Stations!$C:$C,\"=\"&$C88,Stations!$W:$W,\"=No\"),SUMIFS(Stations!M:M,Stations!$C:$C,\"=\"&$C88))","v":0},{"$f":"IF($N$1,SUMIFS(Stations!O:O,Stations!$C:$C,\"=\"&$C88,Stations!$W:$W,\"=No\"),SUMIFS(Stations!O:O,Stations!$C:$C,\"=\"&$C88))","v":0},{"$f":"IF($N$1,SUMIFS(Stations!Q:Q,Stations!$C:$C,\"=\"&$C88,Stations!$W:$W,\"=No\"),SUMIFS(Stations!Q:Q,Stations!$C:$C,\"=\"&$C88))","v":0},{"$f":"IF($N$1,SUMIFS(Stations!S:S,Stations!$C:$C,\"=\"&$C88,Stations!$W:$W,\"=No\"),SUMIFS(Stations!S:S,Stations!$C:$C,\"=\"&$C88))","v":0},{"$f":"IF($N$1,SUMIFS(Stations!U:U,Stations!$C:$C,\"=\"&$C88,Stations!$W:$W,\"=No\"),SUMIFS(Stations!U:U,Stations!$C:$C,\"=\"&$C88))","v":0}]
[null,null,"MS","Mississippi",null,{"$f":"IF($N$1,SUMIFS(Stations!L:L,Stations!$C:$C,\"=\"&$C89,Stations!$W:$W,\"=No\"),SUMIFS(Stations!L:L,Stations!$C:$C,\"=\"&$C89))","v":35},{"$f":"IF($N$1,SUMIFS(Stations!M:M,Stations!$C:$C,\"=\"&$C89,Stations!$W:$W,\"=No\"),SUMIFS(Stations!M:M,Stations!$C:$C,\"=\"&$C89))","v":10},{"$f":"IF($N$1,SUMIFS(Stations!O:O,Stations!$C:$C,\"=\"&$C89,Stations!$W:$W,\"=No\"),SUMIFS(Stations!O:O,Stations!$C:$C,\"=\"&$C89))","v":0},{"$f":"IF($N$1,SUMIFS(Stations!Q:Q,Stations!$C:$C,\"=\"&$C89,Stations!$W:$W,\"=No\"),SUMIFS(Stations!Q:Q,Stations!$C:$C,\"=\"&$C89))","v":10},{"$f":"IF($N$1,SUMIFS(Stations!S:S,Stations!$C:$C,\"=\"&$C89,Stations!$W:$W,\"=No\"),SUMIFS(Stations!S:S,Stations!$C:$C,\"=\"&$C89))","v":2},{"$f":"IF($N$1,SUMIFS(Stations!U:U,Stations!$C:$C,\"=\"&$C89,Stations!$W:$W,\"=No\"),SUMIFS(Stations!U:U,Stations!$C:$C,\"=\"&$C89))","v":0}]
[null,null,"MT","Montana",null,{"$f":"IF($N$1,SUMIFS(Stations!L:L,Stations!$C:$C,\"=\"&$C90,Stations!$W:$W,\"=No\"),SUMIFS(Stations!L:L,Stations!$C:$C,\"=\"&$C90))","v":78},{"$f":"IF($N$1,SUMIFS(Stations!M:M,Stations!$C:$C,\"=\"&$C90,Stations!$W:$W,\"=No\"),SUMIFS(Stations!M:M,Stations!$C:$C,\"=\"&$C90))","v":4},{"$f":"IF($N$1,SUMIFS(Stations!O:O,Stations!$C:$C,\"=\"&$C90,Stations!$W:$W,\"=No\"),SUMIFS(Stations!O:O,Stations!$C:$C,\"=\"&$C90))","v":0},{"$f":"IF($N$1,SUMIFS(Stations!Q:Q,Stations!$C:$C,\"=\"&$C90,Stations!$W:$W,\"=No\"),SUMIFS(Stations!Q:Q,Stations!$C:$C,\"=\"&$C90))","v":4},{"$f":"IF($N$1,SUMIFS(Stations!S:S,Stations!$C:$C,\"=\"&$C90,Stations!$W:$W,\"=No\"),SUMIFS(Stations!S:S,Stations!$C:$C,\"=\"&$C90))","v":1},{"$f":"IF($N$1,SUMIFS(Stations!U:U,Stations!$C:$C,\"=\"&$C90,Stations!$W:$W,\"=No\"),SUMIFS(Stations!U:U,Stations!$C:$C,\"=\"&$C90))","v":0}]
[null,null,"NC","North Carolina",null,{"$f":"IF($N$1,SUMIFS(Stations!L:L,Stations!$C:$C,\"=\"&$C91,Stations!$W:$W,\"=No\"),SUMIFS(Stations!L:L,Stations!$C:$C,\"=\"&$C91))","v":864},{"$f":"IF($N$1,SUMIFS(Stations!M:M,Stations!$C:$C,\"=\"&$C91,Stations!$W:$W,\"=No\"),SUMIFS(Stations!M:M,Stations!$C:$C,\"=\"&$C91))","v":48},{"$f":"IF($N$1,SUMIFS(Stations!O:O,Stations!$C:$C,\"=\"&$C91,Stations!$W:$W,\"=No\"),SUMIFS(Stations!O:O,Stations!$C:$C,\"=\"&$C91))","v":0},{"$f":"IF($N$1,SUMIFS(Stations!Q:Q,Stations!$C:$C,\"=\"&$C91,Stations!$W:$W,\"=No\"),SUMIFS(Stations!Q:Q,Stations!$C:$C,\"=\"&$C91))","v":48},{"$f":"IF($N$1,SUMIFS(Stations!S:S,Stations!$C:$C,\"=\"&$C91,Stations!$W:$W,\"=No\"),SUMIFS(Stations!S:S,Stations!$C:$C,\"=\"&$C91))","v":15},{"$f":"IF($N$1,SUMIFS(Stations!U:U,Stations!$C:$C,\"=\"&$C91,Stations!$W:$W,\"=No\"),SUMIFS(Stations!U:U,Stations!$C:$C,\"=\"&$C91))","v":1}]
[null,null,"ND","North Dakota",null,{"$f":"IF($N$1,SUMIFS(Stations!L:L,Stations!$C:$C,\"=\"&$C92,Stations!$W:$W,\"=No\"),SUMIFS(Stations!L:L,Stations!$C:$C,\"=\"&$C92))","v":40},{"$f":"IF($N$1,SUMIFS(Stations!M:M,Stations!$C:$C,\"=\"&$C92,Stations!$W:$W,\"=No\"),SUMIFS(Stations!M:M,Stations!$C:$C,\"=\"&$C92))","v":4},{"$f":"IF($N$1,SUMIFS(Stations!O:O,Stations!$C:$C,\"=\"&$C92,Stations!$W:$W,\"=No\"),SUMIFS(Stations!O:O,Stations!$C:$C,\"=\"&$C92))","v":0},{"$f":"IF($N$1,SUMIFS(Stations!Q:Q,Stations!$C:$C,\"=\"&$C92,Stations!$W:$W,\"=No\"),SUMIFS(Stations!Q:Q,Stations!$C:$C,\"=\"&$C92))","v":4},{"$f":"IF($N$1,SUMIFS(Stations!S:S,Stations!$C:$C,\"=\"&$C92,Stations!$W:$W,\"=No\"),SUMIFS(Stations!S:S,Stations!$C:$C,\"=\"&$C92))","v":1},{"$f":"IF($N$1,SUMIFS(Stations!U:U,Stations!$C:$C,\"=\"&$C92,Stations!$W:$W,\"=No\"),SUMIFS(Stations!U:U,Stations!$C:$C,\"=\"&$C92))","v":0}]
[null,null,"NE","Nebraska",null,{"$f":"IF($N$1,SUMIFS(Stations!L:L,Stations!$C:$C,\"=\"&$C93,Stations!$W:$W,\"=No\"),SUMIFS(Stations!L:L,Stations!$C:$C,\"=\"&$C93))","v":149},{"$f":"IF($N$1,SUMIFS(Stations!M:M,Stations!$C:$C,\"=\"&$C93,Stations!$W:$W,\"=No\"),SUMIFS(Stations!M:M,Stations!$C:$C,\"=\"&$C93))","v":2},{"$f":"IF($N$1,SUMIFS(Stations!O:O,Stations!$C:$C,\"=\"&$C93,Stations!$W:$W,\"=No\"),SUMIFS(Stations!O:O,Stations!$C:$C,\"=\"&$C93))","v":0},{"$f":"IF($N$1,SUMIFS(Stations!Q:Q,Stations!$C:$C,\"=\"&$C93,Stations!$W:$W,\"=No\"),SUMIFS(Stations!Q:Q,Stations!$C:$C,\"=\"&$C93))","v":2},{"$f":"IF($N$1,SUMIFS(Stations!S:S,Stations!$C:$C,\"=\"&$C93,Stations!$W:$W,\"=No\"),SUMIFS(Stations!S:S,Stations!$C:$C,\"=\"&$C93))","v":1},{"$f":"IF($N$1,SUMIFS(Stations!U:U,Stations!$C:$C,\"=\"&$C93,Stations!$W:$W,\"=No\"),SUMIFS(Stations!U:U,Stations!$C:$C,\"=\"&$C93))","v":0}]
[null,null,"NH","New Hampshire",null,{"$f":"IF($N$1,SUMIFS(Stations!L:L,Stations!$C:$C,\"=\"&$C94,Stations!$W:$W,\"=No\"),SUMIFS(Stations!L:L,Stations!$C:$C,\"=\"&$C94))","v":117},{"$f":"IF($N$1,SUMIFS(Stations!M:M,Stations!$C:$C,\"=\"&$C94,Stations!$W:$W,\"=No\"),SUMIFS(Stations!M:M,Stations!$C:$C,\"=\"&$C94))","v":15},{"$f":"IF($N$1,SUMIFS(Stations!O:O,Stations!$C:$C,\"=\"&$C94,Stations!$W:$W,\"=No\"),SUMIFS(Stations!O:O,Stations!$C:$C,\"=\"&$C94))","v":0},{"$f":"IF($N$1,SUMIFS(Stations!Q:Q,Stations!$C:$C,\"=\"&$C94,Stations!$W:$W,\"=No\"),SUMIFS(Stations!Q:Q,Stations!$C:$C,\"=\"&$C94))","v":15},{"$f":"IF($N$1,SUMIFS(Stations!S:S,Stations!$C:$C,\"=\"&$C94,Stations!$W:$W,\"=No\"),SUMIFS(Stations!S:S,Stations!$C:$C,\"=\"&$C94))","v":0},{"$f":"IF($N$1,SUMIFS(Stations!U:U,Stations!$C:$C,\"=\"&$C94,Stations!$W:$W,\"=No\"),SUMIFS(Stations!U:U,Stations!$C:$C,\"=\"&$C94))","v":0}]
[null,null,"NJ","New Jersey",null,{"$f":"IF($N$1,SUMIFS(Stations!L:L,Stations!$C:$C,\"=\"&$C95,Stations!$W:$W,\"=No\"),SUMIFS(Stations!L:L,Stations!$C:$C,\"=\"&$C95))","v":4743},{"$f":"IF($N$1,SUMIFS(Stations!M:M,Stations!$C:$C,\"=\"&$C95,Stations!$W:$W,\"=No\"),SUMIFS(Stations!M:M,Stations!$C:$C,\"=\"&$C95))","v":208},{"$f":"IF($N$1,SUMIFS(Stations!O:O,Stations!$C:$C,\"=\"&$C95,Stations!$W:$W,\"=No\"),SUMIFS(Stations!O:O,Stations!$C:$C,\"=\"&$C95))","v":107},{"$f":"IF($N$1,SUMIFS(Stations!Q:Q,Stations!$C:$C,\"=\"&$C95,Stations!$W:$W,\"=No\"),SUMIFS(Stations!Q:Q,Stations!$C:$C,\"=\"&$C95))","v":315},{"$f":"IF($N$1,SUMIFS(Stations!S:S,Stations!$C:$C,\"=\"&$C95,Stations!$W:$W,\"=No\"),SUMIFS(Stations!S:S,Stations!$C:$C,\"=\"&$C95))","v":186},{"$f":"IF($N$1,SUMIFS(Stations!U:U,Stations!$C:$C,\"=\"&$C95,Stations!$W:$W,\"=No\"),SUMIFS(Stations!U:U,Stations!$C:$C,\"=\"&$C95))","v":129}]
[null,null,"NM","New Mexico",null,{"$f":"IF($N$1,SUMIFS(Stations!L:L,Stations!$C:$C,\"=\"&$C96,Stations!$W:$W,\"=No\"),SUMIFS(Stations!L:L,Stations!$C:$C,\"=\"&$C96))","v":221},{"$f":"IF($N$1,SUMIFS(Stations!M:M,Stations!$C:$C,\"=\"&$C96,Stations!$W:$W,\"=No\"),SUMIFS(Stations!M:M,Stations!$C:$C,\"=\"&$C96))","v":20},{"$f":"IF($N$1,SUMIFS(Stations!O:O,Stations!$C:$C,\"=\"&$C96,Stations!$W:$W,\"=No\"),SUMIFS(Stations!O:O,Stations!$C:$C,\"=\"&$C96))","v":0},{"$f":"IF($N$1,SUMIFS(Stations!Q:Q,Stations!$C:$C,\"=\"&$C96,Stations!$W:$W,\"=No\"),SUMIFS(Stations!Q:Q,Stations!$C:$C,\"=\"&$C96))","v":20},{"$f":"IF($N$1,SUMIFS(Stations!S:S,Stations!$C:$C,\"=\"&$C96,Stations!$W:$W,\"=No\"),SUMIFS(Stations!S:S,Stations!$C:$C,\"=\"&$C96))","v":1},{"$f":"IF($N$1,SUMIFS(Stations!U:U,Stations!$C:$C,\"=\"&$C96,Stations!$W:$W,\"=No\"),SUMIFS(Stations!U:U,Stations!$C:$C,\"=\"&$C96))","v":0}]
[null,null,"NV","Nevada",null,{"$f":"IF($N$1,SUMIFS(Stations!L:L,Stations!$C:$C,\"=\"&$C97,Stations!$W:$W,\"=No\"),SUMIFS(Stations!L:L,Stations!$C:$C,\"=\"&$C97))","v":459},{"$f":"IF($N$1,SUMIFS(Stations!M:M,Stations!$C:$C,\"=\"&$C97,Stations!$W:$W,\"=No\"),SUMIFS(Stations!M:M,Stations!$C:$C,\"=\"&$C97))","v":20},{"$f":"IF($N$1,SUMIFS(Stations!O:O,Stations!$C:$C,\"=\"&$C97,Stations!$W:$W,\"=No\"),SUMIFS(Stations!O:O,Stations!$C:$C,\"=\"&$C97))","v":0},{"$f":"IF($N$1,SUMIFS(Stations!Q:Q,Stations!$C:$C,\"=\"&$C97,Stations!$W:$W,\"=No\"),SUMIFS(Stations!Q:Q,Stations!$C:$C,\"=\"&$C97))","v":20},{"$f":"IF($N$1,SUMIFS(Stations!S:S,Stations!$C:$C,\"=\"&$C97,Stations!$W:$W,\"=No\"),SUMIFS(Stations!S:S,Stations!$C:$C,\"=\"&$C97))","v":26},{"$f":"IF($N$1,SUMIFS(Stations!U:U,Stations!$C:$C,\"=\"&$C97,Stations!$W:$W,\"=No\"),SUMIFS(Stations!U:U,Stations!$C:$C,\"=\"&$C97))","v":11}]
[null,null,"NY","New York",null,{"$f":"IF($N$1,SUMIFS(Stations!L:L,Stations!$C:$C,\"=\"&$C98,Stations!$W:$W,\"=No\"),SUMIFS(Stations!L:L,Stations!$C:$C,\"=\"&$C98))","v":14525},{"$f":"IF($N$1,SUMIFS(Stations!M:M,Stations!$C:$C,\"=\"&$C98,Stations!$W:$W,\"=No\"),SUMIFS(Stations!M:M,Stations!$C:$C,\"=\"&$C98))","v":337},{"$f":"IF($N$1,SUMIFS(Stations!O:O,Stations!$C:$C,\"=\"&$C98,Stations!$W:$W,\"=No\"),SUMIFS(Stations!O:O,Stations!$C:$C,\"=\"&$C98))","v":467},{"$f":"IF($N$1,SUMIFS(Stations!Q:Q,Stations!$C:$C,\"=\"&$C98,Stations!$W:$W,\"=No\"),SUMIFS(Stations!Q:Q,Stations!$C:$C,\"=\"&$C98))","v":804},{"$f":"IF($N$1,SUMIFS(Stations!S:S,Stations!$C:$C,\"=\"&$C98,Stations!$W:$W,\"=No\"),SUMIFS(Stations!S:S,Stations!$C:$C,\"=\"&$C98))","v":480},{"$f":"IF($N$1,SUMIFS(Stations!U:U,Stations!$C:$C,\"=\"&$C98,Stations!$W:$W,\"=No\"),SUMIFS(Stations!U:U,Stations!$C:$C,\"=\"&$C98))","v":290}]
[null,null,"OH","Ohio",null,{"$f":"IF($N$1,SUMIFS(Stations!L:L,Stations!$C:$C,\"=\"&$C99,Stations!$W:$W,\"=No\"),SUMIFS(Stations!L:L,Stations!$C:$C,\"=\"&$C99))","v":1544},{"$f":"IF($N$1,SUMIFS(Stations!M:M,Stations!$C:$C,\"=\"&$C99,Stations!$W:$W,\"=No\"),SUMIFS(Stations!M:M,Stations!$C:$C,\"=\"&$C99))","v":98},{"$f":"IF($N$1,SUMIFS(Stations!O:O,Stations!$C:$C,\"=\"&$C99,Stations!$W:$W,\"=No\"),SUMIFS(Stations!O:O,Stations!$C:$C,\"=\"&$C99))","v":24},{"$f":"IF($N$1,SUMIFS(Stations!Q:Q,Stations!$C:$C,\"=\"&$C99,Stations!$W:$W,\"=No\"),SUMIFS(Stations!Q:Q,Stations!$C:$C,\"=\"&$C99))","v":122},{"$f":"IF($N$1,SUMIFS(Stations!S:S,Stations!$C:$C,\"=\"&$C99,Stations!$W:$W,\"=No\"),SUMIFS(Stations!S:S,Stations!$C:$C,\"=\"&$C99))","v":30},{"$f":"IF($N$1,SUMIFS(Stations!U:U,Stations!$C:$C,\"=\"&$C99,Stations!$W:$W,\"=No\"),SUMIFS(Stations!U:U,Stations!$C:$C,\"=\"&$C99))","v":14}]
[null,null,"OK","Oklahoma",null,{"$f":"IF($N$1,SUMIFS(Stations!L:L,Stations!$C:$C,\"=\"&$C100,Stations!$W:$W,\"=No\"),SUMIFS(Stations!L:L,Stations!$C:$C,\"=\"&$C100))","v":158},{"$f":"IF($N$1,SUMIFS(Stations!M:M,Stations!$C:$C,\"=\"&$C100,Stations!$W:$W,\"=No\"),SUMIFS(Stations!M:M,Stations!$C:$C,\"=\"&$C100))","v":12},{"$f":"IF($N$1,SUMIFS(Stations!O:O,Stations!$C:$C,\"=\"&$C100,Stations!$W:$W,\"=No\"),SUMIFS(Stations!O:O,Stations!$C:$C,\"=\"&$C100))","v":0},{"$f":"IF($N$1,SUMIFS(Stations!Q:Q,Stations!$C:$C,\"=\"&$C100,Stations!$W:$W,\"=No\"),SUMIFS(Stations!Q:Q,Stations!$C:$C,\"=\"&$C100))","v":12},{"$f":"IF($N$1,SUMIFS(Stations!S:S,Stations!$C:$C,\"=\"&$C100,Stations!$W:$W,\"=No\"),SUMIFS(Stations!S:S,Stations!$C:$C,\"=\"&$C100))","v":0},{"$f":"IF($N$1,SUMIFS(Stations!U:U,Stations!$C:$C,\"=\"&$C100,Stations!$W:$W,\"=No\"),SUMIFS(Stations!U:U,Stations!$C:$C,\"=\"&$C100))","v":0}]
[null,null,"OR","Oregon",null,{"$f":"IF($N$1,SUMIFS(Stations!L:L,Stations!$C:$C,\"=\"&$C101,Stations!$W:$W,\"=No\"),SUMIFS(Stations!L:L,Stations!$C:$C,\"=\"&$C101))","v":906},{"$f":"IF($N$1,SUMIFS(Stations!M:M,Stations!$C:$C,\"=\"&$C101,Stations!$W:$W,\"=No\"),SUMIFS(Stations!M:M,Stations!$C:$C,\"=\"&$C101))","v":86},{"$f":"IF($N$1,SUMIFS(Stations!O:O,Stations!$C:$C,\"=\"&$C101,Stations!$W:$W,\"=No\"),SUMIFS(Stations!O:O,Stations!$C:$C,\"=\"&$C101))","v":0},{"$f":"IF($N$1,SUMIFS(Stations!Q:Q,Stations!$C:$C,\"=\"&$C101,Stations!$W:$W,\"=No\"),SUMIFS(Stations!Q:Q,Stations!$C:$C,\"=\"&$C101))","v":86},{"$f":"IF($N$1,SUMIFS(Stations!S:S,Stations!$C:$C,\"=\"&$C101,Stations!$W:$W,\"=No\"),SUMIFS(Stations!S:S,Stations!$C:$C,\"=\"&$C101))","v":17},{"$f":"IF($N$1,SUMIFS(Stations!U:U,Stations!$C:$C,\"=\"&$C101,Stations!$W:$W,\"=No\"),SUMIFS(Stations!U:U,Stations!$C:$C,\"=\"&$C101))","v":0}]
[null,null,"PA","Pennsylvania",null,{"$f":"IF($N$1,SUMIFS(Stations!L:L,Stations!$C:$C,\"=\"&$C102,Stations!$W:$W,\"=No\"),SUMIFS(Stations!L:L,Stations!$C:$C,\"=\"&$C102))","v":3401},{"$f":"IF($N$1,SUMIFS(Stations!M:M,Stations!$C:$C,\"=\"&$C102,Stations!$W:$W,\"=No\"),SUMIFS(Stations!M:M,Stations!$C:$C,\"=\"&$C102))","v":202},{"$f":"IF($N$1,SUMIFS(Stations!O:O,Stations!$C:$C,\"=\"&$C102,Stations!$W:$W,\"=No\"),SUMIFS(Stations!O:O,Stations!$C:$C,\"=\"&$C102))","v":177},{"$f":"IF($N$1,SUMIFS(Stations!Q:Q,Stations!$C:$C,\"=\"&$C102,Stations!$W:$W,\"=No\"),SUMIFS(Stations!Q:Q,Stations!$C:$C,\"=\"&$C102))","v":379},{"$f":"IF($N$1,SUMIFS(Stations!S:S,Stations!$C:$C,\"=\"&$C102,Stations!$W:$W,\"=No\"),SUMIFS(Stations!S:S,Stations!$C:$C,\"=\"&$C102))","v":153},{"$f":"IF($N$1,SUMIFS(Stations!U:U,Stations!$C:$C,\"=\"&$C102,Stations!$W:$W,\"=No\"),SUMIFS(Stations!U:U,Stations!$C:$C,\"=\"&$C102))","v":90}]
[null,null,"PR","Puerto Rico",null,{"$f":"IF($N$1,SUMIFS(Stations!L:L,Stations!$C:$C,\"=\"&$C103,Stations!$W:$W,\"=No\"),SUMIFS(Stations!L:L,Stations!$C:$C,\"=\"&$C103))","v":356},{"$f":"IF($N$1,SUMIFS(Stations!M:M,Stations!$C:$C,\"=\"&$C103,Stations!$W:$W,\"=No\"),SUMIFS(Stations!M:M,Stations!$C:$C,\"=\"&$C103))","v":72},{"$f":"IF($N$1,SUMIFS(Stations!O:O,Stations!$C:$C,\"=\"&$C103,Stations!$W:$W,\"=No\"),SUMIFS(Stations!O:O,Stations!$C:$C,\"=\"&$C103))","v":0},{"$f":"IF($N$1,SUMIFS(Stations!Q:Q,Stations!$C:$C,\"=\"&$C103,Stations!$W:$W,\"=No\"),SUMIFS(Stations!Q:Q,Stations!$C:$C,\"=\"&$C103))","v":72},{"$f":"IF($N$1,SUMIFS(Stations!S:S,Stations!$C:$C,\"=\"&$C103,Stations!$W:$W,\"=No\"),SUMIFS(Stations!S:S,Stations!$C:$C,\"=\"&$C103))","v":41},{"$f":"IF($N$1,SUMIFS(Stations!U:U,Stations!$C:$C,\"=\"&$C103,Stations!$W:$W,\"=No\"),SUMIFS(Stations!U:U,Stations!$C:$C,\"=\"&$C103))","v":57}]
[null,null,"RI","Rhode Island",null,{"$f":"IF($N$1,SUMIFS(Stations!L:L,Stations!$C:$C,\"=\"&$C104,Stations!$W:$W,\"=No\"),SUMIFS(Stations!L:L,Stations!$C:$C,\"=\"&$C104))","v":195},{"$f":"IF($N$1,SUMIFS(Stations!M:M,Stations!$C:$C,\"=\"&$C104,Stations!$W:$W,\"=No\"),SUMIFS(Stations!M:M,Stations!$C:$C,\"=\"&$C104))","v":1},{"$f":"IF($N$1,SUMIFS(Stations!O:O,Stations!$C:$C,\"=\"&$C104,Stations!$W:$W,\"=No\"),SUMIFS(Stations!O:O,Stations!$C:$C,\"=\"&$C104))","v":0},{"$f":"IF($N$1,SUMIFS(Stations!Q:Q,Stations!$C:$C,\"=\"&$C104,Stations!$W:$W,\"=No\"),SUMIFS(Stations!Q:Q,Stations!$C:$C,\"=\"&$C104))","v":1},{"$f":"IF($N$1,SUMIFS(Stations!S:S,Stations!$C:$C,\"=\"&$C104,Stations!$W:$W,\"=No\"),SUMIFS(Stations!S:S,Stations!$C:$C,\"=\"&$C104))","v":0},{"$f":"IF($N$1,SUMIFS(Stations!U:U,Stations!$C:$C,\"=\"&$C104,Stations!$W:$W,\"=No\"),SUMIFS(Stations!U:U,Stations!$C:$C,\"=\"&$C104))","v":0}]
[null,null,"SC","South Carolina",null,{"$f":"IF($N$1,SUMIFS(Stations!L:L,Stations!$C:$C,\"=\"&$C105,Stations!$W:$W,\"=No\"),SUMIFS(Stations!L:L,Stations!$C:$C,\"=\"&$C105))","v":238},{"$f":"IF($N$1,SUMIFS(Stations!M:M,Stations!$C:$C,\"=\"&$C105,Stations!$W:$W,\"=No\"),SUMIFS(Stations!M:M,Stations!$C:$C,\"=\"&$C105))","v":11},{"$f":"IF($N$1,SUMIFS(Stations!O:O,Stations!$C:$C,\"=\"&$C105,Stations!$W:$W,\"=No\"),SUMIFS(Stations!O:O,Stations!$C:$C,\"=\"&$C105))","v":0},{"$f":"IF($N$1,SUMIFS(Stations!Q:Q,Stations!$C:$C,\"=\"&$C105,Stations!$W:$W,\"=No\"),SUMIFS(Stations!Q:Q,Stations!$C:$C,\"=\"&$C105))","v":11},{"$f":"IF($N$1,SUMIFS(Stations!S:S,Stations!$C:$C,\"=\"&$C105,Stations!$W:$W,\"=No\"),SUMIFS(Stations!S:S,Stations!$C:$C,\"=\"&$C105))","v":1},{"$f":"IF($N$1,SUMIFS(Stations!U:U,Stations!$C:$C,\"=\"&$C105,Stations!$W:$W,\"=No\"),SUMIFS(Stations!U:U,Stations!$C:$C,\"=\"&$C105))","v":0}]
[null,null,"SD","South Dakota",null,{"$f":"IF($N$1,SUMIFS(Stations!L:L,Stations!$C:$C,\"=\"&$C106,Stations!$W:$W,\"=No\"),SUMIFS(Stations!L:L,Stations!$C:$C,\"=\"&$C106))","v":45},{"$f":"IF($N$1,SUMIFS(Stations!M:M,Stations!$C:$C,\"=\"&$C106,Stations!$W:$W,\"=No\"),SUMIFS(Stations!M:M,Stations!$C:$C,\"=\"&$C106))","v":3},{"$f":"IF($N$1,SUMIFS(Stations!O:O,Stations!$C:$C,\"=\"&$C106,Stations!$W:$W,\"=No\"),SUMIFS(Stations!O:O,Stations!$C:$C,\"=\"&$C106))","v":0},{"$f":"IF($N$1,SUMIFS(Stations!Q:Q,Stations!$C:$C,\"=\"&$C106,Stations!$W:$W,\"=No\"),SUMIFS(Stations!Q:Q,Stations!$C:$C,\"=\"&$C106))","v":3},{"$f":"IF($N$1,SUMIFS(Stations!S:S,Stations!$C:$C,\"=\"&$C106,Stations!$W:$W,\"=No\"),SUMIFS(Stations!S:S,Stations!$C:$C,\"=\"&$C106))","v":0},{"$f":"IF($N$1,SUMIFS(Stations!U:U,Stations!$C:$C,\"=\"&$C106,Stations!$W:$W,\"=No\"),SUMIFS(Stations!U:U,Stations!$C:$C,\"=\"&$C106))","v":0}]
[null,null,"TN","Tennessee",null,{"$f":"IF($N$1,SUMIFS(Stations!L:L,Stations!$C:$C,\"=\"&$C107,Stations!$W:$W,\"=No\"),SUMIFS(Stations!L:L,Stations!$C:$C,\"=\"&$C107))","v":470},{"$f":"IF($N$1,SUMIFS(Stations!M:M,Stations!$C:$C,\"=\"&$C107,Stations!$W:$W,\"=No\"),SUMIFS(Stations!M:M,Stations!$C:$C,\"=\"&$C107))","v":30},{"$f":"IF($N$1,SUMIFS(Stations!O:O,Stations!$C:$C,\"=\"&$C107,Stations!$W:$W,\"=No\"),SUMIFS(Stations!O:O,Stations!$C:$C,\"=\"&$C107))","v":0},{"$f":"IF($N$1,SUMIFS(Stations!Q:Q,Stations!$C:$C,\"=\"&$C107,Stations!$W:$W,\"=No\"),SUMIFS(Stations!Q:Q,Stations!$C:$C,\"=\"&$C107))","v":30},{"$f":"IF($N$1,SUMIFS(Stations!S:S,Stations!$C:$C,\"=\"&$C107,Stations!$W:$W,\"=No\"),SUMIFS(Stations!S:S,Stations!$C:$C,\"=\"&$C107))","v":9},{"$f":"IF($N$1,SUMIFS(Stations!U:U,Stations!$C:$C,\"=\"&$C107,Stations!$W:$W,\"=No\"),SUMIFS(Stations!U:U,Stations!$C:$C,\"=\"&$C107))","v":5}]
[null,null,"TX","Texas",null,{"$f":"IF($N$1,SUMIFS(Stations!L:L,Stations!$C:$C,\"=\"&$C108,Stations!$W:$W,\"=No\"),SUMIFS(Stations!L:L,Stations!$C:$C,\"=\"&$C108))","v":3253},{"$f":"IF($N$1,SUMIFS(Stations!M:M,Stations!$C:$C,\"=\"&$C108,Stations!$W:$W,\"=No\"),SUMIFS(Stations!M:M,Stations!$C:$C,\"=\"&$C108))","v":329},{"$f":"IF($N$1,SUMIFS(Stations!O:O,Stations!$C:$C,\"=\"&$C108,Stations!$W:$W,\"=No\"),SUMIFS(Stations!O:O,Stations!$C:$C,\"=\"&$C108))","v":2},{"$f":"IF($N$1,SUMIFS(Stations!Q:Q,Stations!$C:$C,\"=\"&$C108,Stations!$W:$W,\"=No\"),SUMIFS(Stations!Q:Q,Stations!$C:$C,\"=\"&$C108))","v":331},{"$f":"IF($N$1,SUMIFS(Stations!S:S,Stations!$C:$C,\"=\"&$C108,Stations!$W:$W,\"=No\"),SUMIFS(Stations!S:S,Stations!$C:$C,\"=\"&$C108))","v":62},{"$f":"IF($N$1,SUMIFS(Stations!U:U,Stations!$C:$C,\"=\"&$C108,Stations!$W:$W,\"=No\"),SUMIFS(Stations!U:U,Stations!$C:$C,\"=\"&$C108))","v":16}]
[null,null,"UT","Utah",null,{"$f":"IF($N$1,SUMIFS(Stations!L:L,Stations!$C:$C,\"=\"&$C109,Stations!$W:$W,\"=No\"),SUMIFS(Stations!L:L,Stations!$C:$C,\"=\"&$C109))","v":602},{"$f":"IF($N$1,SUMIFS(Stations!M:M,Stations!$C:$C,\"=\"&$C109,Stations!$W:$W,\"=No\"),SUMIFS(Stations!M:M,Stations!$C:$C,\"=\"&$C109))","v":103},{"$f":"IF($N$1,SUMIFS(Stations!O:O,Stations!$C:$C,\"=\"&$C109,Stations!$W:$W,\"=No\"),SUMIFS(Stations!O:O,Stations!$C:$C,\"=\"&$C109))","v":0},{"$f":"IF($N$1,SUMIFS(Stations!Q:Q,Stations!$C:$C,\"=\"&$C109,Stations!$W:$W,\"=No\"),SUMIFS(Stations!Q:Q,Stations!$C:$C,\"=\"&$C109))","v":103},{"$f":"IF($N$1,SUMIFS(Stations!S:S,Stations!$C:$C,\"=\"&$C109,Stations!$W:$W,\"=No\"),SUMIFS(Stations!S:S,Stations!$C:$C,\"=\"&$C109))","v":12},{"$f":"IF($N$1,SUMIFS(Stations!U:U,Stations!$C:$C,\"=\"&$C109,Stations!$W:$W,\"=No\"),SUMIFS(Stations!U:U,Stations!$C:$C,\"=\"&$C109))","v":2}]
[null,null,"VA","Virginia",null,{"$f":"IF($N$1,SUMIFS(Stations!L:L,Stations!$C:$C,\"=\"&$C110,Stations!$W:$W,\"=No\"),SUMIFS(Stations!L:L,Stations!$C:$C,\"=\"&$C110))","v":1295},{"$f":"IF($N$1,SUMIFS(Stations!M:M,Stations!$C:$C,\"=\"&$C110,Stations!$W:$W,\"=No\"),SUMIFS(Stations!M:M,Stations!$C:$C,\"=\"&$C110))","v":85},{"$f":"IF($N$1,SUMIFS(Stations!O:O,Stations!$C:$C,\"=\"&$C110,Stations!$W:$W,\"=No\"),SUMIFS(Stations!O:O,Stations!$C:$C,\"=\"&$C110))","v":0},{"$f":"IF($N$1,SUMIFS(Stations!Q:Q,Stations!$C:$C,\"=\"&$C110,Stations!$W:$W,\"=No\"),SUMIFS(Stations!Q:Q,Stations!$C:$C,\"=\"&$C110))","v":85},{"$f":"IF($N$1,SUMIFS(Stations!S:S,Stations!$C:$C,\"=\"&$C110,Stations!$W:$W,\"=No\"),SUMIFS(Stations!S:S,Stations!$C:$C,\"=\"&$C110))","v":17},{"$f":"IF($N$1,SUMIFS(Stations!U:U,Stations!$C:$C,\"=\"&$C110,Stations!$W:$W,\"=No\"),SUMIFS(Stations!U:U,Stations!$C:$C,\"=\"&$C110))","v":2}]
[null,null,"VI","Virgin Islands",null,{"$f":"IF($N$1,SUMIFS(Stations!L:L,Stations!$C:$C,\"=\"&$C111,Stations!$W:$W,\"=No\"),SUMIFS(Stations!L:L,Stations!$C:$C,\"=\"&$C111))","v":16},{"$f":"IF($N$1,SUMIFS(Stations!M:M,Stations!$C:$C,\"=\"&$C111,Stations!$W:$W,\"=No\"),SUMIFS(Stations!M:M,Stations!$C:$C,\"=\"&$C111))","v":0},{"$f":"IF($N$1,SUMIFS(Stations!O:O,Stations!$C:$C,\"=\"&$C111,Stations!$W:$W,\"=No\"),SUMIFS(Stations!O:O,Stations!$C:$C,\"=\"&$C111))","v":0},{"$f":"IF($N$1,SUMIFS(Stations!Q:Q,Stations!$C:$C,\"=\"&$C111,Stations!$W:$W,\"=No\"),SUMIFS(Stations!Q:Q,Stations!$C:$C,\"=\"&$C111))","v":0},{"$f":"IF($N$1,SUMIFS(Stations!S:S,Stations!$C:$C,\"=\"&$C111,Stations!$W:$W,\"=No\"),SUMIFS(Stations!S:S,Stations!$C:$C,\"=\"&$C111))","v":1},{"$f":"IF($N$1,SUMIFS(Stations!U:U,Stations!$C:$C,\"=\"&$C111,Stations!$W:$W,\"=No\"),SUMIFS(Stations!U:U,Stations!$C:$C,\"=\"&$C111))","v":0}]
[null,null,"VT","Vermont",null,{"$f":"IF($N$1,SUMIFS(Stations!L:L,Stations!$C:$C,\"=\"&$C112,Stations!$W:$W,\"=No\"),SUMIFS(Stations!L:L,Stations!$C:$C,\"=\"&$C112))","v":54},{"$f":"IF($N$1,SUMIFS(Stations!M:M,Stations!$C:$C,\"=\"&$C112,Stations!$W:$W,\"=No\"),SUMIFS(Stations!M:M,Stations!$C:$C,\"=\"&$C112))","v":2},{"$f":"IF($N$1,SUMIFS(Stations!O:O,Stations!$C:$C,\"=\"&$C112,Stations!$W:$W,\"=No\"),SUMIFS(Stations!O:O,Stations!$C:$C,\"=\"&$C112))","v":0},{"$f":"IF($N$1,SUMIFS(Stations!Q:Q,Stations!$C:$C,\"=\"&$C112,Stations!$W:$W,\"=No\"),SUMIFS(Stations!Q:Q,Stations!$C:$C,\"=\"&$C112))","v":2},{"$f":"IF($N$1,SUMIFS(Stations!S:S,Stations!$C:$C,\"=\"&$C112,Stations!$W:$W,\"=No\"),SUMIFS(Stations!S:S,Stations!$C:$C,\"=\"&$C112))","v":0},{"$f":"IF($N$1,SUMIFS(Stations!U:U,Stations!$C:$C,\"=\"&$C112,Stations!$W:$W,\"=No\"),SUMIFS(Stations!U:U,Stations!$C:$C,\"=\"&$C112))","v":0}]
[null,null,"WA","Washington",null,{"$f":"IF($N$1,SUMIFS(Stations!L:L,Stations!$C:$C,\"=\"&$C113,Stations!$W:$W,\"=No\"),SUMIFS(Stations!L:L,Stations!$C:$C,\"=\"&$C113))","v":2452},{"$f":"IF($N$1,SUMIFS(Stations!M:M,Stations!$C:$C,\"=\"&$C113,Stations!$W:$W,\"=No\"),SUMIFS(Stations!M:M,Stations!$C:$C,\"=\"&$C113))","v":189},{"$f":"IF($N$1,SUMIFS(Stations!O:O,Stations!$C:$C,\"=\"&$C113,Stations!$W:$W,\"=No\"),SUMIFS(Stations!O:O,Stations!$C:$C,\"=\"&$C113))","v":4},{"$f":"IF($N$1,SUMIFS(Stations!Q:Q,Stations!$C:$C,\"=\"&$C113,Stations!$W:$W,\"=No\"),SUMIFS(Stations!Q:Q,Stations!$C:$C,\"=\"&$C113))","v":193},{"$f":"IF($N$1,SUMIFS(Stations!S:S,Stations!$C:$C,\"=\"&$C113,Stations!$W:$W,\"=No\"),SUMIFS(Stations!S:S,Stations!$C:$C,\"=\"&$C113))","v":123},{"$f":"IF($N$1,SUMIFS(Stations!U:U,Stations!$C:$C,\"=\"&$C113,Stations!$W:$W,\"=No\"),SUMIFS(Stations!U:U,Stations!$C:$C,\"=\"&$C113))","v":115}]
[null,null,"WI","Wisconsin",null,{"$f":"IF($N$1,SUMIFS(Stations!L:L,Stations!$C:$C,\"=\"&$C114,Stations!$W:$W,\"=No\"),SUMIFS(Stations!L:L,Stations!$C:$C,\"=\"&$C114))","v":813},{"$f":"IF($N$1,SUMIFS(Stations!M:M,Stations!$C:$C,\"=\"&$C114,Stations!$W:$W,\"=No\"),SUMIFS(Stations!M:M,Stations!$C:$C,\"=\"&$C114))","v":19},{"$f":"IF($N$1,SUMIFS(Stations!O:O,Stations!$C:$C,\"=\"&$C114,Stations!$W:$W,\"=No\"),SUMIFS(Stations!O:O,Stations!$C:$C,\"=\"&$C114))","v":0},{"$f":"IF($N$1,SUMIFS(Stations!Q:Q,Stations!$C:$C,\"=\"&$C114,Stations!$W:$W,\"=No\"),SUMIFS(Stations!Q:Q,Stations!$C:$C,\"=\"&$C114))","v":19},{"$f":"IF($N$1,SUMIFS(Stations!S:S,Stations!$C:$C,\"=\"&$C114,Stations!$W:$W,\"=No\"),SUMIFS(Stations!S:S,Stations!$C:$C,\"=\"&$C114))","v":5},{"$f":"IF($N$1,SUMIFS(Stations!U:U,Stations!$C:$C,\"=\"&$C114,Stations!$W:$W,\"=No\"),SUMIFS(Stations!U:U,Stations!$C:$C,\"=\"&$C114))","v":6}]
[null,null,"WV","West Virginia",null,{"$f":"IF($N$1,SUMIFS(Stations!L:L,Stations!$C:$C,\"=\"&$C115,Stations!$W:$W,\"=No\"),SUMIFS(Stations!L:L,Stations!$C:$C,\"=\"&$C115))","v":210},{"$f":"IF($N$1,SUMIFS(Stations!M:M,Stations!$C:$C,\"=\"&$C115,Stations!$W:$W,\"=No\"),SUMIFS(Stations!M:M,Stations!$C:$C,\"=\"&$C115))","v":15},{"$f":"IF($N$1,SUMIFS(Stations!O:O,Stations!$C:$C,\"=\"&$C115,Stations!$W:$W,\"=No\"),SUMIFS(Stations!O:O,Stations!$C:$C,\"=\"&$C115))","v":0},{"$f":"IF($N$1,SUMIFS(Stations!Q:Q,Stations!$C:$C,\"=\"&$C115,Stations!$W:$W,\"=No\"),SUMIFS(Stations!Q:Q,Stations!$C:$C,\"=\"&$C115))","v":15},{"$f":"IF($N$1,SUMIFS(Stations!S:S,Stations!$C:$C,\"=\"&$C115,Stations!$W:$W,\"=No\"),SUMIFS(Stations!S:S,Stations!$C:$C,\"=\"&$C115))","v":12},{"$f":"IF($N$1,SUMIFS(Stations!U:U,Stations!$C:$C,\"=\"&$C115,Stations!$W:$W,\"=No\"),SUMIFS(Stations!U:U,Stations!$C:$C,\"=\"&$C115))","v":0}]
[null,null,"WY","Wyoming",null,{"$f":"IF($N$1,SUMIFS(Stations!L:L,Stations!$C:$C,\"=\"&$C116,Stations!$W:$W,\"=No\"),SUMIFS(Stations!L:L,Stations!$C:$C,\"=\"&$C116))","v":15},{"$f":"IF($N$1,SUMIFS(Stations!M:M,Stations!$C:$C,\"=\"&$C116,Stations!$W:$W,\"=No\"),SUMIFS(Stations!M:M,Stations!$C:$C,\"=\"&$C116))","v":0},{"$f":"IF($N$1,SUMIFS(Stations!O:O,Stations!$C:$C,\"=\"&$C116,Stations!$W:$W,\"=No\"),SUMIFS(Stations!O:O,Stations!$C:$C,\"=\"&$C116))","v":0},{"$f":"IF($N$1,SUMIFS(Stations!Q:Q,Stations!$C:$C,\"=\"&$C116,Stations!$W:$W,\"=No\"),SUMIFS(Stations!Q:Q,Stations!$C:$C,\"=\"&$C116))","v":0},{"$f":"IF($N$1,SUMIFS(Stations!S:S,Stations!$C:$C,\"=\"&$C116,Stations!$W:$W,\"=No\"),SUMIFS(Stations!S:S,Stations!$C:$C,\"=\"&$C116))","v":0},{"$f":"IF($N$1,SUMIFS(Stations!U:U,Stations!$C:$C,\"=\"&$C116,Stations!$W:$W,\"=No\"),SUMIFS(Stations!U:U,Stations!$C:$C,\"=\"&$C116))","v":0}]