{"text_format":"1","workbook":"xlsx","n_sheets":5,"sheets":["Read Me","Data Dictionary","Stations","Agency Totals","Summary Tables"],"not_rendered":{"charts":0,"images":0,"macros":1,"external_links":0,"defined_names":16,"comments":0,"pivot_tables":0},"unopened":[],"bounds":{"document_bytes":16777216,"sheet_cells":100000,"rows_first":2000,"rows_last":500,"rows_between":2000,"halvings":0,"cell_chars":16384,"cell_head_chars":4096},"cells_cut":0,"cells_raw":0,"read":"whole","date_system":"1900"}

{"sheet":"Read Me","index":0,"n_rows":0,"n_cols":0,"rows_kept":0,"cut":false,"hidden":false,"merged":[]}

{"sheet":"Data Dictionary","index":1,"n_rows":49,"n_cols":3,"rows_kept":49,"cut":false,"hidden":false,"merged":[]}
["Term","Who reports it?","Definition"]
["Agency","All","The transit agency's name."]
["City","All","The city in which the agency is headquartered."]
["State","All","The state in which the agency is headquartered."]
["Legacy NTD ID","All","A four-digit identifying number for each agency used in the legacy NTD system."]
["NTD ID","All","A five-digit identifying number for each agency used in the current NTD system."]
["Organization Type","All","Description of the agency's legal entity."]
["Reporter Type","All","The type of NTD report that the agency completed this year."]
["Primary UZA Population","DOES NOT APPLY TO: Rural General Public Transit Sub-recipients, Intercity Bus Sub-recipients","The population of the urbanized area primarily served by the agency."]
["Agency VOMS","DOES NOT APPLY TO: Building Reporters, Planning Reporters, Separate Service Reporters, Tribal Subsidy Reporters, Intercity Bus Sub-recipients","The number of revenue vehicles operated across the whole agency to meet the annual maximum service requirement. This is the revenue vehicle count during the peak season of the year; on the week and day that maximum service is provided. Vehicles operated in maximum service (VOMS) exclude atypical days and one-time special events."]
{"$rows_left_out":40}
{"sheet":"Stations","index":2,"n_rows":1096,"n_cols":26,"rows_kept":1096,"cut":false,"hidden":false,"merged":[]}
["Name","City","State","Legacy NTD ID","NTD ID","Organization Type","Reporter Type","Primary UZA Population","Agency VOMS","Mode","TOS","Mode VOMS","ADA Accessible Stations","ADA Accessible Stations Questionable","Non-ADA Accessible Stations","Non-ADA Accessible Stations Questionable","Total Stations","Total Stations Questionable","Elevators","Elevators Questionable","Escalators","Escalators Questionable","Any data questionable?",null,null,{"$f":"IF(Z4=1,1,0)","v":0}]
["MTA New York City Transit","New York","NY",2008,20008,"Subsidiary Unit of a Transit Agency, Reporting Separately","Full Reporter",18351295,11004,"HR","DO",5324,111,null,358,null,469,null,264,null,209,null,{"$f":"IF(V2&T2&R2&P2&N2<>\"\",\"Yes\",\"No\")","v":"No"},null,null,"Hide questionable data tags"]
["MTA New York City Transit","New York","NY",2008,20008,"Subsidiary Unit of a Transit Agency, Reporting Separately","Full Reporter",18351295,11004,"MB","DO",3286,2,null,0,null,2,null,0,null,0,null,"No",null,null,"Show questionable data tags"]
["MTA New York City Transit","New York","NY",2008,20008,"Subsidiary Unit of a Transit Agency, Reporting Separately","Full Reporter",18351295,11004,"CB","DO",455,0,null,0,null,0,null,0,null,0,null,"No",null,null,2]
["MTA New York City Transit","New York","NY",2008,20008,"Subsidiary Unit of a Transit Agency, Reporting Separately","Full Reporter",18351295,11004,"RB","DO",145,0,null,0,null,0,null,0,null,0,null,"No"]
["New Jersey Transit Corporation","Newark","NJ",2080,20080,"Other Publicly-Owned or Privately Chartered Corporation","Full Reporter",18351295,4056,"MB","DO",1857,30,null,0,null,30,null,7,null,0,null,"No"]
["New Jersey Transit Corporation","Newark","NJ",2080,20080,"Other Publicly-Owned or Privately Chartered Corporation","Full Reporter",18351295,4056,"CR","DO",1267,78,null,87,null,165,null,102,null,75,null,"No"]
["New Jersey Transit Corporation","Newark","NJ",2080,20080,"Other Publicly-Owned or Privately Chartered Corporation","Full Reporter",18351295,4056,"MB","PT",182,0,null,0,null,0,null,0,null,0,null,"No"]
["New Jersey Transit Corporation","Newark","NJ",2080,20080,"Other Publicly-Owned or Privately Chartered Corporation","Full Reporter",18351295,4056,"LR","PT",42,24,null,0,null,24,null,15,null,0,null,"No"]
["New Jersey Transit Corporation","Newark","NJ",2080,20080,"Other Publicly-Owned or Privately Chartered Corporation","Full Reporter",18351295,4056,"YR","PT",16,21,null,0,null,21,null,0,null,0,null,"No"]
{"$rows_left_out":1087}
{"sheet":"Agency Totals","index":3,"n_rows":842,"n_cols":23,"rows_kept":842,"cut":false,"hidden":false,"merged":[]}
["Name","City","State","Legacy NTD ID","NTD ID","Organization Type","Reporter Type","Primary UZA Population","Agency VOMS","ADA Accessible Stations","ADA Accessible Stations Questionable","Non-ADA Accessible Stations","Non-ADA Accessible Stations Questionable","Total Stations","Total Stations Questionable","Elevators","Elevators Questionable","Escalators","Escalators Questionable","Any data questionable?",null,null,{"$f":"IF(W4=1,1,0)","v":1}]
["MTA New York City Transit","New York","NY",2008,20008,"Subsidiary Unit of a Transit Agency, Reporting Separately","Full Reporter",18351295,11004,113,null,358,null,471,null,264,null,209,null,{"$f":"IF(S2&Q2&O2&M2&K2<>\"\",\"Yes\",\"No\")","v":"No"},null,null,"Hide questionable data tags"]
["New Jersey Transit Corporation","Newark","NJ",2080,20080,"Other Publicly-Owned or Privately Chartered Corporation","Full Reporter",18351295,4056,164,null,93,null,257,null,129,null,77,null,{"$f":"IF(S3&Q3&O3&M3&K3<>\"\",\"Yes\",\"No\")","v":"No"},null,null,"Show questionable data tags"]
["Los Angeles County Metropolitan Transportation Authority dba: Metro","Los Angeles","CA",9154,90154,"Independent Public Agency or Authority of Transit Service","Full Reporter",12150996,3544,151,null,0,null,151,null,195,null,190,null,"No",null,null,1]
["Washington Metropolitan Area Transit Authority","Washington","DC",3030,30030,"Independent Public Agency or Authority of Transit Service","Full Reporter",4586770,3172,94,null,0,null,94,null,278,null,618,null,"No"]
["King County Department of Transportation","Seattle","WA",1,1,"City, County or Local Government Unit or Department of Transportation","Full Reporter",3059393,2818,37,null,3,null,40,null,34,null,40,null,"No"]
["Chicago Transit Authority","Chicago","IL",5066,50066,"Independent Public Agency or Authority of Transit Service","Full Reporter",8608208,2712,98,null,47,null,145,null,147,null,158,null,"No"]
["Massachusetts Bay Transportation Authority","Boston","MA",1003,10003,"Independent Public Agency or Authority of Transit Service","Full Reporter",4181019,2374,270,null,73,null,343,null,181,null,198,null,"No"]
["Southeastern Pennsylvania Transportation Authority","Philadelphia","PA",3019,30019,"Independent Public Agency or Authority of Transit Service","Full Reporter",5441567,2339,109,null,169,null,278,null,113,null,59,null,"No"]
["Metropolitan Transit Authority of Harris County, Texas","Houston","TX",6008,60008,"Independent Public Agency or Authority of Transit Service","Full Reporter",4944332,2206,143,null,0,null,143,null,14,null,8,null,"No"]
{"$rows_left_out":833}
{"sheet":"Summary Tables","index":4,"n_rows":116,"n_cols":14,"rows_kept":116,"cut":false,"hidden":false,"merged":[]}
["To bring up the accessible control panel, press ctrl + a. Some screen reading functionality will not work while the sheet is protected. To unprotect the sheet press alt h o p and enter the password ntd.",null,null,null,null,"National Totals",null,null,null,null,null,null,null,{"$f":"IF(N4=1,0,1)","v":0}]
[null,null,null,null,null,"VOMS","ADA Accessible","Non-ADA Accessible","Total Stations","Elevators","Escalators",null,null,"Include Questionable Data"]
[null,null,null,null,null,{"$f":"IF($N$1,SUMIFS(Stations!L:L,Stations!$W:$W,\"=No\"),SUM(Stations!L:L))","v":71632},{"$f":"IF($N$1,SUMIFS(Stations!M:M,Stations!$W:$W,\"=No\"),SUM(Stations!M:M))","v":4329},{"$f":"IF($N$1,SUMIFS(Stations!O:O,Stations!$W:$W,\"=No\"),SUM(Stations!O:O))","v":1030},{"$f":"IF($N$1,SUMIFS(Stations!Q:Q,Stations!$W:$W,\"=No\"),SUM(Stations!Q:Q))","v":5359},{"$f":"IF($N$1,SUMIFS(Stations!S:S,Stations!$W:$W,\"=No\"),SUM(Stations!S:S))","v":2930},{"$f":"IF($N$1,SUMIFS(Stations!U:U,Stations!$W:$W,\"=No\"),SUM(Stations!U:U))","v":2716},null,null,"Exclude Questionable Data"]
[null,null,null,null,null,null,null,null,null,null,null,null,null,1]
["By Urbanized Area Size"]
[null,null,null,"enter bins here","Column1","VOMS","ADA Accessible","Non-ADA Accessible","Total Stations","Elevators","Escalators"]
["Under",{"$f":"D7","v":200000},null,200000,{"$f":"IFERROR(IF(A7=\"Between\",A7&\" \"&FIXED(B7,0,0)&\" \"&C7&\" \"&FIXED(D7,0,0),A7&\" \"&FIXED(B7,0,0)),\"invalid bin\")","v":"Under 200,000"},{"$f":"IF($N$1,SUMIFS(Stations!L:L,Stations!$H:$H,\"<\"&$D7,Stations!$W:$W,\"=No\"),SUMIFS(Stations!L:L,Stations!$H:$H,\"<\"&$D7))","v":4983},{"$f":"IF($N$1,SUMIFS(Stations!M:M,Stations!$H:$H,\"<\"&$D7,Stations!$W:$W,\"=No\"),SUMIFS(Stations!M:M,Stations!$H:$H,\"<\"&$D7))","v":321},{"$f":"IF($N$1,SUMIFS(Stations!O:O,Stations!$H:$H,\"<\"&$D7,Stations!$W:$W,\"=No\"),SUMIFS(Stations!O:O,Stations!$H:$H,\"<\"&$D7))","v":3},{"$f":"IF($N$1,SUMIFS(Stations!Q:Q,Stations!$H:$H,\"<\"&$D7,Stations!$W:$W,\"=No\"),SUMIFS(Stations!Q:Q,Stations!$H:$H,\"<\"&$D7))","v":324},{"$f":"IF($N$1,SUMIFS(Stations!S:S,Stations!$H:$H,\"<\"&$D7,Stations!$W:$W,\"=No\"),SUMIFS(Stations!S:S,Stations!$H:$H,\"<\"&$D7))","v":76},{"$f":"IF($N$1,SUMIFS(Stations!U:U,Stations!$H:$H,\"<\"&$D7,Stations!$W:$W,\"=No\"),SUMIFS(Stations!U:U,Stations!$H:$H,\"<\"&$D7))","v":2}]
[{"$f":"IF(D8<>\"\",\"Between\",\"Over\")","v":"Between"},{"$f":"D7","v":200000},{"$f":"IF(D8<>\"\",\"and\",\"\")","v":"and"},1000000,"Between 200,000 and 1,000,000",{"$f":"IF($N$1,IF($A8=\"Between\",SUMIFS(Stations!L:L,Stations!$H:$H,\">=\"&$B8,Stations!$H:$H,\"<\"&$D8,Stations!$W:$W,\"=No\"),SUMIFS(Stations!L:L,Stations!$H:$H,\">=\"&$B8,Stations!$W:$W,\"=No\")),IF($A8=\"Between\",SUMIFS(Stations!L:L,Stations!$H:$H,\">=\"&$B8,Stations!$H:$H,\"<\"&$D8),SUMIFS(Stations!L:L,Stations!$H:$H,\">=\"&$B8)))","v":9369},{"$f":"IF($N$1,IF($A8=\"Between\",SUMIFS(Stations!M:M,Stations!$H:$H,\">=\"&$B8,Stations!$H:$H,\"<\"&$D8,Stations!$W:$W,\"=No\"),SUMIFS(Stations!M:M,Stations!$H:$H,\">=\"&$B8,Stations!$W:$W,\"=No\")),IF($A8=\"Between\",SUMIFS(Stations!M:M,Stations!$H:$H,\">=\"&$B8,Stations!$H:$H,\"<\"&$D8),SUMIFS(Stations!M:M,Stations!$H:$H,\">=\"&$B8)))","v":416},{"$f":"IF($N$1,IF($A8=\"Between\",SUMIFS(Stations!O:O,Stations!$H:$H,\">=\"&$B8,Stations!$H:$H,\"<\"&$D8,Stations!$W:$W,\"=No\"),SUMIFS(Stations!O:O,Stations!$H:$H,\">=\"&$B8,Stations!$W:$W,\"=No\")),IF($A8=\"Between\",SUMIFS(Stations!O:O,Stations!$H:$H,\">=\"&$B8,Stations!$H:$H,\"<\"&$D8),SUMIFS(Stations!O:O,Stations!$H:$H,\">=\"&$B8)))","v":4},{"$f":"IF($N$1,IF($A8=\"Between\",SUMIFS(Stations!Q:Q,Stations!$H:$H,\">=\"&$B8,Stations!$H:$H,\"<\"&$D8,Stations!$W:$W,\"=No\"),SUMIFS(Stations!Q:Q,Stations!$H:$H,\">=\"&$B8,Stations!$W:$W,\"=No\")),IF($A8=\"Between\",SUMIFS(Stations!Q:Q,Stations!$H:$H,\">=\"&$B8,Stations!$H:$H,\"<\"&$D8),SUMIFS(Stations!Q:Q,Stations!$H:$H,\">=\"&$B8)))","v":420},{"$f":"IF($N$1,IF($A8=\"Between\",SUMIFS(Stations!S:S,Stations!$H:$H,\">=\"&$B8,Stations!$H:$H,\"<\"&$D8,Stations!$W:$W,\"=No\"),SUMIFS(Stations!S:S,Stations!$H:$H,\">=\"&$B8,Stations!$W:$W,\"=No\")),IF($A8=\"Between\",SUMIFS(Stations!S:S,Stations!$H:$H,\">=\"&$B8,Stations!$H:$H,\"<\"&$D8),SUMIFS(Stations!S:S,Stations!$H:$H,\">=\"&$B8)))","v":102},{"$f":"IF($N$1,IF($A8=\"Between\",SUMIFS(Stations!U:U,Stations!$H:$H,\">=\"&$B8,Stations!$H:$H,\"<\"&$D8,Stations!$W:$W,\"=No\"),SUMIFS(Stations!U:U,Stations!$H:$H,\">=\"&$B8,Stations!$W:$W,\"=No\")),IF($A8=\"Between\",SUMIFS(Stations!U:U,Stations!$H:$H,\">=\"&$B8,Stations!$H:$H,\"<\"&$D8),SUMIFS(Stations!U:U,Stations!$H:$H,\">=\"&$B8)))","v":50}]
[{"$f":"IF(OR(A8=\"Over\",A8=\"\"),\"\",IF(D9=\"\",\"Over\",\"Between\"))","v":"Over"},{"$f":"IF(D8=\"\",\"\",D8)","v":1000000},{"$f":"IF(D9<>\"\",\"and\",\"\")","v":""},null,"Over 1,000,000",{"$f":"IF($N$1,IF($A9=\"\",\"\",IF($A9=\"Between\",SUMIFS(Stations!L:L,Stations!$H:$H,\">=\"&$B9,Stations!$H:$H,\"<\"&$D9,Stations!$W:$W,\"=No\"),SUMIFS(Stations!L:L,Stations!$H:$H,\">=\"&$B9,Stations!$W:$W,\"=No\"))),IF($A9=\"\",\"\",IF($A9=\"Between\",SUMIFS(Stations!L:L,Stations!$H:$H,\">=\"&$B9,Stations!$H:$H,\"<\"&$D9),SUMIFS(Stations!L:L,Stations!$H:$H,\">=\"&$B9))))","v":57280},{"$f":"IF($N$1,IF($A9=\"\",\"\",IF($A9=\"Between\",SUMIFS(Stations!M:M,Stations!$H:$H,\">=\"&$B9,Stations!$H:$H,\"<\"&$D9,Stations!$W:$W,\"=No\"),SUMIFS(Stations!M:M,Stations!$H:$H,\">=\"&$B9,Stations!$W:$W,\"=No\"))),IF($A9=\"\",\"\",IF($A9=\"Between\",SUMIFS(Stations!M:M,Stations!$H:$H,\">=\"&$B9,Stations!$H:$H,\"<\"&$D9),SUMIFS(Stations!M:M,Stations!$H:$H,\">=\"&$B9))))","v":3592},{"$f":"IF($N$1,IF($A9=\"\",\"\",IF($A9=\"Between\",SUMIFS(Stations!O:O,Stations!$H:$H,\">=\"&$B9,Stations!$H:$H,\"<\"&$D9,Stations!$W:$W,\"=No\"),SUMIFS(Stations!O:O,Stations!$H:$H,\">=\"&$B9,Stations!$W:$W,\"=No\"))),IF($A9=\"\",\"\",IF($A9=\"Between\",SUMIFS(Stations!O:O,Stations!$H:$H,\">=\"&$B9,Stations!$H:$H,\"<\"&$D9),SUMIFS(Stations!O:O,Stations!$H:$H,\">=\"&$B9))))","v":1023},{"$f":"IF($N$1,IF($A9=\"\",\"\",IF($A9=\"Between\",SUMIFS(Stations!Q:Q,Stations!$H:$H,\">=\"&$B9,Stations!$H:$H,\"<\"&$D9,Stations!$W:$W,\"=No\"),SUMIFS(Stations!Q:Q,Stations!$H:$H,\">=\"&$B9,Stations!$W:$W,\"=No\"))),IF($A9=\"\",\"\",IF($A9=\"Between\",SUMIFS(Stations!Q:Q,Stations!$H:$H,\">=\"&$B9,Stations!$H:$H,\"<\"&$D9),SUMIFS(Stations!Q:Q,Stations!$H:$H,\">=\"&$B9))))","v":4615},{"$f":"IF($N$1,IF($A9=\"\",\"\",IF($A9=\"Between\",SUMIFS(Stations!S:S,Stations!$H:$H,\">=\"&$B9,Stations!$H:$H,\"<\"&$D9,Stations!$W:$W,\"=No\"),SUMIFS(Stations!S:S,Stations!$H:$H,\">=\"&$B9,Stations!$W:$W,\"=No\"))),IF($A9=\"\",\"\",IF($A9=\"Between\",SUMIFS(Stations!S:S,Stations!$H:$H,\">=\"&$B9,Stations!$H:$H,\"<\"&$D9),SUMIFS(Stations!S:S,Stations!$H:$H,\">=\"&$B9))))","v":2752},{"$f":"IF($N$1,IF($A9=\"\",\"\",IF($A9=\"Between\",SUMIFS(Stations!U:U,Stations!$H:$H,\">=\"&$B9,Stations!$H:$H,\"<\"&$D9,Stations!$W:$W,\"=No\"),SUMIFS(Stations!U:U,Stations!$H:$H,\">=\"&$B9,Stations!$W:$W,\"=No\"))),IF($A9=\"\",\"\",IF($A9=\"Between\",SUMIFS(Stations!U:U,Stations!$H:$H,\">=\"&$B9,Stations!$H:$H,\"<\"&$D9),SUMIFS(Stations!U:U,Stations!$H:$H,\">=\"&$B9))))","v":2664}]
["","",{"$f":"IF(D10<>\"\",\"and\",\"\")","v":""},null,"invalid bin",{"$f":"IF($N$1,IF($A10=\"\",\"\",IF($A10=\"Between\",SUMIFS(Stations!L:L,Stations!$H:$H,\">=\"&$B10,Stations!$H:$H,\"<\"&$D10,Stations!$W:$W,\"=No\"),SUMIFS(Stations!L:L,Stations!$H:$H,\">=\"&$B10,Stations!$W:$W,\"=No\"))),IF($A10=\"\",\"\",IF($A10=\"Between\",SUMIFS(Stations!L:L,Stations!$H:$H,\">=\"&$B10,Stations!$H:$H,\"<\"&$D10),SUMIFS(Stations!L:L,Stations!$H:$H,\">=\"&$B10))))","v":""},{"$f":"IF($N$1,IF($A10=\"\",\"\",IF($A10=\"Between\",SUMIFS(Stations!M:M,Stations!$H:$H,\">=\"&$B10,Stations!$H:$H,\"<\"&$D10,Stations!$W:$W,\"=No\"),SUMIFS(Stations!M:M,Stations!$H:$H,\">=\"&$B10,Stations!$W:$W,\"=No\"))),IF($A10=\"\",\"\",IF($A10=\"Between\",SUMIFS(Stations!M:M,Stations!$H:$H,\">=\"&$B10,Stations!$H:$H,\"<\"&$D10),SUMIFS(Stations!M:M,Stations!$H:$H,\">=\"&$B10))))","v":""},{"$f":"IF($N$1,IF($A10=\"\",\"\",IF($A10=\"Between\",SUMIFS(Stations!O:O,Stations!$H:$H,\">=\"&$B10,Stations!$H:$H,\"<\"&$D10,Stations!$W:$W,\"=No\"),SUMIFS(Stations!O:O,Stations!$H:$H,\">=\"&$B10,Stations!$W:$W,\"=No\"))),IF($A10=\"\",\"\",IF($A10=\"Between\",SUMIFS(Stations!O:O,Stations!$H:$H,\">=\"&$B10,Stations!$H:$H,\"<\"&$D10),SUMIFS(Stations!O:O,Stations!$H:$H,\">=\"&$B10))))","v":""},{"$f":"IF($N$1,IF($A10=\"\",\"\",IF($A10=\"Between\",SUMIFS(Stations!Q:Q,Stations!$H:$H,\">=\"&$B10,Stations!$H:$H,\"<\"&$D10,Stations!$W:$W,\"=No\"),SUMIFS(Stations!Q:Q,Stations!$H:$H,\">=\"&$B10,Stations!$W:$W,\"=No\"))),IF($A10=\"\",\"\",IF($A10=\"Between\",SUMIFS(Stations!Q:Q,Stations!$H:$H,\">=\"&$B10,Stations!$H:$H,\"<\"&$D10),SUMIFS(Stations!Q:Q,Stations!$H:$H,\">=\"&$B10))))","v":""},{"$f":"IF($N$1,IF($A10=\"\",\"\",IF($A10=\"Between\",SUMIFS(Stations!S:S,Stations!$H:$H,\">=\"&$B10,Stations!$H:$H,\"<\"&$D10,Stations!$W:$W,\"=No\"),SUMIFS(Stations!S:S,Stations!$H:$H,\">=\"&$B10,Stations!$W:$W,\"=No\"))),IF($A10=\"\",\"\",IF($A10=\"Between\",SUMIFS(Stations!S:S,Stations!$H:$H,\">=\"&$B10,Stations!$H:$H,\"<\"&$D10),SUMIFS(Stations!S:S,Stations!$H:$H,\">=\"&$B10))))","v":""},{"$f":"IF($N$1,IF($A10=\"\",\"\",IF($A10=\"Between\",SUMIFS(Stations!U:U,Stations!$H:$H,\">=\"&$B10,Stations!$H:$H,\"<\"&$D10,Stations!$W:$W,\"=No\"),SUMIFS(Stations!U:U,Stations!$H:$H,\">=\"&$B10,Stations!$W:$W,\"=No\"))),IF($A10=\"\",\"\",IF($A10=\"Between\",SUMIFS(Stations!U:U,Stations!$H:$H,\">=\"&$B10,Stations!$H:$H,\"<\"&$D10),SUMIFS(Stations!U:U,Stations!$H:$H,\">=\"&$B10))))","v":""}]
{"$rows_left_out":106}