{"text_format":"1","workbook":"xlsx","n_sheets":4,"sheets":["Read Me","Data Dictionary","Breakdowns","Summary"],"not_rendered":{"charts":2,"images":0,"macros":1,"external_links":0,"defined_names":17,"comments":0,"pivot_tables":0},"unopened":[],"bounds":{"document_bytes":16777216,"sheet_cells":100000,"rows_first":2000,"rows_last":500,"rows_between":2000,"halvings":0,"cell_chars":16384,"cell_head_chars":4096},"cells_cut":0,"cells_raw":0,"read":"whole","date_system":"1900"}

{"sheet":"Read Me","index":0,"n_rows":0,"n_cols":0,"rows_kept":0,"cut":false,"hidden":false,"merged":[]}

{"sheet":"Data Dictionary","index":1,"n_rows":51,"n_cols":3,"rows_kept":51,"cut":false,"hidden":false,"merged":[]}
["Term","Who reports it?","Definition"]
["Agency","All","The transit agency's name."]
["City","All","The city in which the agency is headquartered."]
["State","All","The state in which the agency is headquartered."]
["Legacy NTD ID","All","A four-digit identifying number for each agency used in the legacy NTD system."]
["NTD ID","All","A five-digit identifying number for each agency used in the current NTD system."]
["Organization Type","All","Description of the agency's legal entity."]
["Reporter Type","All","The type of NTD report that the agency completed this year."]
["Primary UZA Population","DOES NOT APPLY TO: Rural General Public Transit Sub-recipients, Intercity Bus Sub-recipients","The population of the urbanized area primarily served by the agency."]
["Agency VOMS","DOES NOT APPLY TO: Building Reporters, Planning Reporters, Separate Service Reporters, Tribal Subsidy Reporters, Intercity Bus Sub-recipients","The number of revenue vehicles operated across the whole agency to meet the annual maximum service requirement. This is the revenue vehicle count during the peak season of the year; on the week and day that maximum service is provided. Vehicles operated in maximum service (VOMS) exclude atypical days and one-time special events."]
{"$rows_left_out":42}
{"sheet":"Breakdowns","index":2,"n_rows":1250,"n_cols":29,"rows_kept":1250,"cut":false,"hidden":false,"merged":[]}
["Agency","City","State","Legacy NTD ID","NTD ID","Organization Type","Reporter Type","Primary UZA Population","Agency VOMS","Mode","Type of Service","Mode VOMS","Major Mechanical Failures","Major Mechanical Failures Questionable","Other Mechanical Failures","Other Mechanical Failures Questionable","Total Mechanical Failures","Total Mechanical Failures Questionable","Vehicle/Passenger Car Miles","Vehicle/Passenger Car Miles Questionable","Vehicle/Passenger Car Revenue Miles","Vehicle/Passenger Car Revenue Miles Questionable","Train Miles","Train Miles Questionable","Train Revenue Miles","Train Revenue Miles Questionable","Any Data Questionable?",null,{"$f":"IF(AC4=1,1,0)","v":1}]
["MTA New York City Transit","New York","NY",2008,20008,"Subsidiary Unit of a Transit Agency, Reporting Separately","Full Reporter",18351295,11004,"HR","DO",5324,3097,null,10196,null,13293,null,357939619,null,347091534,null,39342476,null,38134129,null,{"$f":"IF(OR(Z2=\"Q\",X2=\"Q\",V2=\"Q\",T2=\"Q\",R2=\"Q\",P2=\"Q\",N2=\"Q\"),\"Yes\",\"No\")","v":"No"},null,"Hide Questionable Data Tags"]
["MTA New York City Transit","New York","NY",2008,20008,"Subsidiary Unit of a Transit Agency, Reporting Separately","Full Reporter",18351295,11004,"MB","DO",3286,9035,null,3630,null,12665,null,98994910,null,86863364,null,0,null,0,null,"No",null,"Show Questionable Data Tags"]
["MTA New York City Transit","New York","NY",2008,20008,"Subsidiary Unit of a Transit Agency, Reporting Separately","Full Reporter",18351295,11004,"DR","PT",1794,2640,null,2515,null,5155,null,59318874,null,48814480,null,0,null,0,null,"No",null,1]
["MTA New York City Transit","New York","NY",2008,20008,"Subsidiary Unit of a Transit Agency, Reporting Separately","Full Reporter",18351295,11004,"CB","DO",455,227,null,76,null,303,null,15561164,null,9214967,null,0,null,0,null,"No"]
["MTA New York City Transit","New York","NY",2008,20008,"Subsidiary Unit of a Transit Agency, Reporting Separately","Full Reporter",18351295,11004,"RB","DO",145,293,null,140,null,433,null,3183091,null,2988560,null,0,null,0,null,"No"]
["New Jersey Transit Corporation","Newark","NJ",2080,20080,"Other Publicly-Owned or Privately Chartered Corporation","Full Reporter",18351295,4056,"MB","DO",1857,6483,null,3495,null,9978,null,94165129,null,72451012,null,0,null,0,null,"No"]
["New Jersey Transit Corporation","Newark","NJ",2080,20080,"Other Publicly-Owned or Privately Chartered Corporation","Full Reporter",18351295,4056,"CR","DO",1267,236,null,0,null,236,null,64713399,null,61393168,null,9525861,null,9031214,null,"No"]
["New Jersey Transit Corporation","Newark","NJ",2080,20080,"Other Publicly-Owned or Privately Chartered Corporation","Full Reporter",18351295,4056,"DR","PT",474,233,null,197,null,430,null,17857141,null,14882395,null,0,null,0,null,"No"]
["New Jersey Transit Corporation","Newark","NJ",2080,20080,"Other Publicly-Owned or Privately Chartered Corporation","Full Reporter",18351295,4056,"VP","PT",204,8,null,16,null,24,null,4701081,null,4701081,null,0,null,0,null,"No"]
{"$rows_left_out":1241}
{"sheet":"Summary","index":3,"n_rows":121,"n_cols":22,"rows_kept":121,"cut":false,"hidden":false,"merged":[]}
["To bring up the accessible control panel, press ctrl + a. Some screen reading functionality will not work while the sheet is protected. To unprotect the sheet press alt h o p and enter the password ntd.",null,null,null,null,"National Totals",null,null,null,null,null,null,null,null,null,{"$f":"IF(P4=1,0,1)","v":0}]
[null,null,null,null,null,"VOMS","Major Mechanical Failures","Other Mechanical Failures","Total Mechanical Failures","Vehicle/Passenger Car Miles","Vehicle/Passenger Car Revenue Miles","Train Miles","Train Revenue Miles",null,null,"Include Questionable Data"]
[null,null,null,null,null,{"$f":"IF($P$1,SUMIFS(Breakdowns!L:L,Breakdowns!$AA:$AA,\"=No\"),SUM(Breakdowns!L:L))","v":106299},{"$f":"IF($P$1,SUMIFS(Breakdowns!M:M,Breakdowns!$AA:$AA,\"=No\"),SUM(Breakdowns!M:M))","v":249404},{"$f":"IF($P$1,SUMIFS(Breakdowns!O:O,Breakdowns!$AA:$AA,\"=No\"),SUM(Breakdowns!O:O))","v":266737},{"$f":"IF($P$1,SUMIFS(Breakdowns!Q:Q,Breakdowns!$AA:$AA,\"=No\"),SUM(Breakdowns!Q:Q))","v":516141},{"$f":"IF($P$1,SUMIFS(Breakdowns!S:S,Breakdowns!$AA:$AA,\"=No\"),SUM(Breakdowns!S:S))","v":4522027867},{"$f":"IF($P$1,SUMIFS(Breakdowns!U:U,Breakdowns!$AA:$AA,\"=No\"),SUM(Breakdowns!U:U))","v":4016193005},{"$f":"IF($P$1,SUMIFS(Breakdowns!W:W,Breakdowns!$AA:$AA,\"=No\"),SUM(Breakdowns!W:W))","v":223426532},{"$f":"IF($P$1,SUMIFS(Breakdowns!Y:Y,Breakdowns!$AA:$AA,\"=No\"),SUM(Breakdowns!Y:Y))","v":215231596},null,null,"Exclude Questionable Data"]
[null,null,null,null,null,null,null,null,null,null,null,null,null,null,null,1]
["By Urbanized Area Size"]
[null,null,null,"edit bins below","Column1","VOMS","Major Mechanical Failures","Other Mechanical Failures","Total Mechanical Failures","Vehicle/Passenger Car Miles","Vehicle/Passenger Car Revenue Miles","Train Miles","Train Revenue Miles",null,null,null,null,null,{"$f":"\"Under \"&FIXED(B7,0,0)","v":"Under 200,000"},{"$f":"IFERROR($K7/$G7,\"\")","v":18535.044523099852}]
["Under",{"$f":"D7","v":200000},null,200000,{"$f":"A7&\" \"&FIXED(B7,0,0)","v":"Under 200,000"},{"$f":"IF($P$1,SUMIFS(Breakdowns!L:L,Breakdowns!$H:$H,\"<\"&$D7,Breakdowns!$AA:$AA,\"=No\"),SUMIFS(Breakdowns!L:L,Breakdowns!$H:$H,\"<\"&$D7))","v":6946},{"$f":"IF($P$1,SUMIFS(Breakdowns!M:M,Breakdowns!$H:$H,\"<\"&$D7,Breakdowns!$AA:$AA,\"=No\"),SUMIFS(Breakdowns!M:M,Breakdowns!$H:$H,\"<\"&$D7))","v":10736},{"$f":"IF($P$1,SUMIFS(Breakdowns!O:O,Breakdowns!$H:$H,\"<\"&$D7,Breakdowns!$AA:$AA,\"=No\"),SUMIFS(Breakdowns!O:O,Breakdowns!$H:$H,\"<\"&$D7))","v":15503},{"$f":"IF($P$1,SUMIFS(Breakdowns!Q:Q,Breakdowns!$H:$H,\"<\"&$D7,Breakdowns!$AA:$AA,\"=No\"),SUMIFS(Breakdowns!Q:Q,Breakdowns!$H:$H,\"<\"&$D7))","v":26239},{"$f":"IF($P$1,SUMIFS(Breakdowns!S:S,Breakdowns!$H:$H,\"<\"&$D7,Breakdowns!$AA:$AA,\"=No\"),SUMIFS(Breakdowns!S:S,Breakdowns!$H:$H,\"<\"&$D7))","v":216058288},{"$f":"IF($P$1,SUMIFS(Breakdowns!U:U,Breakdowns!$H:$H,\"<\"&$D7,Breakdowns!$AA:$AA,\"=No\"),SUMIFS(Breakdowns!U:U,Breakdowns!$H:$H,\"<\"&$D7))","v":198992238},{"$f":"IF($P$1,SUMIFS(Breakdowns!W:W,Breakdowns!$H:$H,\"<\"&$D7,Breakdowns!$AA:$AA,\"=No\"),SUMIFS(Breakdowns!W:W,Breakdowns!$H:$H,\"<\"&$D7))","v":696726},{"$f":"IF($P$1,SUMIFS(Breakdowns!Y:Y,Breakdowns!$H:$H,\"<\"&$D7,Breakdowns!$AA:$AA,\"=No\"),SUMIFS(Breakdowns!Y:Y,Breakdowns!$H:$H,\"<\"&$D7))","v":688917},null,null,null,null,null,{"$f":"IFERROR(IF(A8=\"Over\",\"Over \"&FIXED(B8,0,0),FIXED(B8,0,0)&\" to \"&FIXED(D8,0,0)),\"\")","v":"200,000 to 1,000,000"},{"$f":"IFERROR($K8/$G8,\"\")","v":12348.094332521585}]
[{"$f":"IF(D8<>\"\",\"Between\",\"Over\")","v":"Between"},{"$f":"D7","v":200000},{"$f":"IF(D8<>\"\",\"and\",\"\")","v":"and"},1000000,{"$f":"IFERROR(IF(A8=\"between\",A8&\" \"&FIXED(B8,0,0)&\" \"&C8&\" \"&FIXED(D8,0,0),A8&\" \"&FIXED(B8,0,0)),\"invalid bin\")","v":"Between 200,000 and 1,000,000"},{"$f":"IF($P$1,IF($A8=\"between\",SUMIFS(Breakdowns!L:L,Breakdowns!$H:$H,\">=\"&$B8,Breakdowns!$H:$H,\"<\"&$D8,Breakdowns!$AA:$AA,\"=No\"),SUMIFS(Breakdowns!L:L,Breakdowns!$H:$H,\">=\"&$B8,Breakdowns!$AA:$AA,\"=No\")),IF($A8=\"between\",SUMIFS(Breakdowns!L:L,Breakdowns!$H:$H,\">=\"&$B8,Breakdowns!$H:$H,\"<\"&$D8),SUMIFS(Breakdowns!L:L,Breakdowns!$H:$H,\">=\"&$B8)))","v":16492},{"$f":"IF($P$1,IF($A8=\"between\",SUMIFS(Breakdowns!M:M,Breakdowns!$H:$H,\">=\"&$B8,Breakdowns!$H:$H,\"<\"&$D8,Breakdowns!$AA:$AA,\"=No\"),SUMIFS(Breakdowns!M:M,Breakdowns!$H:$H,\">=\"&$B8,Breakdowns!$AA:$AA,\"=No\")),IF($A8=\"between\",SUMIFS(Breakdowns!M:M,Breakdowns!$H:$H,\">=\"&$B8,Breakdowns!$H:$H,\"<\"&$D8),SUMIFS(Breakdowns!M:M,Breakdowns!$H:$H,\">=\"&$B8)))","v":45170},{"$f":"IF($P$1,IF($A8=\"between\",SUMIFS(Breakdowns!O:O,Breakdowns!$H:$H,\">=\"&$B8,Breakdowns!$H:$H,\"<\"&$D8,Breakdowns!$AA:$AA,\"=No\"),SUMIFS(Breakdowns!O:O,Breakdowns!$H:$H,\">=\"&$B8,Breakdowns!$AA:$AA,\"=No\")),IF($A8=\"between\",SUMIFS(Breakdowns!O:O,Breakdowns!$H:$H,\">=\"&$B8,Breakdowns!$H:$H,\"<\"&$D8),SUMIFS(Breakdowns!O:O,Breakdowns!$H:$H,\">=\"&$B8)))","v":58994},{"$f":"IF($P$1,IF($A8=\"between\",SUMIFS(Breakdowns!Q:Q,Breakdowns!$H:$H,\">=\"&$B8,Breakdowns!$H:$H,\"<\"&$D8,Breakdowns!$AA:$AA,\"=No\"),SUMIFS(Breakdowns!Q:Q,Breakdowns!$H:$H,\">=\"&$B8,Breakdowns!$AA:$AA,\"=No\")),IF($A8=\"between\",SUMIFS(Breakdowns!Q:Q,Breakdowns!$H:$H,\">=\"&$B8,Breakdowns!$H:$H,\"<\"&$D8),SUMIFS(Breakdowns!Q:Q,Breakdowns!$H:$H,\">=\"&$B8)))","v":104164},{"$f":"IF($P$1,IF($A8=\"between\",SUMIFS(Breakdowns!S:S,Breakdowns!$H:$H,\">=\"&$B8,Breakdowns!$H:$H,\"<\"&$D8,Breakdowns!$AA:$AA,\"=No\"),SUMIFS(Breakdowns!S:S,Breakdowns!$H:$H,\">=\"&$B8,Breakdowns!$AA:$AA,\"=No\")),IF($A8=\"between\",SUMIFS(Breakdowns!S:S,Breakdowns!$H:$H,\">=\"&$B8,Breakdowns!$H:$H,\"<\"&$D8),SUMIFS(Breakdowns!S:S,Breakdowns!$H:$H,\">=\"&$B8)))","v":623869003},{"$f":"IF($P$1,IF($A8=\"between\",SUMIFS(Breakdowns!U:U,Breakdowns!$H:$H,\">=\"&$B8,Breakdowns!$H:$H,\"<\"&$D8,Breakdowns!$AA:$AA,\"=No\"),SUMIFS(Breakdowns!U:U,Breakdowns!$H:$H,\">=\"&$B8,Breakdowns!$AA:$AA,\"=No\")),IF($A8=\"between\",SUMIFS(Breakdowns!U:U,Breakdowns!$H:$H,\">=\"&$B8,Breakdowns!$H:$H,\"<\"&$D8),SUMIFS(Breakdowns!U:U,Breakdowns!$H:$H,\">=\"&$B8)))","v":557763421},{"$f":"IF($P$1,IF($A8=\"between\",SUMIFS(Breakdowns!W:W,Breakdowns!$H:$H,\">=\"&$B8,Breakdowns!$H:$H,\"<\"&$D8,Breakdowns!$AA:$AA,\"=No\"),SUMIFS(Breakdowns!W:W,Breakdowns!$H:$H,\">=\"&$B8,Breakdowns!$AA:$AA,\"=No\")),IF($A8=\"between\",SUMIFS(Breakdowns!W:W,Breakdowns!$H:$H,\">=\"&$B8,Breakdowns!$H:$H,\"<\"&$D8),SUMIFS(Breakdowns!W:W,Breakdowns!$H:$H,\">=\"&$B8)))","v":4259852},{"$f":"IF($P$1,IF($A8=\"between\",SUMIFS(Breakdowns!Y:Y,Breakdowns!$H:$H,\">=\"&$B8,Breakdowns!$H:$H,\"<\"&$D8,Breakdowns!$AA:$AA,\"=No\"),SUMIFS(Breakdowns!Y:Y,Breakdowns!$H:$H,\">=\"&$B8,Breakdowns!$AA:$AA,\"=No\")),IF($A8=\"between\",SUMIFS(Breakdowns!Y:Y,Breakdowns!$H:$H,\">=\"&$B8,Breakdowns!$H:$H,\"<\"&$D8),SUMIFS(Breakdowns!Y:Y,Breakdowns!$H:$H,\">=\"&$B8)))","v":4069277},null,null,null,null,null,{"$f":"IFERROR(IF(A9=\"Over\",\"Over \"&FIXED(B9,0,0),FIXED(B9,0,0)&\" to \"&FIXED(D9,0,0)),\"\")","v":"Over 1,000,000"},16844.811553607789]
[{"$f":"IF(OR(A8=\"Over\",A8=\"\"),\"\",IF(D9=\"\",\"Over\",\"Between\"))","v":"Over"},{"$f":"IF(D8=\"\",\"\",D8)","v":1000000},{"$f":"IF(D9<>\"\",\"and\",\"\")","v":""},null,{"$f":"IFERROR(IF(A9=\"between\",A9&\" \"&FIXED(B9,0,0)&\" \"&C9&\" \"&FIXED(D9,0,0),A9&\" \"&FIXED(B9,0,0)),\"invalid bin\")","v":"Over 1,000,000"},{"$f":"IF($P$1,IF($A9=\"\",\"\",IF($A9=\"between\",SUMIFS(Breakdowns!L:L,Breakdowns!$H:$H,\">=\"&$B9,Breakdowns!$H:$H,\"<\"&$D9,Breakdowns!$AA:$AA,\"=No\"),SUMIFS(Breakdowns!L:L,Breakdowns!$H:$H,\">=\"&$B9,Breakdowns!$AA:$AA,\"=No\"))),IF($A9=\"\",\"\",IF($A9=\"between\",SUMIFS(Breakdowns!L:L,Breakdowns!$H:$H,\">=\"&$B9,Breakdowns!$H:$H,\"<\"&$D9),SUMIFS(Breakdowns!L:L,Breakdowns!$H:$H,\">=\"&$B9))))","v":82861},{"$f":"IF($P$1,IF($A9=\"\",\"\",IF($A9=\"between\",SUMIFS(Breakdowns!M:M,Breakdowns!$H:$H,\">=\"&$B9,Breakdowns!$H:$H,\"<\"&$D9,Breakdowns!$AA:$AA,\"=No\"),SUMIFS(Breakdowns!M:M,Breakdowns!$H:$H,\">=\"&$B9,Breakdowns!$AA:$AA,\"=No\"))),IF($A9=\"\",\"\",IF($A9=\"between\",SUMIFS(Breakdowns!M:M,Breakdowns!$H:$H,\">=\"&$B9,Breakdowns!$H:$H,\"<\"&$D9),SUMIFS(Breakdowns!M:M,Breakdowns!$H:$H,\">=\"&$B9))))","v":193498},{"$f":"IF($P$1,IF($A9=\"\",\"\",IF($A9=\"between\",SUMIFS(Breakdowns!O:O,Breakdowns!$H:$H,\">=\"&$B9,Breakdowns!$H:$H,\"<\"&$D9,Breakdowns!$AA:$AA,\"=No\"),SUMIFS(Breakdowns!O:O,Breakdowns!$H:$H,\">=\"&$B9,Breakdowns!$AA:$AA,\"=No\"))),IF($A9=\"\",\"\",IF($A9=\"between\",SUMIFS(Breakdowns!O:O,Breakdowns!$H:$H,\">=\"&$B9,Breakdowns!$H:$H,\"<\"&$D9),SUMIFS(Breakdowns!O:O,Breakdowns!$H:$H,\">=\"&$B9))))","v":192240},{"$f":"IF($P$1,IF($A9=\"\",\"\",IF($A9=\"between\",SUMIFS(Breakdowns!Q:Q,Breakdowns!$H:$H,\">=\"&$B9,Breakdowns!$H:$H,\"<\"&$D9,Breakdowns!$AA:$AA,\"=No\"),SUMIFS(Breakdowns!Q:Q,Breakdowns!$H:$H,\">=\"&$B9,Breakdowns!$AA:$AA,\"=No\"))),IF($A9=\"\",\"\",IF($A9=\"between\",SUMIFS(Breakdowns!Q:Q,Breakdowns!$H:$H,\">=\"&$B9,Breakdowns!$H:$H,\"<\"&$D9),SUMIFS(Breakdowns!Q:Q,Breakdowns!$H:$H,\">=\"&$B9))))","v":385738},{"$f":"IF($P$1,IF($A9=\"\",\"\",IF($A9=\"between\",SUMIFS(Breakdowns!S:S,Breakdowns!$H:$H,\">=\"&$B9,Breakdowns!$H:$H,\"<\"&$D9,Breakdowns!$AA:$AA,\"=No\"),SUMIFS(Breakdowns!S:S,Breakdowns!$H:$H,\">=\"&$B9,Breakdowns!$AA:$AA,\"=No\"))),IF($A9=\"\",\"\",IF($A9=\"between\",SUMIFS(Breakdowns!S:S,Breakdowns!$H:$H,\">=\"&$B9,Breakdowns!$H:$H,\"<\"&$D9),SUMIFS(Breakdowns!S:S,Breakdowns!$H:$H,\">=\"&$B9))))","v":3682100576},{"$f":"IF($P$1,IF($A9=\"\",\"\",IF($A9=\"between\",SUMIFS(Breakdowns!U:U,Breakdowns!$H:$H,\">=\"&$B9,Breakdowns!$H:$H,\"<\"&$D9,Breakdowns!$AA:$AA,\"=No\"),SUMIFS(Breakdowns!U:U,Breakdowns!$H:$H,\">=\"&$B9,Breakdowns!$AA:$AA,\"=No\"))),IF($A9=\"\",\"\",IF($A9=\"between\",SUMIFS(Breakdowns!U:U,Breakdowns!$H:$H,\">=\"&$B9,Breakdowns!$H:$H,\"<\"&$D9),SUMIFS(Breakdowns!U:U,Breakdowns!$H:$H,\">=\"&$B9))))","v":3259437346},{"$f":"IF($P$1,IF($A9=\"\",\"\",IF($A9=\"between\",SUMIFS(Breakdowns!W:W,Breakdowns!$H:$H,\">=\"&$B9,Breakdowns!$H:$H,\"<\"&$D9,Breakdowns!$AA:$AA,\"=No\"),SUMIFS(Breakdowns!W:W,Breakdowns!$H:$H,\">=\"&$B9,Breakdowns!$AA:$AA,\"=No\"))),IF($A9=\"\",\"\",IF($A9=\"between\",SUMIFS(Breakdowns!W:W,Breakdowns!$H:$H,\">=\"&$B9,Breakdowns!$H:$H,\"<\"&$D9),SUMIFS(Breakdowns!W:W,Breakdowns!$H:$H,\">=\"&$B9))))","v":218469954},{"$f":"IF($P$1,IF($A9=\"\",\"\",IF($A9=\"between\",SUMIFS(Breakdowns!Y:Y,Breakdowns!$H:$H,\">=\"&$B9,Breakdowns!$H:$H,\"<\"&$D9,Breakdowns!$AA:$AA,\"=No\"),SUMIFS(Breakdowns!Y:Y,Breakdowns!$H:$H,\">=\"&$B9,Breakdowns!$AA:$AA,\"=No\"))),IF($A9=\"\",\"\",IF($A9=\"between\",SUMIFS(Breakdowns!Y:Y,Breakdowns!$H:$H,\">=\"&$B9,Breakdowns!$H:$H,\"<\"&$D9),SUMIFS(Breakdowns!Y:Y,Breakdowns!$H:$H,\">=\"&$B9))))","v":210473402},null,null,null,null,null,{"$f":"IFERROR(IF(A10=\"Over\",\"Over \"&FIXED(B10,0,0),FIXED(B10,0,0)&\" to \"&FIXED(D10,0,0)),\"\")","v":""},""]
[{"$f":"IF(OR(A9=\"Over\",A9=\"\"),\"\",IF(D10=\"\",\"Over\",\"Between\"))","v":""},"",{"$f":"IF(D10<>\"\",\"and\",\"\")","v":""},null,"invalid bin",{"$f":"IF($P$1,IF($A10=\"\",\"\",IF($A10=\"between\",SUMIFS(Breakdowns!L:L,Breakdowns!$H:$H,\">=\"&$B10,Breakdowns!$H:$H,\"<\"&$D10,Breakdowns!$AA:$AA,\"=No\"),SUMIFS(Breakdowns!L:L,Breakdowns!$H:$H,\">=\"&$B10,Breakdowns!$AA:$AA,\"=No\"))),IF($A10=\"\",\"\",IF($A10=\"between\",SUMIFS(Breakdowns!L:L,Breakdowns!$H:$H,\">=\"&$B10,Breakdowns!$H:$H,\"<\"&$D10),SUMIFS(Breakdowns!L:L,Breakdowns!$H:$H,\">=\"&$B10))))","v":""},{"$f":"IF($P$1,IF($A10=\"\",\"\",IF($A10=\"between\",SUMIFS(Breakdowns!M:M,Breakdowns!$H:$H,\">=\"&$B10,Breakdowns!$H:$H,\"<\"&$D10,Breakdowns!$AA:$AA,\"=No\"),SUMIFS(Breakdowns!M:M,Breakdowns!$H:$H,\">=\"&$B10,Breakdowns!$AA:$AA,\"=No\"))),IF($A10=\"\",\"\",IF($A10=\"between\",SUMIFS(Breakdowns!M:M,Breakdowns!$H:$H,\">=\"&$B10,Breakdowns!$H:$H,\"<\"&$D10),SUMIFS(Breakdowns!M:M,Breakdowns!$H:$H,\">=\"&$B10))))","v":""},{"$f":"IF($P$1,IF($A10=\"\",\"\",IF($A10=\"between\",SUMIFS(Breakdowns!O:O,Breakdowns!$H:$H,\">=\"&$B10,Breakdowns!$H:$H,\"<\"&$D10,Breakdowns!$AA:$AA,\"=No\"),SUMIFS(Breakdowns!O:O,Breakdowns!$H:$H,\">=\"&$B10,Breakdowns!$AA:$AA,\"=No\"))),IF($A10=\"\",\"\",IF($A10=\"between\",SUMIFS(Breakdowns!O:O,Breakdowns!$H:$H,\">=\"&$B10,Breakdowns!$H:$H,\"<\"&$D10),SUMIFS(Breakdowns!O:O,Breakdowns!$H:$H,\">=\"&$B10))))","v":""},{"$f":"IF($P$1,IF($A10=\"\",\"\",IF($A10=\"between\",SUMIFS(Breakdowns!Q:Q,Breakdowns!$H:$H,\">=\"&$B10,Breakdowns!$H:$H,\"<\"&$D10,Breakdowns!$AA:$AA,\"=No\"),SUMIFS(Breakdowns!Q:Q,Breakdowns!$H:$H,\">=\"&$B10,Breakdowns!$AA:$AA,\"=No\"))),IF($A10=\"\",\"\",IF($A10=\"between\",SUMIFS(Breakdowns!Q:Q,Breakdowns!$H:$H,\">=\"&$B10,Breakdowns!$H:$H,\"<\"&$D10),SUMIFS(Breakdowns!Q:Q,Breakdowns!$H:$H,\">=\"&$B10))))","v":""},{"$f":"IF($P$1,IF($A10=\"\",\"\",IF($A10=\"between\",SUMIFS(Breakdowns!S:S,Breakdowns!$H:$H,\">=\"&$B10,Breakdowns!$H:$H,\"<\"&$D10,Breakdowns!$AA:$AA,\"=No\"),SUMIFS(Breakdowns!S:S,Breakdowns!$H:$H,\">=\"&$B10,Breakdowns!$AA:$AA,\"=No\"))),IF($A10=\"\",\"\",IF($A10=\"between\",SUMIFS(Breakdowns!S:S,Breakdowns!$H:$H,\">=\"&$B10,Breakdowns!$H:$H,\"<\"&$D10),SUMIFS(Breakdowns!S:S,Breakdowns!$H:$H,\">=\"&$B10))))","v":""},{"$f":"IF($P$1,IF($A10=\"\",\"\",IF($A10=\"between\",SUMIFS(Breakdowns!U:U,Breakdowns!$H:$H,\">=\"&$B10,Breakdowns!$H:$H,\"<\"&$D10,Breakdowns!$AA:$AA,\"=No\"),SUMIFS(Breakdowns!U:U,Breakdowns!$H:$H,\">=\"&$B10,Breakdowns!$AA:$AA,\"=No\"))),IF($A10=\"\",\"\",IF($A10=\"between\",SUMIFS(Breakdowns!U:U,Breakdowns!$H:$H,\">=\"&$B10,Breakdowns!$H:$H,\"<\"&$D10),SUMIFS(Breakdowns!U:U,Breakdowns!$H:$H,\">=\"&$B10))))","v":""},{"$f":"IF($P$1,IF($A10=\"\",\"\",IF($A10=\"between\",SUMIFS(Breakdowns!W:W,Breakdowns!$H:$H,\">=\"&$B10,Breakdowns!$H:$H,\"<\"&$D10,Breakdowns!$AA:$AA,\"=No\"),SUMIFS(Breakdowns!W:W,Breakdowns!$H:$H,\">=\"&$B10,Breakdowns!$AA:$AA,\"=No\"))),IF($A10=\"\",\"\",IF($A10=\"between\",SUMIFS(Breakdowns!W:W,Breakdowns!$H:$H,\">=\"&$B10,Breakdowns!$H:$H,\"<\"&$D10),SUMIFS(Breakdowns!W:W,Breakdowns!$H:$H,\">=\"&$B10))))","v":""},{"$f":"IF($P$1,IF($A10=\"\",\"\",IF($A10=\"between\",SUMIFS(Breakdowns!Y:Y,Breakdowns!$H:$H,\">=\"&$B10,Breakdowns!$H:$H,\"<\"&$D10,Breakdowns!$AA:$AA,\"=No\"),SUMIFS(Breakdowns!Y:Y,Breakdowns!$H:$H,\">=\"&$B10,Breakdowns!$AA:$AA,\"=No\"))),IF($A10=\"\",\"\",IF($A10=\"between\",SUMIFS(Breakdowns!Y:Y,Breakdowns!$H:$H,\">=\"&$B10,Breakdowns!$H:$H,\"<\"&$D10),SUMIFS(Breakdowns!Y:Y,Breakdowns!$H:$H,\">=\"&$B10))))","v":""},null,null,null,null,null,"",""]
{"$rows_left_out":111}