{"text_format":"1","workbook":"xlsx","n_sheets":4,"sheets":["Read Me","Data Dictionary","Breakdowns","Summary"],"not_rendered":{"charts":2,"images":0,"macros":1,"external_links":0,"defined_names":17,"comments":0,"pivot_tables":0},"unopened":[],"bounds":{"document_bytes":16777216,"sheet_cells":100000,"rows_first":2000,"rows_last":500,"rows_between":2000,"halvings":0,"cell_chars":16384,"cell_head_chars":4096},"cells_cut":0,"cells_raw":0,"read":"whole","date_system":"1900"}

{"sheet":"Read Me","index":0,"n_rows":0,"n_cols":0,"rows_kept":0,"cut":false,"hidden":false,"merged":[]}

{"sheet":"Data Dictionary","index":1,"n_rows":51,"n_cols":3,"rows_kept":51,"cut":false,"hidden":false,"merged":[]}
["Term","Who reports it?","Definition"]
["Agency","All","The transit agency's name."]
["City","All","The city in which the agency is headquartered."]
["State","All","The state in which the agency is headquartered."]
["Legacy NTD ID","All","A four-digit identifying number for each agency used in the legacy NTD system."]
["NTD ID","All","A five-digit identifying number for each agency used in the current NTD system."]
["Organization Type","All","Description of the agency's legal entity."]
["Reporter Type","All","The type of NTD report that the agency completed this year."]
["Primary UZA Population","DOES NOT APPLY TO: Rural General Public Transit Sub-recipients, Intercity Bus Sub-recipients","The population of the urbanized area primarily served by the agency."]
["Agency VOMS","DOES NOT APPLY TO: Building Reporters, Planning Reporters, Separate Service Reporters, Tribal Subsidy Reporters, Intercity Bus Sub-recipients","The number of revenue vehicles operated across the whole agency to meet the annual maximum service requirement. This is the revenue vehicle count during the peak season of the year; on the week and day that maximum service is provided. Vehicles operated in maximum service (VOMS) exclude atypical days and one-time special events."]
["Mode","DOES NOT APPLY TO: Planning Reporters, Tribal Subsidy Reporters, Intercity Bus Sub-recipients","A system for carrying transit passengers described by specific right-of-way (ROW), technology and operational features."]
["Type of Service","DOES NOT APPLY TO: Planning Reporters, Tribal Subsidy Reporters, Intercity Bus Sub-recipients","Describes how public transportation services are provided by the transit agency: directly operated (DO) or purchased transportation (PT) services."]
["Mode VOMS","DOES NOT APPLY TO: Building Reporters, Planning Reporters, Separate Service Reporters, Tribal Subsidy Reporters, Intercity Bus Sub-recipients","The number of revenue vehicles operated by the given mode and type of service to meet the annual maximum service requirement. This is the revenue vehicle count during the peak season of the year; on the week and day that maximum service is provided. Vehicles operated in maximum service (VOMS) exclude atypical days and one-time special events."]
["Major Mechanical Failures","ONLY APPLIES TO: Full Reporters","A failure of some mechanical element of the revenue vehicle that prevents the vehicle from completing a scheduled revenue trip or from starting the next scheduled revenue trip because actual movement is limited or because of safety concerns."]
["Other Mechanical Failures","ONLY APPLIES TO: Full Reporters","A failure of some other mechanical element of the revenue vehicle that, because of local agency policy, prevents the revenue vehicle from completing a scheduled revenue trip or from starting the next scheduled revenue trip even though the vehicle is physically able to continue in revenue service. For example, a malfunction in the farebox or the air conditioner would be classified thus."]
["Total Mechanical Failures","ONLY APPLIES TO: Full Reporters","The sum of major and other mechanical failures."]
["Vehicle/Passenger Car Miles","DOES NOT APPLY TO: Building Reporters, Planning Reporters, Separate Service Reporters, Tribal Subsidy Reporters, Intercity Bus Sub-recipients, Reduced Reporters","The miles that vehicles (or passenger cars, for rail service) travel while in revenue service (vehicle revenue miles (VRM)) plus deadhead miles. Vehicle miles exclude miles for charter services, school bus service, operator training, and vehicle maintenance testing."]
["Vehicle/Passenger Car Revenue Miles","DOES NOT APPLY TO: Building Reporters, Planning Reporters, Separate Service Reporters, Tribal Subsidy Reporters, Intercity Bus Sub-recipients","The miles that vehicles (or passenger cars, for rail service) travel while in revenue service. Vehicle revenue miles exclude deadhead, operator training, maintenance testing, and school bus and charter services."]
["Train Miles","ONLY APPLIES TO: Full Reporters","The miles that trains travel while in revenue service (train revenue miles) plus deadhead miles. Train miles exclude miles for charter services, operator training, and vehicle maintenance testing."]
["Train Revenue Miles","ONLY APPLIES TO: Full Reporters","The miles that trains travel while in revenue service. Train revenue miles exclude deadhead, operator training, maintenance testing, and charter services."]
["Rural General Public Transit",null,"Reporter type for agencies that do not operate in an urban area and are not Tribes."]
["Intercity Bus",null,"Reporter type for private bus lines providing non-transit service connecting wide-ranging areas."]
["Building Reporter",null,"Reporter type for agencies that are building a new transit service but not yet operating it."]
["Planning Reporter",null,"Reporter type for entities that expend funds in planning transit but do not operate service."]
["Separate Service",null,"Reporter type for agencies that have a contractual relationship with another NTD reporter to provide service but do not report any service themselves."]
["Tribal Subsidy",null,"Reporter type for Tribes that subsidize service but do not operate service or pay the full cost of service."]
["Full Reporter",null,"Reporter type for agencies that operate urban service and complete the most detailed level of NTD report. Urban agencies that operate more than 30 vehicles or operate Fixed Guideway service are required to complete Full Reports; other urban agencies may do so if they wish."]
["Reduced Reporter",null,"Reporter type for agencies that operate urban service but complete a simplified NTD report. Urban agencies that operate 30 or fewer vehicles and do not operate Fixed Guideway service are eligible to complete Reduced Reports. This is sometimes called a Small Systems Report."]
["Urbanized Area (UZA)",null,"An area defined by the U. S. Census Bureau that includes: \n- One or more incorporated cities, villages, and towns (central place) \n- The adjacent densely settled surrounding territory (urban fringe) that together has a minimum of 50,000 persons \nThe urban fringe generally consists of contiguous territory having a density of at least 1,000 persons per square mile. Urbanized areas do not conform to congressional districts or any other political boundaries."]
["Alaska Railroad (AR)",null,"The passenger service portion of the Alaska Railroad Corporation. The service encompasses only car miles for passenger cars; car miles for freight cars are specifically excluded."]
["Bus (MB)",null,"A transit mode comprised of rubber-tired passenger vehicles operating on fixed routes and schedules over roadways. Vehicles are powered by: \n- Diesel \n- Gasoline \n- Battery \n- Alternative fuel engines contained within the vehicle"]
["Bus Rapid Transit (RB)",null,"Fixed-route bus mode: \n- In which the majority of each line operates in a separated right-of-way dedicated for public transportation use during peak periods; and \n- That includes features that emulate the services provided by rail fixed guideway public transportation systems, including: \n   o Defined stations \n   o Traffic signal priority for public transportation vehicles \n   o Short headway bidirectional services for a substantial part of weekdays and weekend days \n   o Pre-board ticketing, platform level boarding, and separate branding \nThis mode may include portions of service that are fixed-guideway and non-fixed-guideway."]
["Cable Car (CC)",null,"A transit mode that is an electric railway with individually controlled transit vehicles attached to a moving cable located below the street surface and powered by engines or motors at a central location, not onboard the vehicle."]
["Commuter Bus (CB)",null,"Fixed-route bus systems that are primarily connecting outlying areas with a central city through bus service that operates with at least five miles of continuous closed-door service. This service may operate motorcoaches (aka over-the-road buses), and usually features peak scheduling, multiple-trip tickets, and limited stops in the central city."]
["Commuter Rail (CR)",null,"A transit mode that is an electric or diesel propelled railway for urban passenger train service consisting of local short distance travel operating between a central city and adjacent suburbs. Service must be operated on a regular basis by or under contract with a transit operator for the purpose of transporting passengers within urbanized areas (UZAs), or between urbanized areas and outlying areas. \nSuch rail service, using either locomotive hauled or self-propelled railroad passenger cars, is generally characterized by: \n- Multi-trip tickets \n- Specific station to station fares \n- Railroad employment practices \n- Usually only one or two stations in the central business district \nIt does not include: \n- Heavy rail (HR) rapid transit \n- Light rail (LR)/streetcar transit service \nIntercity rail service is excluded, except for that portion of such service that is operated by or under contract with a public transit agency for predominantly commuter services. Predominantly commuter service means that for any given trip segment (i.e., distance between any two stations), more than 50 percent of the average daily ridership makes a return trip on the same day. Only the predominantly commuter service portion of an intercity route is eligible for inclusion when determining commuter rail (CR) route miles."]
["Demand Response (DR)",null,"A transit mode comprised of automobiles, vans or small buses operating in response to calls from passengers or their agents to the transit operator, who then dispatches a vehicle to pick up the passengers and transport them to their destinations. A demand response (DR) operation is characterized by the following: \n- The vehicles do not operate over a fixed route or on a fixed schedule except, perhaps, on a temporary basis to satisfy a special need; and \n- Typically, the vehicle may be dispatched to pick up several passengers at different pick-up points before taking them to their respective destinations and may even be interrupted en route to these destinations to pick up other passengers. \nThe following types of operations fall under the above definitions provided they are not on a scheduled fixed route basis: \n- Many origins—many destinations \n- Many origins—one destination \n- One origin—many destinations \n- One origin—one destination"]
["Demand Response Taxi (DT)",null,"A special form of the demand response mode operated through taxicab providers. The mode is always purchased transportation type of service. In order to be reportable, there must be a system in place through which passengers can share rides."]
["Ferryboat (FB)",null,"A transit mode comprised of vessels carrying passengers and/or vehicles over a body of water that are generally steam or diesel powered. Intercity ferryboat (FB) service is excluded, except for that portion of such service that is operated by or under contract with a public transit agency for predominantly commuter services. Predominantly commuter service means that for any given trip segment (i.e., distance between any two piers), more than 50 percent of the average daily ridership makes a return trip on the ferryboat on the same day. Only the predominantly commuter service portion of an intercity route is eligible for inclusion when determining ferryboat (FB) route miles."]
["Heavy Rail (HR)",null,"A transit mode that is an electric railway with the capacity for a heavy volume of traffic. It is characterized by: \n- High speed and rapid acceleration passenger rail cars operating singly or in multi-car trains on fixed rails \n- Separate rights-of-way (ROW) from which all other vehicular and foot traffic are excluded \n- Sophisticated signaling \n- Raised platform loading"]
["Hybrid Rail (YR)",null,"Rail systems primarily operating routes on the National system of railroads, but not operating with the characteristics of commuter rail. This service typically operates light rail-type vehicles as diesel multipleunit trains (DMU’s). These trains do not meet Federal Railroad Administration standards, and so must operate with temporal separation from freight rail traffic."]
["Inclined Plane (IP)",null,"A transit mode that is a railway operating over exclusive right-of-way (ROW) on steep grades (slopes) with powerless vehicles propelled by moving cables attached to the vehicles and powered by engines or motors at a central location not onboard the vehicle. The special tramway types of vehicles have passenger seats that remain horizontal while the undercarriage (truck) is angled parallel to the slope."]
["Light Rail (LR)",null,"A transit mode that is typically an electric railway with a light volume traffic capacity compared to heavy rail (HR). It is characterized by: \n- Passenger rail cars operating singly (or in short, usually two car, trains) on fixed rails in shared or exclusive right-of-way (ROW) \n- Low or high platform loading \n- Vehicle power drawn from an overhead electric line via a trolley or a pantograph"]
["Monorail/Automated Guideway (MG)",null,"Monorail and Automated Guideway modes operate on exclusive guideway without using steel wheels on rails."]
["Streetcar Rail (SR)",null,"This mode is for rail transit systems operating entire routes predominantly on streets in mixed-traffic. This service typically operates with single-car trains powered by overhead catenaries and with frequent stops."]
["Trolleybus (TB)",null,"A transit mode comprised of electric rubber-tired passenger vehicles, manually steered and operating singly on city streets. Vehicles are propelled by a motor drawing current through overhead wires via trolleys, from a central power source not onboard the vehicle."]
["Vanpool (VP)",null,"A transit mode comprised of vans, small buses and other vehicles operating as a ride sharing arrangement, providing transportation to a group of individuals traveling directly between their homes and a regular destination within the same geographical area."]
["Jitney (JT)",null,"A transit mode comprising passenger cars or vans operating on fixed routes (sometimes with minor deviations) as demand warrants without fixed schedules or fixed stops."]
["Aerial Tramway (TR)",null,"A transit mode that is an electric system of aerial cables with suspended powerless passenger vehicles. The vehicles are propelled by separate cables attached to the vehicle suspension system and powered by engines or motors at a central location not on-board the vehicle."]
["Publico (PB)",null,"A transit mode comprised of passenger vans or small buses operating with fixed routes but no fixed schedules in Puerto Rico. Publicos (PB) are a privately owned and operated public transit service which is market oriented and unsubsidized, but regulated through a public service commission, state or local government. Publicos (PB) are operated under franchise agreements, fares are regulated by route and there are special insurance requirements. Vehicle capacity varies from 8 to 24, and the vehicles may be owned or leased by the operator."]
["Questionable (Q)",null,"FTA marks a data point as Questionable when there is reason to believe it is incorrect, but the reporting agency has been unable to correct the data or offer an explanation for its anomalous appearance."]
["Waived (W)",null,"FTA marks a data point as Waived when the reporting agency has not reported the data point according to NTD reporting requirements, but has received a waiver to report the data as-is for one year."]

{"sheet":"Breakdowns","index":2,"n_rows":1250,"n_cols":29,"rows_kept":1250,"cut":false,"hidden":false,"merged":[]}
["Agency","City","State","Legacy NTD ID","NTD ID","Organization Type","Reporter Type","Primary UZA Population","Agency VOMS","Mode","Type of Service","Mode VOMS","Major Mechanical Failures","Major Mechanical Failures Questionable","Other Mechanical Failures","Other Mechanical Failures Questionable","Total Mechanical Failures","Total Mechanical Failures Questionable","Vehicle/Passenger Car Miles","Vehicle/Passenger Car Miles Questionable","Vehicle/Passenger Car Revenue Miles","Vehicle/Passenger Car Revenue Miles Questionable","Train Miles","Train Miles Questionable","Train Revenue Miles","Train Revenue Miles Questionable","Any Data Questionable?",null,{"$f":"IF(AC4=1,1,0)","v":1}]
["MTA New York City Transit","New York","NY",2008,20008,"Subsidiary Unit of a Transit Agency, Reporting Separately","Full Reporter",18351295,11004,"HR","DO",5324,3097,null,10196,null,13293,null,357939619,null,347091534,null,39342476,null,38134129,null,{"$f":"IF(OR(Z2=\"Q\",X2=\"Q\",V2=\"Q\",T2=\"Q\",R2=\"Q\",P2=\"Q\",N2=\"Q\"),\"Yes\",\"No\")","v":"No"},null,"Hide Questionable Data Tags"]
["MTA New York City Transit","New York","NY",2008,20008,"Subsidiary Unit of a Transit Agency, Reporting Separately","Full Reporter",18351295,11004,"MB","DO",3286,9035,null,3630,null,12665,null,98994910,null,86863364,null,0,null,0,null,"No",null,"Show Questionable Data Tags"]
["MTA New York City Transit","New York","NY",2008,20008,"Subsidiary Unit of a Transit Agency, Reporting Separately","Full Reporter",18351295,11004,"DR","PT",1794,2640,null,2515,null,5155,null,59318874,null,48814480,null,0,null,0,null,"No",null,1]
["MTA New York City Transit","New York","NY",2008,20008,"Subsidiary Unit of a Transit Agency, Reporting Separately","Full Reporter",18351295,11004,"CB","DO",455,227,null,76,null,303,null,15561164,null,9214967,null,0,null,0,null,"No"]
["MTA New York City Transit","New York","NY",2008,20008,"Subsidiary Unit of a Transit Agency, Reporting Separately","Full Reporter",18351295,11004,"RB","DO",145,293,null,140,null,433,null,3183091,null,2988560,null,0,null,0,null,"No"]
["New Jersey Transit Corporation","Newark","NJ",2080,20080,"Other Publicly-Owned or Privately Chartered Corporation","Full Reporter",18351295,4056,"MB","DO",1857,6483,null,3495,null,9978,null,94165129,null,72451012,null,0,null,0,null,"No"]
["New Jersey Transit Corporation","Newark","NJ",2080,20080,"Other Publicly-Owned or Privately Chartered Corporation","Full Reporter",18351295,4056,"CR","DO",1267,236,null,0,null,236,null,64713399,null,61393168,null,9525861,null,9031214,null,"No"]
["New Jersey Transit Corporation","Newark","NJ",2080,20080,"Other Publicly-Owned or Privately Chartered Corporation","Full Reporter",18351295,4056,"DR","PT",474,233,null,197,null,430,null,17857141,null,14882395,null,0,null,0,null,"No"]
["New Jersey Transit Corporation","Newark","NJ",2080,20080,"Other Publicly-Owned or Privately Chartered Corporation","Full Reporter",18351295,4056,"VP","PT",204,8,null,16,null,24,null,4701081,null,4701081,null,0,null,0,null,"No"]
["New Jersey Transit Corporation","Newark","NJ",2080,20080,"Other Publicly-Owned or Privately Chartered Corporation","Full Reporter",18351295,4056,"MB","PT",182,216,null,907,null,1123,null,8324242,null,7294248,null,0,null,0,null,"No"]
["New Jersey Transit Corporation","Newark","NJ",2080,20080,"Other Publicly-Owned or Privately Chartered Corporation","Full Reporter",18351295,4056,"LR","PT",42,44,null,5,null,49,null,1991437,null,1951272,null,1284696,null,1262188,null,"No"]
["New Jersey Transit Corporation","Newark","NJ",2080,20080,"Other Publicly-Owned or Privately Chartered Corporation","Full Reporter",18351295,4056,"YR","PT",16,64,null,3,null,67,null,1329244,null,1299376,null,1026060,null,1026060,null,"No"]
["New Jersey Transit Corporation","Newark","NJ",2080,20080,"Other Publicly-Owned or Privately Chartered Corporation","Full Reporter",18351295,4056,"LR","DO",14,72,null,5,null,77,null,522999,null,512245,null,522999,null,512245,null,"No"]
["Los Angeles County Metropolitan Transportation Authority dba: Metro","Los Angeles","CA",9154,90154,"Independent Public Agency or Authority of Transit Service","Full Reporter",12150996,3544,"MB","DO",1777,5706,null,11235,null,16941,null,81824514,null,68503553,null,0,null,0,null,"No"]
["Los Angeles County Metropolitan Transportation Authority dba: Metro","Los Angeles","CA",9154,90154,"Independent Public Agency or Authority of Transit Service","Full Reporter",12150996,3544,"VP","PT",1378,1,null,103,null,104,null,32197552,null,32197552,null,0,null,0,null,"No"]
["Los Angeles County Metropolitan Transportation Authority dba: Metro","Los Angeles","CA",9154,90154,"Independent Public Agency or Authority of Transit Service","Full Reporter",12150996,3544,"LR","DO",161,504,null,116,null,620,null,14190109,null,13746952,null,6473063,null,6272460,null,"No"]
["Los Angeles County Metropolitan Transportation Authority dba: Metro","Los Angeles","CA",9154,90154,"Independent Public Agency or Authority of Transit Service","Full Reporter",12150996,3544,"MB","PT",125,653,null,215,null,868,null,6919472,null,5679764,null,0,null,0,null,"No"]
["Los Angeles County Metropolitan Transportation Authority dba: Metro","Los Angeles","CA",9154,90154,"Independent Public Agency or Authority of Transit Service","Full Reporter",12150996,3544,"HR","DO",70,57,null,17,null,74,null,7084353,null,6884795,null,1465782,null,1426125,null,"No"]
["Los Angeles County Metropolitan Transportation Authority dba: Metro","Los Angeles","CA",9154,90154,"Independent Public Agency or Authority of Transit Service","Full Reporter",12150996,3544,"RB","DO",33,157,null,463,null,620,null,2066164,null,1977433,null,0,null,0,null,"No"]
["Washington Metropolitan Area Transit Authority","Washington","DC",3030,30030,"Independent Public Agency or Authority of Transit Service","Full Reporter",4586770,3172,"MB","DO",1301,4930,null,1397,null,6327,null,50277092,null,39363678,null,0,null,0,null,"No"]
["Washington Metropolitan Area Transit Authority","Washington","DC",3030,30030,"Independent Public Agency or Authority of Transit Service","Full Reporter",4586770,3172,"HR","DO",954,1512,null,76,null,1588,null,81483986,null,77967423,null,12842603,null,12336344,null,"No"]
["Washington Metropolitan Area Transit Authority","Washington","DC",3030,30030,"Independent Public Agency or Authority of Transit Service","Full Reporter",4586770,3172,"DR","PT",642,312,null,995,null,1307,null,22279391,null,18912329,null,0,null,0,null,"No"]
["King County Department of Transportation","Seattle","WA",1,1,"City, County or Local Government Unit or Department of Transportation","Full Reporter",3059393,2818,"VP","DO",1469,34,null,0,null,34,null,14879324,null,14879324,null,0,null,0,null,"No"]
["King County Department of Transportation","Seattle","WA",1,1,"City, County or Local Government Unit or Department of Transportation","Full Reporter",3059393,2818,"MB","DO",949,6998,null,7328,null,14326,null,41037935,null,32450352,null,0,null,0,null,"No"]
["King County Department of Transportation","Seattle","WA",1,1,"City, County or Local Government Unit or Department of Transportation","Full Reporter",3059393,2818,"DR","PT",174,70,null,28,null,98,null,9380470,null,7934196,null,0,null,0,null,"No"]
["King County Department of Transportation","Seattle","WA",1,1,"City, County or Local Government Unit or Department of Transportation","Full Reporter",3059393,2818,"TB","DO",138,2165,null,2021,null,4186,null,3194807,null,3063846,null,0,null,0,null,"No"]
["King County Department of Transportation","Seattle","WA",1,1,"City, County or Local Government Unit or Department of Transportation","Full Reporter",3059393,2818,"MB","PT",32,25,null,56,null,81,null,1443318,null,1141070,null,0,null,0,null,"No"]
["King County Department of Transportation","Seattle","WA",1,1,"City, County or Local Government Unit or Department of Transportation","Full Reporter",3059393,2818,"SR","DO",8,38,null,74,null,112,null,195009,null,191472,null,195009,null,191472,null,"No"]
["King County Department of Transportation","Seattle","WA",1,1,"City, County or Local Government Unit or Department of Transportation","Full Reporter",3059393,2818,"FB","DO",2,0,null,0,null,0,null,51704,null,51704,null,0,null,0,null,"No"]
["Chicago Transit Authority","Chicago","IL",5066,50066,"Independent Public Agency or Authority of Transit Service","Full Reporter",8608208,2712,"MB","DO",1572,8547,null,9107,null,17654,null,57732367,null,52304804,null,0,null,0,null,"No"]
["Chicago Transit Authority","Chicago","IL",5066,50066,"Independent Public Agency or Authority of Transit Service","Full Reporter",8608208,2712,"HR","DO",1140,225,null,9117,null,9342,null,72690180,null,71811535,null,12084328,null,11949339,null,"No"]
["Massachusetts Bay Transportation Authority","Boston","MA",1003,10003,"Independent Public Agency or Authority of Transit Service","Full Reporter",4181019,2374,"MB","DO",779,1334,null,410,null,1744,null,25479827,null,22704051,null,0,null,0,null,"No"]
["Massachusetts Bay Transportation Authority","Boston","MA",1003,10003,"Independent Public Agency or Authority of Transit Service","Full Reporter",4181019,2374,"DR","PT",612,141,null,1325,null,1466,null,21329393,null,17828666,null,0,null,0,null,"No"]
["Massachusetts Bay Transportation Authority","Boston","MA",1003,10003,"Independent Public Agency or Authority of Transit Service","Full Reporter",4181019,2374,"CR","PT",421,304,null,34,null,338,null,24145958,null,23532668,null,4499676,null,4385812,null,"No"]
["Massachusetts Bay Transportation Authority","Boston","MA",1003,10003,"Independent Public Agency or Authority of Transit Service","Full Reporter",4181019,2374,"HR","DO",336,348,null,21,null,369,null,23810785,null,23247288,null,3968464,null,3874548,null,"No"]
["Massachusetts Bay Transportation Authority","Boston","MA",1003,10003,"Independent Public Agency or Authority of Transit Service","Full Reporter",4181019,2374,"LR","DO",156,1143,null,93,null,1236,null,6513441,null,6499541,null,3853709,null,3845486,null,"No"]
["Massachusetts Bay Transportation Authority","Boston","MA",1003,10003,"Independent Public Agency or Authority of Transit Service","Full Reporter",4181019,2374,"RB","DO",30,21,null,6,null,27,null,1119552,null,1064618,null,0,null,0,null,"No"]
["Massachusetts Bay Transportation Authority","Boston","MA",1003,10003,"Independent Public Agency or Authority of Transit Service","Full Reporter",4181019,2374,"TB","DO",22,4,null,3,null,7,null,258782,null,257499,null,0,null,0,null,"No"]
["Massachusetts Bay Transportation Authority","Boston","MA",1003,10003,"Independent Public Agency or Authority of Transit Service","Full Reporter",4181019,2374,"MB","PT",9,6,null,4,null,10,null,407608,null,390655,null,0,null,0,null,"No"]
["Massachusetts Bay Transportation Authority","Boston","MA",1003,10003,"Independent Public Agency or Authority of Transit Service","Full Reporter",4181019,2374,"FB","PT",9,0,null,0,null,0,null,233617,null,230425,null,0,null,0,null,"No"]
["Southeastern Pennsylvania Transportation Authority","Philadelphia","PA",3019,30019,"Independent Public Agency or Authority of Transit Service","Full Reporter",5441567,2339,"MB","DO",1174,5023,null,2304,null,7327,null,45504084,null,39793477,null,0,null,0,null,"No"]
["Southeastern Pennsylvania Transportation Authority","Philadelphia","PA",3019,30019,"Independent Public Agency or Authority of Transit Service","Full Reporter",5441567,2339,"DR","PT",391,712,null,383,null,1095,null,13452600,null,11310034,null,0,null,0,null,"No"]
["Southeastern Pennsylvania Transportation Authority","Philadelphia","PA",3019,30019,"Independent Public Agency or Authority of Transit Service","Full Reporter",5441567,2339,"CR","DO",339,8,null,96,null,104,null,20443066,null,19334288,null,5259514,null,4984666,null,"No"]
["Southeastern Pennsylvania Transportation Authority","Philadelphia","PA",3019,30019,"Independent Public Agency or Authority of Transit Service","Full Reporter",5441567,2339,"HR","DO",284,59,null,3358,null,3417,null,17419496,null,17265382,null,3356333,null,3325399,null,"No"]
["Southeastern Pennsylvania Transportation Authority","Philadelphia","PA",3019,30019,"Independent Public Agency or Authority of Transit Service","Full Reporter",5441567,2339,"SR","DO",121,18,null,436,null,454,null,3442485,null,3307488,null,3442485,null,3307488,null,"No"]
["Southeastern Pennsylvania Transportation Authority","Philadelphia","PA",3019,30019,"Independent Public Agency or Authority of Transit Service","Full Reporter",5441567,2339,"TB","DO",30,153,null,43,null,196,null,893480,null,875662,null,0,null,0,null,"No"]
["Metropolitan Transit Authority of Harris County, Texas","Houston","TX",6008,60008,"Independent Public Agency or Authority of Transit Service","Full Reporter",4944332,2206,"VP","PT",686,26,null,62,null,88,null,9349083,null,9349083,null,0,null,0,null,"No"]
["Metropolitan Transit Authority of Harris County, Texas","Houston","TX",6008,60008,"Independent Public Agency or Authority of Transit Service","Full Reporter",4944332,2206,"MB","DO",586,3068,null,1505,null,4573,null,32622171,null,28706380,null,0,null,0,null,"No"]
["Metropolitan Transit Authority of Harris County, Texas","Houston","TX",6008,60008,"Independent Public Agency or Authority of Transit Service","Full Reporter",4944332,2206,"DR","PT",338,210,null,718,null,928,null,20106401,null,16177939,null,0,null,0,null,"No"]
["Metropolitan Transit Authority of Harris County, Texas","Houston","TX",6008,60008,"Independent Public Agency or Authority of Transit Service","Full Reporter",4944332,2206,"CB","DO",235,380,null,100,null,480,null,8156290,null,6184864,null,0,null,0,null,"No"]
["Metropolitan Transit Authority of Harris County, Texas","Houston","TX",6008,60008,"Independent Public Agency or Authority of Transit Service","Full Reporter",4944332,2206,"MB","PT",116,494,null,246,null,740,null,6908519,null,6022798,null,0,null,0,null,"No"]
["Metropolitan Transit Authority of Harris County, Texas","Houston","TX",6008,60008,"Independent Public Agency or Authority of Transit Service","Full Reporter",4944332,2206,"CB","PT",64,114,null,54,null,168,null,2866253,null,2088875,null,0,null,0,null,"No"]
["Metropolitan Transit Authority of Harris County, Texas","Houston","TX",6008,60008,"Independent Public Agency or Authority of Transit Service","Full Reporter",4944332,2206,"LR","DO",54,33,null,41,null,74,null,3432126,null,3420828,null,2089545,null,2077909,null,"No"]
["Access Services","El Monte","CA",9157,90157,"Independent Public Agency or Authority of Transit Service","Full Reporter",12150996,1955,"DR","PT",786,739,null,616,null,1355,null,28425533,null,24707073,null,0,null,0,null,"No"]
["Maryland Transit Administration","Baltimore","MD",3034,30034,"State Government Unit or Department of Transportation","Full Reporter",2203663,1634,"MB","DO",627,3980,null,3501,null,7481,null,22946367,null,20140861,null,0,null,0,null,"No"]
["Maryland Transit Administration","Baltimore","MD",3034,30034,"State Government Unit or Department of Transportation","Full Reporter",2203663,1634,"DR","PT",458,166,null,68,null,234,null,20265046,null,17172195,null,0,null,0,null,"No"]
["Maryland Transit Administration","Baltimore","MD",3034,30034,"State Government Unit or Department of Transportation","Full Reporter",2203663,1634,"CB","PT",280,336,null,592,null,928,null,6486765,null,6285675,null,0,null,0,null,"No"]
["Maryland Transit Administration","Baltimore","MD",3034,30034,"State Government Unit or Department of Transportation","Full Reporter",2203663,1634,"CR","PT",142,94,null,0,null,94,null,6816669,null,6386294,null,1288731,null,1221997,null,"No"]
["Maryland Transit Administration","Baltimore","MD",3034,30034,"State Government Unit or Department of Transportation","Full Reporter",2203663,1634,"HR","DO",54,554,null,2415,null,2969,null,5209167,null,5003458,null,1110038,null,1069076,null,"No"]
["Maryland Transit Administration","Baltimore","MD",3034,30034,"State Government Unit or Department of Transportation","Full Reporter",2203663,1634,"LR","DO",38,600,null,710,null,1310,null,3178087,null,3138056,null,1733891,null,1716522,null,"No"]
["Pace - Suburban Bus Division","Arlington Heights","IL",5113,50113,"Independent Public Agency or Authority of Transit Service","Full Reporter",8608208,1619,"VP","DO",664,64,null,5,null,69,null,8873999,null,8873999,null,0,null,0,null,"No"]
["Pace - Suburban Bus Division","Arlington Heights","IL",5113,50113,"Independent Public Agency or Authority of Transit Service","Full Reporter",8608208,1619,"MB","DO",545,2172,null,788,null,2960,null,25688736,null,20561982,null,0,null,0,null,"No"]
["Pace - Suburban Bus Division","Arlington Heights","IL",5113,50113,"Independent Public Agency or Authority of Transit Service","Full Reporter",8608208,1619,"DR","PT",257,79,null,52,null,131,null,5261024,null,4419578,null,0,null,0,null,"No"]
["Pace - Suburban Bus Division","Arlington Heights","IL",5113,50113,"Independent Public Agency or Authority of Transit Service","Full Reporter",8608208,1619,"MB","PT",92,19,null,19,null,38,null,2318598,null,1748298,null,0,null,0,null,"No"]
["Pace - Suburban Bus Division","Arlington Heights","IL",5113,50113,"Independent Public Agency or Authority of Transit Service","Full Reporter",8608208,1619,"DR","DO",8,1,null,2,null,3,null,260385,null,208494,null,0,null,0,null,{"$f":"IF(OR(Z66=\"Q\",X66=\"Q\",V66=\"Q\",T66=\"Q\",R66=\"Q\",P66=\"Q\",N66=\"Q\"),\"Yes\",\"No\")","v":"No"}]
["Orange County Transportation Authority","Orange","CA",9036,90036,"Independent Public Agency or Authority of Transit Service","Full Reporter",12150996,1558,"VP","PT",510,7,null,16,null,23,null,8842342,null,8842342,null,0,null,0,null,"No"]
["Orange County Transportation Authority","Orange","CA",9036,90036,"Independent Public Agency or Authority of Transit Service","Full Reporter",12150996,1558,"DR","PT",491,231,null,30,null,261,null,13887489,null,12314143,null,0,null,0,null,"No"]
["Orange County Transportation Authority","Orange","CA",9036,90036,"Independent Public Agency or Authority of Transit Service","Full Reporter",12150996,1558,"MB","DO",266,1208,null,556,null,1764,null,14233381,null,12047428,null,0,null,0,null,"No"]
["Orange County Transportation Authority","Orange","CA",9036,90036,"Independent Public Agency or Authority of Transit Service","Full Reporter",12150996,1558,"MB","PT",176,965,null,192,null,1157,null,8929478,null,7100169,null,0,null,0,null,"No"]
["Orange County Transportation Authority","Orange","CA",9036,90036,"Independent Public Agency or Authority of Transit Service","Full Reporter",12150996,1558,"CB","PT",23,36,null,6,null,42,null,901428,null,460535,null,0,null,0,null,"No"]
["Orange County Transportation Authority","Orange","CA",9036,90036,"Independent Public Agency or Authority of Transit Service","Full Reporter",12150996,1558,"CB","DO",6,7,null,5,null,12,null,394110,null,240337,null,0,null,0,null,"No"]
["Denver Regional Transportation District","Denver","CO",8006,80006,"Independent Public Agency or Authority of Transit Service","Full Reporter",2374203,1435,"MB","DO",485,302,null,227,null,529,null,25956782,null,21607916,null,0,null,0,null,"No"]
["Denver Regional Transportation District","Denver","CO",8006,80006,"Independent Public Agency or Authority of Transit Service","Full Reporter",2374203,1435,"DR","PT",404,257,null,225,null,482,null,13458593,null,10979096,null,0,null,0,null,"No"]
["Denver Regional Transportation District","Denver","CO",8006,80006,"Independent Public Agency or Authority of Transit Service","Full Reporter",2374203,1435,"MB","PT",388,377,null,548,null,925,null,18286684,null,15151733,null,0,null,0,null,"No"]
["Denver Regional Transportation District","Denver","CO",8006,80006,"Independent Public Agency or Authority of Transit Service","Full Reporter",2374203,1435,"LR","DO",140,285,null,145,null,430,null,11774959,null,11355973,null,4223016,null,3988308,null,"No"]
["Denver Regional Transportation District","Denver","CO",8006,80006,"Independent Public Agency or Authority of Transit Service","Full Reporter",2374203,1435,"CR","PT",18,45,null,26,null,71,null,1686184,null,1663629,null,843092,null,831815,null,"No"]
["Miami-Dade Transit","Miami","FL",4034,40034,"City, County or Local Government Unit or Department of Transportation","Full Reporter",5502379,1181,"MB","DO",709,9571,null,9179,null,18750,null,33794795,null,28242594,null,0,null,0,null,"No"]
["Miami-Dade Transit","Miami","FL",4034,40034,"City, County or Local Government Unit or Department of Transportation","Full Reporter",5502379,1181,"DR","PT",358,108,null,71,null,179,null,15722226,null,13339934,null,0,null,0,null,"No"]
["Miami-Dade Transit","Miami","FL",4034,40034,"City, County or Local Government Unit or Department of Transportation","Full Reporter",5502379,1181,"HR","DO",84,227,null,2087,null,2314,null,8582177,null,8189085,null,2111756,null,1996901,null,"No"]
["Miami-Dade Transit","Miami","FL",4034,40034,"City, County or Local Government Unit or Department of Transportation","Full Reporter",5502379,1181,"MG","DO",23,18,null,393,null,411,null,1219874,null,1189377,null,853912,null,832564,null,"No"]
["Miami-Dade Transit","Miami","FL",4034,40034,"City, County or Local Government Unit or Department of Transportation","Full Reporter",5502379,1181,"CB","PT",7,9,null,60,null,69,null,799252,null,798674,null,0,null,0,null,"No"]
["Metro-North Commuter Railroad Company, dba: MTA Metro-North Railroad","New York","NY",2078,20078,"Subsidiary Unit of a Transit Agency, Reporting Separately","Full Reporter",18351295,1175,"CR","DO",1164,89,null,0,null,89,null,77746007,null,69580238,null,10679956,null,9533735,null,"No"]
["Metro-North Commuter Railroad Company, dba: MTA Metro-North Railroad","New York","NY",2078,20078,"Subsidiary Unit of a Transit Agency, Reporting Separately","Full Reporter",18351295,1175,"MB","PT",9,0,null,7,null,7,null,220531,null,157793,null,0,null,0,null,"No"]
["Metro-North Commuter Railroad Company, dba: MTA Metro-North Railroad","New York","NY",2078,20078,"Subsidiary Unit of a Transit Agency, Reporting Separately","Full Reporter",18351295,1175,"FB","PT",2,3,null,4,null,7,null,48951,null,48951,null,0,null,0,null,"No"]
["MTA Bus Company","New York","NY",2188,20188,"Subsidiary Unit of a Transit Agency, Reporting Separately","Full Reporter",18351295,1093,"MB","DO",1093,3834,null,3094,null,6928,null,37084029,null,27082259,null,0,null,0,null,"No"]
["Utah Transit Authority","Salt Lake City","UT",8001,80001,"Independent Public Agency or Authority of Transit Service","Full Reporter",1021243,1087,"VP","DO",406,3,null,0,null,3,null,6518150,null,6518150,null,0,null,0,null,"No"]
["Utah Transit Authority","Salt Lake City","UT",8001,80001,"Independent Public Agency or Authority of Transit Service","Full Reporter",1021243,1087,"MB","DO",391,907,null,606,null,1513,null,17511624,null,15462834,null,0,null,0,null,"No"]
["Utah Transit Authority","Salt Lake City","UT",8001,80001,"Independent Public Agency or Authority of Transit Service","Full Reporter",1021243,1087,"LR","DO",91,178,null,65,null,243,null,6764853,null,6668973,null,2972129,null,2928141,null,"No"]
["Utah Transit Authority","Salt Lake City","UT",8001,80001,"Independent Public Agency or Authority of Transit Service","Full Reporter",1021243,1087,"DR","DO",61,81,null,57,null,138,null,2019160,null,1731218,null,0,null,0,null,"No"]
["Utah Transit Authority","Salt Lake City","UT",8001,80001,"Independent Public Agency or Authority of Transit Service","Full Reporter",1021243,1087,"CR","DO",45,63,null,14,null,77,null,5425023,null,5401304,null,1356256,null,1350327,null,"No"]
["Utah Transit Authority","Salt Lake City","UT",8001,80001,"Independent Public Agency or Authority of Transit Service","Full Reporter",1021243,1087,"DR","PT",44,23,null,4,null,27,null,1235399,null,974125,null,0,null,0,null,"No"]
["Utah Transit Authority","Salt Lake City","UT",8001,80001,"Independent Public Agency or Authority of Transit Service","Full Reporter",1021243,1087,"CB","DO",43,88,null,47,null,135,null,1421758,null,995499,null,0,null,0,null,"No"]
["Utah Transit Authority","Salt Lake City","UT",8001,80001,"Independent Public Agency or Authority of Transit Service","Full Reporter",1021243,1087,"MB","PT",6,15,null,1,null,16,null,229650,null,204344,null,0,null,0,null,"No"]
["Dallas Area Rapid Transit","Dallas","TX",6056,60056,"Independent Public Agency or Authority of Transit Service","Full Reporter",5121892,1069,"MB","DO",533,1646,null,1202,null,2848,null,31645767,null,27499916,null,0,null,0,null,"No"]
["Dallas Area Rapid Transit","Dallas","TX",6056,60056,"Independent Public Agency or Authority of Transit Service","Full Reporter",5121892,1069,"VP","PT",186,0,null,0,null,0,null,3061242,null,3061242,null,0,null,0,null,"No"]
["Dallas Area Rapid Transit","Dallas","TX",6056,60056,"Independent Public Agency or Authority of Transit Service","Full Reporter",5121892,1069,"DR","PT",106,28,null,482,null,510,null,3300149,null,1986108,null,0,null,0,null,"No"]
["Dallas Area Rapid Transit","Dallas","TX",6056,60056,"Independent Public Agency or Authority of Transit Service","Full Reporter",5121892,1069,"LR","DO",104,109,null,204,null,313,null,9909091,null,9829532,null,5414582,null,5371805,null,"No"]
["Dallas Area Rapid Transit","Dallas","TX",6056,60056,"Independent Public Agency or Authority of Transit Service","Full Reporter",5121892,1069,"CR","PT",23,6,null,0,null,6,null,1379076,null,1164706,null,488476,null,414838,null,"No"]
["Dallas Area Rapid Transit","Dallas","TX",6056,60056,"Independent Public Agency or Authority of Transit Service","Full Reporter",5121892,1069,"SR","DO",2,10,null,21,null,31,null,37517,null,36779,null,37517,null,36779,null,"No"]
["Northeast Illinois Regional Commuter Railroad Corporation dba: Metra Rail","Chicago","IL",5118,50118,"Independent Public Agency or Authority of Transit Service","Full Reporter",8608208,1061,"CR","DO",1061,105,null,0,null,105,null,45591649,null,43521315,null,7234375,null,6907344,null,"No"]
["MTA Long Island Rail Road","Jamaica","NY",2100,20100,"Subsidiary Unit of a Transit Agency, Reporting Separately","Full Reporter",18351295,1020,"CR","DO",1020,95,null,37,null,132,null,76296737,null,66763465,null,8774670,null,7703687,null,"No"]
["Metropolitan Atlanta Rapid Transit Authority","Atlanta","GA",4022,40022,"Independent Public Agency or Authority of Transit Service","Full Reporter",4515419,1011,"MB","DO",465,4460,null,1620,null,6080,null,28746563,null,25181058,null,0,null,0,null,"No"]
["Metropolitan Atlanta Rapid Transit Authority","Atlanta","GA",4022,40022,"Independent Public Agency or Authority of Transit Service","Full Reporter",4515419,1011,"HR","DO",208,791,null,241,null,1032,null,23180779,null,22267826,null,4042474,null,3935007,null,"No"]
["Metropolitan Atlanta Rapid Transit Authority","Atlanta","GA",4022,40022,"Independent Public Agency or Authority of Transit Service","Full Reporter",4515419,1011,"DR","DO",169,345,null,108,null,453,null,7402223,null,5985844,null,0,null,0,null,"No"]
["Metropolitan Atlanta Rapid Transit Authority","Atlanta","GA",4022,40022,"Independent Public Agency or Authority of Transit Service","Full Reporter",4515419,1011,"DR","PT",169,78,null,31,null,109,null,880294,null,701178,null,0,null,0,null,"No"]
["San Francisco Municipal Railway","San Francisco","CA",9015,90015,"City, County or Local Government Unit or Department of Transportation","Full Reporter",3281212,985,"MB","DO",475,2053,null,154,null,2207,null,15381690,null,13497051,null,0,null,0,null,"No"]
["San Francisco Municipal Railway","San Francisco","CA",9015,90015,"City, County or Local Government Unit or Department of Transportation","Full Reporter",3281212,985,"TB","DO",196,1572,null,259,null,1831,null,6495233,null,6204992,null,0,null,0,null,"No"]
["San Francisco Municipal Railway","San Francisco","CA",9015,90015,"City, County or Local Government Unit or Department of Transportation","Full Reporter",3281212,985,"DR","PT",132,52,null,41,null,93,null,2124961,null,1745564,null,0,null,0,null,"No"]
["San Francisco Municipal Railway","San Francisco","CA",9015,90015,"City, County or Local Government Unit or Department of Transportation","Full Reporter",3281212,985,"LR","DO",131,951,null,4237,null,5188,null,5177636,null,5170134,null,3442553,null,3437565,null,"No"]
["San Francisco Municipal Railway","San Francisco","CA",9015,90015,"City, County or Local Government Unit or Department of Transportation","Full Reporter",3281212,985,"CC","DO",27,57,null,1977,null,2034,null,264929,null,258452,null,264929,null,258452,null,"No"]
["San Francisco Municipal Railway","San Francisco","CA",9015,90015,"City, County or Local Government Unit or Department of Transportation","Full Reporter",3281212,985,"SR","DO",24,263,null,1167,null,1430,null,521939,null,521024,null,521939,null,521024,null,"No"]
["Tri-County Metropolitan Transportation District of Oregon","Portland","OR",8,8,"Independent Public Agency or Authority of Transit Service","Full Reporter",1849898,950,"MB","DO",534,1129,null,4379,null,5508,null,24264302,null,20698766,null,0,null,0,null,"No"]
["Tri-County Metropolitan Transportation District of Oregon","Portland","OR",8,8,"Independent Public Agency or Authority of Transit Service","Full Reporter",1849898,950,"DR","PT",226,209,null,1097,null,1306,null,7609090,null,6350618,null,0,null,0,null,"No"]
["Tri-County Metropolitan Transportation District of Oregon","Portland","OR",8,8,"Independent Public Agency or Authority of Transit Service","Full Reporter",1849898,950,"LR","DO",116,305,null,73,null,378,null,9004469,null,8856111,null,4502765,null,4428550,null,"No"]
["Tri-County Metropolitan Transportation District of Oregon","Portland","OR",8,8,"Independent Public Agency or Authority of Transit Service","Full Reporter",1849898,950,"YR","PT",4,3,null,0,null,3,null,165966,null,163721,null,120666,null,118982,null,"No"]
["Pace-Suburban Bus Division, ADA Paratransit Services","Arlington Heights","IL",5182,50182,"Independent Public Agency or Authority of Transit Service","Full Reporter",8608208,940,"DR","PT",919,517,null,617,null,1134,null,38912841,null,33842757,null,0,null,0,null,"No"]
["Port Authority of Allegheny County","Pittsburgh","PA",3022,30022,"Independent Public Agency or Authority of Transit Service","Full Reporter",1733853,939,"MB","DO",606,2300,null,289,null,2589,null,26718052,null,20848011,null,0,null,0,null,"No"]
["Port Authority of Allegheny County","Pittsburgh","PA",3022,30022,"Independent Public Agency or Authority of Transit Service","Full Reporter",1733853,939,"DR","PT",271,302,null,181,null,483,null,10776944,null,9517334,null,0,null,0,null,"No"]
["Port Authority of Allegheny County","Pittsburgh","PA",3022,30022,"Independent Public Agency or Authority of Transit Service","Full Reporter",1733853,939,"LR","DO",60,199,null,184,null,383,null,2252360,null,2170843,null,1556036,null,1474519,null,"No"]
["Port Authority of Allegheny County","Pittsburgh","PA",3022,30022,"Independent Public Agency or Authority of Transit Service","Full Reporter",1733853,939,"IP","DO",2,44,null,0,null,44,null,11580,null,11580,null,11580,null,11580,null,"No"]
["Metro Transit","Minneapolis","MN",5027,50027,"Subsidiary Unit of a Transit Agency, Reporting Separately","Full Reporter",2650890,843,"MB","DO",754,708,null,6150,null,6858,null,31598429,null,24591791,null,0,null,0,null,"No"]
["Metro Transit","Minneapolis","MN",5027,50027,"Subsidiary Unit of a Transit Agency, Reporting Separately","Full Reporter",2650890,843,"LR","DO",69,182,null,110,null,292,null,5318197,null,5228128,null,1926026,null,1881960,null,"No"]
["Metro Transit","Minneapolis","MN",5027,50027,"Subsidiary Unit of a Transit Agency, Reporting Separately","Full Reporter",2650890,843,"CR","PT",20,2,null,0,null,2,null,550196,null,538172,null,150858,null,146764,null,"No"]
["VIA Metropolitan Transit","San Antonio","TX",6011,60011,"Independent Public Agency or Authority of Transit Service","Full Reporter",1758210,816,"MB","DO",378,1706,null,5400,null,7106,null,24211207,null,21832408,null,0,null,0,null,"No"]
["VIA Metropolitan Transit","San Antonio","TX",6011,60011,"Independent Public Agency or Authority of Transit Service","Full Reporter",1758210,816,"VP","PT",214,3,null,8,null,11,null,4437073,null,4437073,null,0,null,0,null,"No"]
["VIA Metropolitan Transit","San Antonio","TX",6011,60011,"Independent Public Agency or Authority of Transit Service","Full Reporter",1758210,816,"DR","PT",116,125,null,239,null,364,null,7089015,null,5956836,null,0,null,0,null,"No"]
["VIA Metropolitan Transit","San Antonio","TX",6011,60011,"Independent Public Agency or Authority of Transit Service","Full Reporter",1758210,816,"DR","DO",108,424,null,81,null,505,null,5017025,null,4167328,null,0,null,0,null,"No"]
["City and County of Honolulu Department of Transportation Services","Honolulu","HI",9002,90002,"City, County or Local Government Unit or Department of Transportation","Full Reporter",802459,812,"MB","PT",455,2017,null,4844,null,6861,null,21545265,null,17889049,null,0,null,0,null,"No"]
["City and County of Honolulu Department of Transportation Services","Honolulu","HI",9002,90002,"City, County or Local Government Unit or Department of Transportation","Full Reporter",802459,812,"DR","PT",215,665,null,836,null,1501,null,8370524,null,6848351,null,0,null,0,null,{"$f":"IF(OR(Z130=\"Q\",X130=\"Q\",V130=\"Q\",T130=\"Q\",R130=\"Q\",P130=\"Q\",N130=\"Q\"),\"Yes\",\"No\")","v":"No"}]
["San Diego Metropolitan Transit System","San Diego","CA",9026,90026,"Independent Public Agency or Authority of Transit Service","Full Reporter",2956746,765,"MB","PT",261,1611,null,558,null,2169,null,11541073,null,9984379,null,0,null,0,null,"No"]
["San Diego Metropolitan Transit System","San Diego","CA",9026,90026,"Independent Public Agency or Authority of Transit Service","Full Reporter",2956746,765,"MB","DO",224,1067,null,130,null,1197,null,11326789,null,9702131,null,0,null,0,null,"No"]
["San Diego Metropolitan Transit System","San Diego","CA",9026,90026,"Independent Public Agency or Authority of Transit Service","Full Reporter",2956746,765,"DR","PT",166,111,null,10,null,121,null,6110848,null,4634471,null,0,null,0,null,"No"]
["San Diego Metropolitan Transit System","San Diego","CA",9026,90026,"Independent Public Agency or Authority of Transit Service","Full Reporter",2956746,765,"LR","DO",97,466,null,914,null,1380,null,8786704,null,8673789,null,3140172,null,3100019,null,"No"]
["San Diego Metropolitan Transit System","San Diego","CA",9026,90026,"Independent Public Agency or Authority of Transit Service","Full Reporter",2956746,765,"CB","PT",17,69,null,9,null,78,null,827128,null,350017,null,0,null,0,null,"No"]
["Capital Metropolitan Transportation Authority","Austin","TX",6048,60048,"Independent Public Agency or Authority of Transit Service","Full Reporter",1362416,732,"MB","PT",304,4078,null,921,null,4999,null,16057959,null,14475601,null,0,null,0,null,"No"]
["Capital Metropolitan Transportation Authority","Austin","TX",6048,60048,"Independent Public Agency or Authority of Transit Service","Full Reporter",1362416,732,"VP","PT",217,0,null,0,null,0,null,3109432,null,3109432,null,0,null,0,null,"No"]
["Capital Metropolitan Transportation Authority","Austin","TX",6048,60048,"Independent Public Agency or Authority of Transit Service","Full Reporter",1362416,732,"DR","PT",153,285,null,202,null,487,null,6057261,null,5028095,null,0,null,0,null,"No"]
["Capital Metropolitan Transportation Authority","Austin","TX",6048,60048,"Independent Public Agency or Authority of Transit Service","Full Reporter",1362416,732,"CB","PT",35,99,null,11,null,110,null,1119408,null,736798,null,0,null,0,null,"No"]
["Capital Metropolitan Transportation Authority","Austin","TX",6048,60048,"Independent Public Agency or Authority of Transit Service","Full Reporter",1362416,732,"YR","PT",4,3,null,0,null,3,null,336640,null,298379,null,336640,null,298379,null,"No"]
["San Diego Association of Governments","San Diego","CA",9095,90095,"MPO, COG or Other Planning Agency","Full Reporter",2956746,727,"VP","PT",727,8,null,42,null,50,null,18312233,null,18312233,null,0,null,0,null,"No"]
["Alameda-Contra Costa Transit District","Oakland","CA",9014,90014,"Independent Public Agency or Authority of Transit Service","Full Reporter",3281212,702,"MB","DO",381,2220,null,1555,null,3775,null,19801978,null,17683122,null,0,null,0,null,"No"]
["Alameda-Contra Costa Transit District","Oakland","CA",9014,90014,"Independent Public Agency or Authority of Transit Service","Full Reporter",3281212,702,"DR","PT",203,270,null,160,null,430,null,7988607,null,6579621,null,0,null,0,null,"No"]
["Alameda-Contra Costa Transit District","Oakland","CA",9014,90014,"Independent Public Agency or Authority of Transit Service","Full Reporter",3281212,702,"CB","DO",104,184,null,72,null,256,null,2980078,null,1650329,null,0,null,0,null,"No"]
["Alameda-Contra Costa Transit District","Oakland","CA",9014,90014,"Independent Public Agency or Authority of Transit Service","Full Reporter",3281212,702,"MB","PT",14,3,null,11,null,14,null,508271,null,422859,null,0,null,0,null,"No"]
["Santa Clara Valley Transportation Authority","San Jose","CA",9013,90013,"Independent Public Agency or Authority of Transit Service","Full Reporter",1664496,686,"MB","DO",392,1897,null,300,null,2197,null,18556393,null,15518418,null,0,null,0,null,"No"]
["Santa Clara Valley Transportation Authority","San Jose","CA",9013,90013,"Independent Public Agency or Authority of Transit Service","Full Reporter",1664496,686,"DR","PT",224,2,null,22,null,24,null,5522211,null,4929806,null,0,null,0,null,"No"]
["Santa Clara Valley Transportation Authority","San Jose","CA",9013,90013,"Independent Public Agency or Authority of Transit Service","Full Reporter",1664496,686,"LR","DO",59,95,null,0,null,95,null,3749154,null,3470427,null,2234496,null,2077964,null,"No"]
["Santa Clara Valley Transportation Authority","San Jose","CA",9013,90013,"Independent Public Agency or Authority of Transit Service","Full Reporter",1664496,686,"MB","PT",11,2,null,2,null,4,null,234975,null,193614,null,0,null,0,null,"No"]
["Regional Transportation Commission of Southern Nevada","Las Vegas","NV",9045,90045,"Independent Public Agency or Authority of Transit Service","Full Reporter",1886011,612,"MB","PT",318,1144,null,473,null,1617,null,17422729,null,15880990,null,0,null,0,null,"No"]
["Regional Transportation Commission of Southern Nevada","Las Vegas","NV",9045,90045,"Independent Public Agency or Authority of Transit Service","Full Reporter",1886011,612,"DR","PT",271,252,null,50,null,302,null,11475294,null,9982177,null,0,null,0,null,"No"]
["Regional Transportation Commission of Southern Nevada","Las Vegas","NV",9045,90045,"Independent Public Agency or Authority of Transit Service","Full Reporter",1886011,612,"RB","PT",23,53,null,28,null,81,null,1325851,null,1062129,null,0,null,0,null,"No"]
["Snohomish County Public Transportation Benefit Area Corporation","Everett","WA",29,29,"Independent Public Agency or Authority of Transit Service","Full Reporter",3059393,609,"VP","DO",364,6,null,4,null,10,null,4586434,null,4586434,null,0,null,0,null,"No"]
["Snohomish County Public Transportation Benefit Area Corporation","Everett","WA",29,29,"Independent Public Agency or Authority of Transit Service","Full Reporter",3059393,609,"MB","DO",106,835,null,186,null,1021,null,6266965,null,5368515,null,0,null,0,null,"No"]
["Snohomish County Public Transportation Benefit Area Corporation","Everett","WA",29,29,"Independent Public Agency or Authority of Transit Service","Full Reporter",3059393,609,"CB","PT",54,112,null,89,null,201,null,1955909,null,921961,null,0,null,0,null,"No"]
["Snohomish County Public Transportation Benefit Area Corporation","Everett","WA",29,29,"Independent Public Agency or Authority of Transit Service","Full Reporter",3059393,609,"DR","PT",45,63,null,54,null,117,null,1703843,null,1537407,null,0,null,0,null,"No"]
["Snohomish County Public Transportation Benefit Area Corporation","Everett","WA",29,29,"Independent Public Agency or Authority of Transit Service","Full Reporter",3059393,609,"CB","DO",40,134,null,11,null,145,null,1745183,null,812772,null,0,null,0,null,"No"]
["Central Florida Regional Transportation Authority","Orlando","FL",4035,40035,"Independent Public Agency or Authority of Transit Service","Full Reporter",1510516,581,"MB","DO",250,1165,null,82,null,1247,null,16477109,null,14777315,null,0,null,0,null,"No"]
["Central Florida Regional Transportation Authority","Orlando","FL",4035,40035,"Independent Public Agency or Authority of Transit Service","Full Reporter",1510516,581,"VP","PT",157,0,null,9,null,9,null,2730252,null,2730252,null,0,null,0,null,"No"]
["Central Florida Regional Transportation Authority","Orlando","FL",4035,40035,"Independent Public Agency or Authority of Transit Service","Full Reporter",1510516,581,"DR","PT",146,81,null,221,null,302,null,8766031,null,8162222,null,0,null,0,null,"No"]
["Central Florida Regional Transportation Authority","Orlando","FL",4035,40035,"Independent Public Agency or Authority of Transit Service","Full Reporter",1510516,581,"MB","PT",13,27,null,84,null,111,null,967776,null,712609,null,0,null,0,null,"No"]
["Central Florida Regional Transportation Authority","Orlando","FL",4035,40035,"Independent Public Agency or Authority of Transit Service","Full Reporter",1510516,581,"RB","DO",13,29,null,1,null,30,null,297271,null,271570,null,0,null,0,null,"No"]
["Central Florida Regional Transportation Authority","Orlando","FL",4035,40035,"Independent Public Agency or Authority of Transit Service","Full Reporter",1510516,581,"CB","PT",2,0,null,0,null,0,null,94861,null,61580,null,0,null,0,null,"No"]
["City of Phoenix Public Transit Department dba Valley Metro","Phoenix","AZ",9032,90032,"City, County or Local Government Unit or Department of Transportation","Full Reporter",3629114,565,"MB","PT",456,1551,null,61,null,1612,null,20786877,null,16353392,null,0,null,0,null,"No"]
["City of Phoenix Public Transit Department dba Valley Metro","Phoenix","AZ",9032,90032,"City, County or Local Government Unit or Department of Transportation","Full Reporter",3629114,565,"DR","PT",109,223,null,230,null,453,null,4642647,null,3924026,null,0,null,0,null,"No"]
["California Vanpool Authority","Hanford","CA",9230,90230,"City, County or Local Government Unit or Department of Transportation","Full Reporter",87941,548,"VP","DO",548,10,null,49,null,59,null,10368958,null,10368958,null,0,null,0,null,"No"]
["San Francisco Bay Area Rapid Transit District","Oakland","CA",9003,90003,"Independent Public Agency or Authority of Transit Service","Full Reporter",3281212,545,"HR","DO",541,143,null,67,null,210,null,73194683,null,71628728,null,9448119,null,9247591,null,"No"]
["The Greater Cleveland Regional Transit Authority","Cleveland","OH",5015,50015,"Independent Public Agency or Authority of Transit Service","Full Reporter",1780673,545,"MB","DO",350,1186,null,471,null,1657,null,15464422,null,13188669,null,0,null,0,null,"No"]
["The Greater Cleveland Regional Transit Authority","Cleveland","OH",5015,50015,"Independent Public Agency or Authority of Transit Service","Full Reporter",1780673,545,"DR","PT",80,55,null,30,null,85,null,3863518,null,3054559,null,0,null,0,null,"No"]
["The Greater Cleveland Regional Transit Authority","Cleveland","OH",5015,50015,"Independent Public Agency or Authority of Transit Service","Full Reporter",1780673,545,"DR","DO",68,43,null,6,null,49,null,2793342,null,2289375,null,0,null,0,null,"No"]
["The Greater Cleveland Regional Transit Authority","Cleveland","OH",5015,50015,"Independent Public Agency or Authority of Transit Service","Full Reporter",1780673,545,"HR","DO",20,147,null,1998,null,2145,null,2669644,null,2661244,null,1340813,null,1336604,null,"No"]
["The Greater Cleveland Regional Transit Authority","Cleveland","OH",5015,50015,"Independent Public Agency or Authority of Transit Service","Full Reporter",1780673,545,"RB","DO",14,32,null,30,null,62,null,610410,null,595789,null,0,null,0,null,"No"]
["The Greater Cleveland Regional Transit Authority","Cleveland","OH",5015,50015,"Independent Public Agency or Authority of Transit Service","Full Reporter",1780673,545,"LR","DO",13,106,null,1163,null,1269,null,784746,null,776474,null,770622,null,762480,null,"No"]
["San Francisco Bay Area Rapid Transit District","Oakland","CA",9003,90003,"Independent Public Agency or Authority of Transit Service","Full Reporter",3281212,545,"MG","PT",4,4,null,2,null,6,null,416609,null,414268,null,416609,null,414268,null,"No"]
["VRide, Inc. - Michigan","Farmington Hills","MI",5193,50193,"Private Provider Reporting on Behalf of a Public Entity","Full Reporter",3734090,537,"VP","DO",537,5,null,3,null,8,null,9433909,null,9433909,null,0,null,0,null,"No"]
["Pierce County Transportation Benefit Area Authority","Tacoma","WA",3,3,"Independent Public Agency or Authority of Transit Service","Full Reporter",3059393,533,"VP","DO",324,17,null,1,null,18,null,4707552,null,4707552,null,0,null,0,null,"No"]
["Pierce County Transportation Benefit Area Authority","Tacoma","WA",3,3,"Independent Public Agency or Authority of Transit Service","Full Reporter",3059393,533,"MB","DO",118,620,null,761,null,1381,null,5404224,null,4534746,null,0,null,0,null,"No"]
["Pierce County Transportation Benefit Area Authority","Tacoma","WA",3,3,"Independent Public Agency or Authority of Transit Service","Full Reporter",3059393,533,"DR","PT",60,32,null,47,null,79,null,1868761,null,1616578,null,0,null,0,null,"No"]
["Pierce County Transportation Benefit Area Authority","Tacoma","WA",3,3,"Independent Public Agency or Authority of Transit Service","Full Reporter",3059393,533,"DR","DO",31,10,null,29,null,39,null,732612,null,648133,null,0,null,0,null,"No"]
["Potomac and Rappahannock Transportation Commission","Woodbridge","VA",3070,30070,"Independent Public Agency or Authority of Transit Service","Full Reporter",4586770,532,"VP","PT",404,0,null,0,null,0,null,8480541,null,8480541,null,0,null,0,null,"No"]
["Potomac and Rappahannock Transportation Commission","Woodbridge","VA",3070,30070,"Independent Public Agency or Authority of Transit Service","Full Reporter",4586770,532,"CB","PT",92,269,null,364,null,633,null,3243517,null,1911932,null,0,null,0,null,"No"]
["Potomac and Rappahannock Transportation Commission","Woodbridge","VA",3070,30070,"Independent Public Agency or Authority of Transit Service","Full Reporter",4586770,532,"MB","PT",36,263,null,171,null,434,null,1690777,null,1445528,null,0,null,0,null,"No"]
["Delaware Transit Corporation","Dover","DE",3075,30075,"Independent Public Agency or Authority of Transit Service","Full Reporter",5441567,481,"DR","DO",265,222,null,123,null,345,null,9894012,null,8349690,null,0,null,0,null,"No"]
["Delaware Transit Corporation","Dover","DE",3075,30075,"Independent Public Agency or Authority of Transit Service","Full Reporter",5441567,481,"MB","DO",173,730,null,388,null,1118,null,6888434,null,6352378,null,0,null,0,null,"No"]
["Delaware Transit Corporation","Dover","DE",3075,30075,"Independent Public Agency or Authority of Transit Service","Full Reporter",5441567,481,"MB","PT",31,75,null,65,null,140,null,1381669,null,1214615,null,0,null,0,null,"No"]
["Delaware Transit Corporation","Dover","DE",3075,30075,"Independent Public Agency or Authority of Transit Service","Full Reporter",5441567,481,"DR","PT",12,4,null,3,null,7,null,365189,null,296532,null,0,null,0,null,"No"]
["Bi-State Development Agency of the Missouri-Illinois Metropolitan District, d.b.a.(St. Louis) Metro","St. Louis","MO",7006,70006,"Independent Public Agency or Authority of Transit Service","Full Reporter",2150706,480,"MB","DO",321,417,null,158,null,575,null,21051875,null,18469179,null,0,null,0,null,"No"]
["Bi-State Development Agency of the Missouri-Illinois Metropolitan District, d.b.a.(St. Louis) Metro","St. Louis","MO",7006,70006,"Independent Public Agency or Authority of Transit Service","Full Reporter",2150706,480,"DR","DO",101,107,null,9,null,116,null,5700005,null,5344645,null,0,null,0,null,"No"]
["Bi-State Development Agency of the Missouri-Illinois Metropolitan District, d.b.a.(St. Louis) Metro","St. Louis","MO",7006,70006,"Independent Public Agency or Authority of Transit Service","Full Reporter",2150706,480,"LR","DO",58,296,null,78,null,374,null,6302667,null,6250140,null,3151333,null,3125069,null,"No"]
["Broward County Transit Division","Plantation","FL",4029,40029,"City, County or Local Government Unit or Department of Transportation","Full Reporter",5502379,471,"MB","DO",273,1897,null,144,null,2041,null,17724636,null,15077587,null,0,null,0,null,"No"]
["Broward County Transit Division","Plantation","FL",4029,40029,"City, County or Local Government Unit or Department of Transportation","Full Reporter",5502379,471,"DR","PT",191,83,null,5,null,88,null,9222429,null,7296787,null,0,null,0,null,"No"]
["Broward County Transit Division","Plantation","FL",4029,40029,"City, County or Local Government Unit or Department of Transportation","Full Reporter",5502379,471,"MB","PT",7,29,null,4,null,33,null,317763,null,236413,null,0,null,0,null,"No"]
["Metro Mobility","St. Paul","MN",5155,50155,"Subsidiary Unit of a Transit Agency, Reporting Separately","Full Reporter",2650890,469,"DR","PT",469,161,null,243,null,404,null,23938975,null,20222843,null,0,null,0,null,"No"]
["City of Detroit Department of Transportation","Detroit","MI",5119,50119,"City, County or Local Government Unit or Department of Transportation","Full Reporter",3734090,456,"MB","DO",230,2182,null,1100,null,3282,null,12058959,null,10312124,null,0,null,0,null,{"$f":"IF(OR(Z194=\"Q\",X194=\"Q\",V194=\"Q\",T194=\"Q\",R194=\"Q\",P194=\"Q\",N194=\"Q\"),\"Yes\",\"No\")","v":"No"}]
["City of Detroit Department of Transportation","Detroit","MI",5119,50119,"City, County or Local Government Unit or Department of Transportation","Full Reporter",3734090,456,"DR","PT",3,0,null,0,null,0,null,83465,null,65585,null,0,null,0,null,"No"]
["Ben Franklin Transit","Richland","WA",18,18,"Independent Public Agency or Authority of Transit Service","Full Reporter",210975,431,"VP","DO",261,5,null,1,null,6,null,3516347,null,3516347,null,0,null,0,null,"No"]
["Ben Franklin Transit","Richland","WA",18,18,"Independent Public Agency or Authority of Transit Service","Full Reporter",210975,431,"DR","DO",70,197,null,54,null,251,null,2151824,null,1849758,null,0,null,0,null,"No"]
["Ben Franklin Transit","Richland","WA",18,18,"Independent Public Agency or Authority of Transit Service","Full Reporter",210975,431,"MB","DO",46,87,null,87,null,174,null,2344817,null,2161030,null,0,null,0,null,"No"]
["Ben Franklin Transit","Richland","WA",18,18,"Independent Public Agency or Authority of Transit Service","Full Reporter",210975,431,"DR","PT",33,5,null,1,null,6,null,271794,null,213755,null,0,null,0,null,"No"]
["Board of County Commissioners, Palm Beach County, PalmTran, Inc.","West Palm Beach","FL",4037,40037,"City, County or Local Government Unit or Department of Transportation","Full Reporter",5502379,424,"DR","PT",294,785,null,493,null,1278,null,11261827,null,9554335,null,0,null,0,null,"No"]
["Board of County Commissioners, Palm Beach County, PalmTran, Inc.","West Palm Beach","FL",4037,40037,"City, County or Local Government Unit or Department of Transportation","Full Reporter",5502379,424,"MB","DO",130,1836,null,351,null,2187,null,8002058,null,7230007,null,0,null,0,null,"No"]
["Milwaukee County Transit System","Milwaukee","WI",5008,50008,"City, County or Local Government Unit or Department of Transportation","Full Reporter",1376476,421,"MB","DO",337,433,null,449,null,882,null,18091819,null,16595750,null,0,null,0,null,"No"]
["Charlotte Area Transit System","Charlotte","NC",4008,40008,"City, County or Local Government Unit or Department of Transportation","Full Reporter",1249442,421,"MB","DO",198,540,null,1696,null,2236,null,11567926,null,10516275,null,0,null,0,null,"No"]
["Milwaukee County Transit System","Milwaukee","WI",5008,50008,"City, County or Local Government Unit or Department of Transportation","Full Reporter",1376476,421,"DR","PT",84,38,null,58,null,96,null,3119108,null,2691642,null,0,null,0,null,"No"]
["Charlotte Area Transit System","Charlotte","NC",4008,40008,"City, County or Local Government Unit or Department of Transportation","Full Reporter",1249442,421,"DR","DO",76,26,null,98,null,124,null,2795604,null,2432397,null,0,null,0,null,"No"]
["Charlotte Area Transit System","Charlotte","NC",4008,40008,"City, County or Local Government Unit or Department of Transportation","Full Reporter",1249442,421,"VP","DO",67,24,null,0,null,24,null,1438540,null,1438540,null,0,null,0,null,"No"]
["Charlotte Area Transit System","Charlotte","NC",4008,40008,"City, County or Local Government Unit or Department of Transportation","Full Reporter",1249442,421,"CB","DO",64,82,null,258,null,340,null,1761945,null,1161283,null,0,null,0,null,"No"]
["Charlotte Area Transit System","Charlotte","NC",4008,40008,"City, County or Local Government Unit or Department of Transportation","Full Reporter",1249442,421,"LR","DO",14,106,null,19,null,125,null,1025991,null,990324,null,518584,null,500378,null,"No"]
["Charlotte Area Transit System","Charlotte","NC",4008,40008,"City, County or Local Government Unit or Department of Transportation","Full Reporter",1249442,421,"SR","DO",2,174,null,21,null,195,null,59014,null,54901,null,59014,null,54901,null,"No"]
["vRide, Inc. - Valley Metro","Phoenix","AZ",9169,90169,"Private Provider Reporting on Behalf of a Public Entity","Full Reporter",3629114,397,"VP","DO",397,4,null,0,null,4,null,6805677,null,6805677,null,0,null,0,null,"No"]
["Regional Public Transportation Authority, dba: Valley Metro","Phoenix","AZ",9136,90136,"Independent Public Agency or Authority of Transit Service","Full Reporter",3629114,384,"MB","PT",273,2729,null,1223,null,3952,null,14345586,null,11932744,null,0,null,0,null,"No"]
["Central Puget Sound Regional Transit Authority","Seattle","WA",40,40,"Independent Public Agency or Authority of Transit Service","Full Reporter",3059393,371,"CB","DO",205,1028,null,809,null,1837,null,12721788,null,9396151,null,0,null,0,null,"No"]
["San Mateo County Transit District","San Carlos","CA",9009,90009,"Independent Public Agency or Authority of Transit Service","Full Reporter",3281212,371,"MB","DO",190,210,null,7,null,217,null,5749343,null,4102398,null,0,null,0,null,"No"]
["San Mateo County Transit District","San Carlos","CA",9009,90009,"Independent Public Agency or Authority of Transit Service","Full Reporter",3281212,371,"DR","PT",81,31,null,0,null,31,null,2539975,null,2182582,null,0,null,0,null,"No"]
["San Mateo County Transit District","San Carlos","CA",9009,90009,"Independent Public Agency or Authority of Transit Service","Full Reporter",3281212,371,"MB","PT",80,41,null,11,null,52,null,3795236,null,2586256,null,0,null,0,null,"No"]
["Central Puget Sound Regional Transit Authority","Seattle","WA",40,40,"Independent Public Agency or Authority of Transit Service","Full Reporter",3059393,371,"CR","PT",67,27,null,0,null,27,null,1850401,null,1794741,null,314448,null,304965,null,"No"]
["Central Puget Sound Regional Transit Authority","Seattle","WA",40,40,"Independent Public Agency or Authority of Transit Service","Full Reporter",3059393,371,"LR","DO",50,78,null,0,null,78,null,4366473,null,4114274,null,1923904,null,1810233,null,"No"]
["Central Puget Sound Regional Transit Authority","Seattle","WA",40,40,"Independent Public Agency or Authority of Transit Service","Full Reporter",3059393,371,"CB","PT",47,162,null,268,null,430,null,3479166,null,2524196,null,0,null,0,null,"No"]
["Central Puget Sound Regional Transit Authority","Seattle","WA",40,40,"Independent Public Agency or Authority of Transit Service","Full Reporter",3059393,371,"SR","DO",2,5,null,13,null,18,null,76262,null,75983,null,76262,null,75983,null,"No"]
["Transportation District Commission of Hampton Roads","Hampton","VA",3083,30083,"Independent Public Agency or Authority of Transit Service","Full Reporter",1439666,369,"MB","DO",236,1593,null,1935,null,3528,null,10627866,null,10616777,null,0,null,0,null,"No"]
["Transportation District Commission of Hampton Roads","Hampton","VA",3083,30083,"Independent Public Agency or Authority of Transit Service","Full Reporter",1439666,369,"DR","PT",98,23,null,38,null,61,null,4279533,null,3788225,null,0,null,0,null,"No"]
["Transportation District Commission of Hampton Roads","Hampton","VA",3083,30083,"Independent Public Agency or Authority of Transit Service","Full Reporter",1439666,369,"VP","PT",26,2,null,3,null,5,null,445988,null,445988,null,0,null,0,null,"No"]
["Transportation District Commission of Hampton Roads","Hampton","VA",3083,30083,"Independent Public Agency or Authority of Transit Service","Full Reporter",1439666,369,"LR","DO",6,50,null,9,null,59,null,393937,null,393524,null,393937,null,393524,null,"No"]
["Transportation District Commission of Hampton Roads","Hampton","VA",3083,30083,"Independent Public Agency or Authority of Transit Service","Full Reporter",1439666,369,"FB","PT",3,5,null,12,null,17,null,19163,null,19163,null,0,null,0,null,"No"]
["Central Ohio Transit Authority","Columbus","OH",5016,50016,"Independent Public Agency or Authority of Transit Service","Full Reporter",1368035,359,"MB","DO",295,2316,null,1565,null,3881,null,15349203,null,12298599,null,0,null,0,null,"No"]
["Central Ohio Transit Authority","Columbus","OH",5016,50016,"Independent Public Agency or Authority of Transit Service","Full Reporter",1368035,359,"DR","PT",64,43,null,3,null,46,null,3936365,null,3480344,null,0,null,0,null,"No"]
["City of Los Angeles Department of Transportation","Los Angeles","CA",9147,90147,"City, County or Local Government Unit or Department of Transportation","Full Reporter",12150996,355,"MB","PT",169,473,null,751,null,1224,null,5911498,null,5258747,null,0,null,0,null,"No"]
["City of Los Angeles Department of Transportation","Los Angeles","CA",9147,90147,"City, County or Local Government Unit or Department of Transportation","Full Reporter",12150996,355,"CB","PT",89,17,null,60,null,77,null,3517803,null,1795203,null,0,null,0,null,"No"]
["City of Los Angeles Department of Transportation","Los Angeles","CA",9147,90147,"City, County or Local Government Unit or Department of Transportation","Full Reporter",12150996,355,"DR","PT",88,1,null,44,null,45,null,1336414,null,1089072,null,0,null,0,null,"No"]
["Niagara Frontier Transportation Authority","Buffalo","NY",2004,20004,"Independent Public Agency or Authority of Transit Service","Full Reporter",935906,352,"MB","DO",267,985,null,1533,null,2518,null,10431947,null,8437553,null,0,null,0,null,"No"]
["Nassau Inter County Express","Garden City","NY",2206,20206,"City, County or Local Government Unit or Department of Transportation","Full Reporter",18351295,352,"MB","PT",255,3995,null,1602,null,5597,null,10706253,null,9232412,null,0,null,0,null,"No"]
["Nassau Inter County Express","Garden City","NY",2206,20206,"City, County or Local Government Unit or Department of Transportation","Full Reporter",18351295,352,"DR","PT",97,447,null,104,null,551,null,3292256,null,2785288,null,0,null,0,null,"No"]
["Niagara Frontier Transportation Authority","Buffalo","NY",2004,20004,"Independent Public Agency or Authority of Transit Service","Full Reporter",935906,352,"DR","DO",62,13,null,14,null,27,null,2094149,null,1664961,null,0,null,0,null,"No"]
["Niagara Frontier Transportation Authority","Buffalo","NY",2004,20004,"Independent Public Agency or Authority of Transit Service","Full Reporter",935906,352,"LR","DO",23,5,null,51,null,56,null,956828,null,947935,null,359478,null,356137,null,"No"]
["Southwest Ohio Regional Transit Authority","Cincinnati","OH",5012,50012,"City, County or Local Government Unit or Department of Transportation","Full Reporter",1624827,350,"MB","DO",299,1817,null,1788,null,3605,null,11226917,null,9622716,"Q",0,null,0,null,"Yes"]
["Southwest Ohio Regional Transit Authority","Cincinnati","OH",5012,50012,"City, County or Local Government Unit or Department of Transportation","Full Reporter",1624827,350,"DR","PT",48,50,null,94,null,144,null,1776392,null,1486637,"Q",0,null,0,null,"Yes"]
["Southwest Ohio Regional Transit Authority","Cincinnati","OH",5012,50012,"City, County or Local Government Unit or Department of Transportation","Full Reporter",1624827,350,"SR","PT",3,31,null,5,null,36,null,29467,null,29053,"Q",29467,null,29053,null,"Yes"]
["Lane Transit District","Eugene","OR",7,7,"Independent Public Agency or Authority of Transit Service","Full Reporter",247421,342,"MB","DO",73,474,null,224,null,698,null,3198851,null,2927012,null,0,null,0,null,"No"]
["Lane Transit District","Eugene","OR",7,7,"Independent Public Agency or Authority of Transit Service","Full Reporter",247421,342,"DR","PT",54,30,null,0,null,30,null,1612793,null,1462553,null,0,null,0,null,"No"]
["Lane Transit District","Eugene","OR",7,7,"Independent Public Agency or Authority of Transit Service","Full Reporter",247421,342,"VP","PT",17,2,null,0,null,2,null,439832,null,439832,null,0,null,0,null,"No"]
["Lane Transit District","Eugene","OR",7,7,"Independent Public Agency or Authority of Transit Service","Full Reporter",247421,342,"RB","DO",8,128,null,53,null,181,null,446311,null,437222,null,0,null,0,null,"No"]
["Lane Transit District","Eugene","OR",7,7,"Independent Public Agency or Authority of Transit Service","Full Reporter",247421,342,"MB","PT",1,0,null,0,null,0,null,76840,null,76554,null,0,null,0,null,"No"]
["Westchester County Bee-Line System","Mount Vernon","NY",2076,20076,"City, County or Local Government Unit or Department of Transportation","Full Reporter",18351295,340,"MB","PT",264,1915,null,1222,null,3137,null,10198778,null,7734125,null,0,null,0,null,"No"]
["Westchester County Bee-Line System","Mount Vernon","NY",2076,20076,"City, County or Local Government Unit or Department of Transportation","Full Reporter",18351295,340,"DR","PT",70,84,null,354,null,438,null,3950499,null,3299557,null,0,null,0,null,"No"]
["City of Tuscon","Tucson   ","AZ",9033,90033,"City, County or Local Government Unit or Department of Transportation","Full Reporter",843168,336,"MB","DO",207,905,null,289,null,1194,null,8490097,null,7399193,null,0,null,0,null,"No"]
["City of Tuscon","Tucson   ","AZ",9033,90033,"City, County or Local Government Unit or Department of Transportation","Full Reporter",843168,336,"DR","DO",123,27,null,10,null,37,null,4596608,null,3808090,null,0,null,0,null,"No"]
["City of Tuscon","Tucson   ","AZ",9033,90033,"City, County or Local Government Unit or Department of Transportation","Full Reporter",843168,336,"SR","DO",6,26,null,15,null,41,null,196788,null,193860,null,196788,null,193860,null,"No"]
["Cape Cod Regional Transit Authority","Hyannis","MA",1105,10105,"Independent Public Agency or Authority of Transit Service","Full Reporter",246695,335,"DR","PT",198,66,null,37,null,103,null,4593984,null,3998245,null,0,null,0,null,"No"]
["Cape Cod Regional Transit Authority","Hyannis","MA",1105,10105,"Independent Public Agency or Authority of Transit Service","Full Reporter",246695,335,"MB","PT",47,86,null,111,null,197,null,1565942,null,1227173,null,0,null,0,null,"No"]
["Cape Cod Regional Transit Authority","Hyannis","MA",1105,10105,"Independent Public Agency or Authority of Transit Service","Full Reporter",246695,335,"CB","PT",2,0,null,2,null,2,null,136759,null,126704,null,0,null,0,null,"No"]
["Greater Richmond Transit Company","Richmond","VA",3006,30006,"Other Publicly-Owned or Privately Chartered Corporation","Full Reporter",953556,330,"VP","PT",149,2,null,9,null,11,null,4911690,null,4911690,null,0,null,0,null,"No"]
["Greater Richmond Transit Company","Richmond","VA",3006,30006,"Other Publicly-Owned or Privately Chartered Corporation","Full Reporter",953556,330,"MB","DO",121,767,null,94,null,861,null,4603058,null,4287421,null,0,null,0,null,"No"]
["Greater Richmond Transit Company","Richmond","VA",3006,30006,"Other Publicly-Owned or Privately Chartered Corporation","Full Reporter",953556,330,"DR","PT",60,233,null,41,null,274,null,3159702,null,2709852,null,0,null,0,null,"No"]
["Foothill Transit","West Covina","CA",9146,90146,"Independent Public Agency or Authority of Transit Service","Full Reporter",12150996,318,"MB","PT",318,928,null,1270,null,2198,null,15991196,null,11594864,null,0,null,0,null,"No"]
["Suburban Mobility Authority for Regional Transportation","Detroit","MI",5031,50031,"Independent Public Agency or Authority of Transit Service","Full Reporter",3734090,317,"MB","DO",195,786,null,1050,null,1836,null,10854734,null,8527910,null,0,null,0,null,"No"]
["Suburban Mobility Authority for Regional Transportation","Detroit","MI",5031,50031,"Independent Public Agency or Authority of Transit Service","Full Reporter",3734090,317,"DR","DO",84,74,null,121,null,195,null,3414649,null,2884049,null,0,null,0,null,"No"]
["Suburban Mobility Authority for Regional Transportation","Detroit","MI",5031,50031,"Independent Public Agency or Authority of Transit Service","Full Reporter",3734090,317,"DR","PT",30,77,null,178,null,255,null,804958,null,744040,null,0,null,0,null,"No"]
["Suburban Mobility Authority for Regional Transportation","Detroit","MI",5031,50031,"Independent Public Agency or Authority of Transit Service","Full Reporter",3734090,317,"MB","PT",8,7,null,15,null,22,null,278265,null,260496,null,0,null,0,null,{"$f":"IF(OR(Z258=\"Q\",X258=\"Q\",V258=\"Q\",T258=\"Q\",R258=\"Q\",P258=\"Q\",N258=\"Q\"),\"Yes\",\"No\")","v":"No"}]
["Transit Authority of River City","Louisville","KY",4018,40018,"Independent Public Agency or Authority of Transit Service","Full Reporter",972546,316,"MB","DO",172,1267,null,2412,null,3679,null,7836183,null,6958255,null,0,null,0,null,"No"]
["Transit Authority of River City","Louisville","KY",4018,40018,"Independent Public Agency or Authority of Transit Service","Full Reporter",972546,316,"DR","PT",91,9,null,144,null,153,null,3913692,null,3463045,null,0,null,0,null,"No"]
["Transit Authority of River City","Louisville","KY",4018,40018,"Independent Public Agency or Authority of Transit Service","Full Reporter",972546,316,"DR","DO",2,95,null,182,null,277,null,17930,null,11920,null,0,null,0,null,"No"]
["Transit Authority of River City","Louisville","KY",4018,40018,"Independent Public Agency or Authority of Transit Service","Full Reporter",972546,316,"MB","PT",1,0,null,3,null,3,null,35453,null,20865,null,0,null,0,null,"No"]
["Spokane Transit Authority","Spokane","WA",2,2,"Independent Public Agency or Authority of Transit Service","Full Reporter",387847,307,"MB","DO",111,707,null,145,null,852,null,5951216,null,5477713,null,0,null,0,null,"No"]
["Spokane Transit Authority","Spokane","WA",2,2,"Independent Public Agency or Authority of Transit Service","Full Reporter",387847,307,"VP","DO",97,2,null,3,null,5,null,1058496,null,1058496,null,0,null,0,null,"No"]
["Spokane Transit Authority","Spokane","WA",2,2,"Independent Public Agency or Authority of Transit Service","Full Reporter",387847,307,"DR","DO",52,13,null,6,null,19,null,1244328,null,1138893,null,0,null,0,null,"No"]
["Spokane Transit Authority","Spokane","WA",2,2,"Independent Public Agency or Authority of Transit Service","Full Reporter",387847,307,"DR","PT",47,274,null,595,null,869,null,1613891,null,1376561,null,0,null,0,null,"No"]
["Port Authority Trans-Hudson Corporation","Jersey City","NJ",2098,20098,"Independent Public Agency or Authority of Transit Service","Full Reporter",18351295,303,"HR","DO",298,187,null,59,null,246,null,13618326,"W",12865445,null,1822305,"W",1724288,null,"No"]
["Port Authority Trans-Hudson Corporation","Jersey City","NJ",2098,20098,"Independent Public Agency or Authority of Transit Service","Full Reporter",18351295,303,"FB","PT",5,0,null,0,null,0,null,124592,null,124592,null,0,null,0,null,"No"]
["Suffolk County Department of Public Works - Transportation Division","Yaphank","NY",2072,20072,"City, County or Local Government Unit or Department of Transportation","Full Reporter",18351295,300,"DR","PT",172,130,null,83,null,213,null,9945161,null,8232607,null,0,null,0,null,"No"]
["Suffolk County Department of Public Works - Transportation Division","Yaphank","NY",2072,20072,"City, County or Local Government Unit or Department of Transportation","Full Reporter",18351295,300,"MB","PT",128,507,null,501,null,1008,null,8377178,null,7610499,null,0,null,0,null,"No"]
["Kansas City Area Transportation Authority","Kansas City","MO",7005,70005,"Independent Public Agency or Authority of Transit Service","Full Reporter",1519417,298,"MB","DO",168,557,null,114,null,671,null,8664104,null,7625430,null,0,null,0,null,"No"]
["Capital Area Transit","Raleigh","NC",4007,40007,"City, County or Local Government Unit or Department of Transportation","Full Reporter",884891,298,"MB","DO",65,509,null,76,null,585,null,3469730,null,3012457,null,0,null,0,null,"No"]
["Kansas City Area Transportation Authority","Kansas City","MO",7005,70005,"Independent Public Agency or Authority of Transit Service","Full Reporter",1519417,298,"DR","PT",62,35,null,15,null,50,null,2797772,null,2436028,null,0,null,0,null,"No"]
["Kansas City Area Transportation Authority","Kansas City","MO",7005,70005,"Independent Public Agency or Authority of Transit Service","Full Reporter",1519417,298,"VP","DO",23,5,null,0,null,5,null,349797,null,349797,null,0,null,0,null,"No"]
["Kansas City Area Transportation Authority","Kansas City","MO",7005,70005,"Independent Public Agency or Authority of Transit Service","Full Reporter",1519417,298,"DR","DO",19,16,null,1,null,17,null,512370,null,327208,null,0,null,0,null,"No"]
["Kansas City Area Transportation Authority","Kansas City","MO",7005,70005,"Independent Public Agency or Authority of Transit Service","Full Reporter",1519417,298,"RB","DO",11,50,null,12,null,62,null,559536,null,518198,null,0,null,0,null,"No"]
["Pinellas Suncoast Transit Authority","St. Petersburg","FL",4027,40027,"Independent Public Agency or Authority of Transit Service","Full Reporter",2441770,295,"MB","DO",157,509,null,241,null,750,null,9792460,null,8560858,null,0,null,0,null,"No"]
["Pinellas Suncoast Transit Authority","St. Petersburg","FL",4027,40027,"Independent Public Agency or Authority of Transit Service","Full Reporter",2441770,295,"DR","PT",71,31,null,27,null,58,null,2229666,null,1786727,null,0,null,0,null,"No"]
["Pinellas Suncoast Transit Authority","St. Petersburg","FL",4027,40027,"Independent Public Agency or Authority of Transit Service","Full Reporter",2441770,295,"MB","PT",10,16,null,124,null,140,null,293705,null,281317,null,0,null,0,null,"No"]
["Pinellas Suncoast Transit Authority","St. Petersburg","FL",4027,40027,"Independent Public Agency or Authority of Transit Service","Full Reporter",2441770,295,"CB","DO",7,15,null,2,null,17,null,260187,null,221838,null,0,null,0,null,"No"]
["Rhode Island Public Transit Authority","Providence","RI",1001,10001,"Independent Public Agency or Authority of Transit Service","Full Reporter",1190956,291,"MB","DO",195,695,null,1336,null,2031,null,10052895,null,8546906,null,0,null,0,null,"No"]
["Rhode Island Public Transit Authority","Providence","RI",1001,10001,"Independent Public Agency or Authority of Transit Service","Full Reporter",1190956,291,"DR","DO",79,77,null,69,null,146,null,2880003,null,2381026,null,0,null,0,null,"No"]
["Rhode Island Public Transit Authority","Providence","RI",1001,10001,"Independent Public Agency or Authority of Transit Service","Full Reporter",1190956,291,"DR","PT",9,2,null,7,null,9,null,119141,null,101576,null,0,null,0,null,"No"]
["Intercity Transit","Olympia","WA",19,19,"Independent Public Agency or Authority of Transit Service","Full Reporter",176617,286,"VP","DO",189,17,null,2,null,19,null,3075894,null,3075894,null,0,null,0,null,"No"]
["Intercity Transit","Olympia","WA",19,19,"Independent Public Agency or Authority of Transit Service","Full Reporter",176617,286,"MB","DO",50,77,null,18,null,95,null,2476511,null,2341325,null,0,null,0,null,"No"]
["Intercity Transit","Olympia","WA",19,19,"Independent Public Agency or Authority of Transit Service","Full Reporter",176617,286,"DR","DO",38,18,null,6,null,24,null,1057514,null,956980,null,0,null,0,null,"No"]
["Intercity Transit","Olympia","WA",19,19,"Independent Public Agency or Authority of Transit Service","Full Reporter",176617,286,"CB","DO",9,46,null,10,null,56,null,592163,null,543378,null,0,null,0,null,"No"]
["Ride-On Montgomery County Transit","Rockville","MD",3051,30051,"City, County or Local Government Unit or Department of Transportation","Full Reporter",4586770,282,"MB","DO",282,495,null,2888,null,3383,null,15130048,null,12824445,null,0,null,0,null,"No"]
["vRide, Inc. - Atlanta","Atlanta","GA",4153,40153,"Private Provider Reporting on Behalf of a Public Entity","Full Reporter",4515419,279,"VP","DO",279,2,null,0,null,2,null,4526204,null,4526204,null,0,null,0,null,"No"]
["Capital District Transportation Authority","Albany","NY",2002,20002,"Independent Public Agency or Authority of Transit Service","Full Reporter",594962,277,"MB","DO",201,357,null,1234,null,1591,null,8652409,null,7574381,null,0,null,0,null,"No"]
["Capital District Transportation Authority","Albany","NY",2002,20002,"Independent Public Agency or Authority of Transit Service","Full Reporter",594962,277,"DR","DO",28,24,null,136,null,160,null,1309388,null,1193268,null,0,null,0,null,"No"]
["Capital District Transportation Authority","Albany","NY",2002,20002,"Independent Public Agency or Authority of Transit Service","Full Reporter",594962,277,"VP","PT",10,0,null,0,null,0,null,130386,null,130386,null,0,null,0,null,"No"]
["Capital District Transportation Authority","Albany","NY",2002,20002,"Independent Public Agency or Authority of Transit Service","Full Reporter",594962,277,"CB","PT",10,1,null,2,null,3,null,529718,null,293296,null,0,null,0,null,"No"]
["Salem Area Mass Transit District","Salem","OR",25,25,"Independent Public Agency or Authority of Transit Service","Full Reporter",236632,276,"DR","PT",195,29,null,2,null,31,null,5624117,null,5108673,"W",0,null,0,null,"No"]
["Victor Valley Transit Authority","Hesperia","CA",9148,90148,"Independent Public Agency or Authority of Transit Service","Full Reporter",328454,276,"VP","PT",186,0,null,3,null,3,null,4544965,null,4544965,null,0,null,0,null,"No"]
["Salem Area Mass Transit District","Salem","OR",25,25,"Independent Public Agency or Authority of Transit Service","Full Reporter",236632,276,"MB","DO",53,214,null,131,null,345,null,2316592,null,2173882,null,0,null,0,null,"No"]
["Victor Valley Transit Authority","Hesperia","CA",9148,90148,"Independent Public Agency or Authority of Transit Service","Full Reporter",328454,276,"MB","PT",45,173,null,286,null,459,null,3053586,null,2756026,null,0,null,0,null,"No"]
["Victor Valley Transit Authority","Hesperia","CA",9148,90148,"Independent Public Agency or Authority of Transit Service","Full Reporter",328454,276,"DR","PT",38,17,null,13,null,30,null,1216630,null,1006913,null,0,null,0,null,"No"]
["Salem Area Mass Transit District","Salem","OR",25,25,"Independent Public Agency or Authority of Transit Service","Full Reporter",236632,276,"VP","PT",28,0,null,0,null,0,null,566917,null,566917,null,0,null,0,null,"No"]
["Victor Valley Transit Authority","Hesperia","CA",9148,90148,"Independent Public Agency or Authority of Transit Service","Full Reporter",328454,276,"CB","PT",7,8,null,6,null,14,null,362581,null,266958,null,0,null,0,null,"No"]
["Riverside Transit Agency","Riverside","CA",9031,90031,"Independent Public Agency or Authority of Transit Service","Full Reporter",1932666,274,"DR","PT",95,118,null,48,null,166,null,3934817,null,3157621,null,0,null,0,null,"No"]
["Riverside Transit Agency","Riverside","CA",9031,90031,"Independent Public Agency or Authority of Transit Service","Full Reporter",1932666,274,"MB","DO",82,179,null,22,null,201,null,5780152,null,5123311,null,0,null,0,null,"No"]
["Riverside Transit Agency","Riverside","CA",9031,90031,"Independent Public Agency or Authority of Transit Service","Full Reporter",1932666,274,"MB","PT",51,379,null,344,null,723,null,3287519,null,2499315,null,0,null,0,null,"No"]
["Riverside Transit Agency","Riverside","CA",9031,90031,"Independent Public Agency or Authority of Transit Service","Full Reporter",1932666,274,"CB","PT",16,41,null,20,null,61,null,1036638,null,686814,null,0,null,0,null,"No"]
["Riverside Transit Agency","Riverside","CA",9031,90031,"Independent Public Agency or Authority of Transit Service","Full Reporter",1932666,274,"CB","DO",15,21,null,1,null,22,null,843199,null,620897,null,0,null,0,null,"No"]
["Omnitrans","San Bernardino","CA",9029,90029,"Independent Public Agency or Authority of Transit Service","Full Reporter",1932666,266,"MB","DO",162,512,null,518,null,1030,null,9011683,null,8357734,null,0,null,0,null,"No"]
["Omnitrans","San Bernardino","CA",9029,90029,"Independent Public Agency or Authority of Transit Service","Full Reporter",1932666,266,"DR","PT",97,110,null,63,null,173,null,3289625,null,2586992,null,0,null,0,null,"No"]
["Omnitrans","San Bernardino","CA",9029,90029,"Independent Public Agency or Authority of Transit Service","Full Reporter",1932666,266,"MB","PT",7,4,null,21,null,25,null,439887,null,375556,null,0,null,0,null,"No"]
["Pioneer Valley Transit Authority","Springfield","MA",1008,10008,"Independent Public Agency or Authority of Transit Service","Full Reporter",621300,264,"MB","PT",154,900,null,2517,null,3417,null,5494234,null,5213063,null,0,null,0,null,"No"]
["Pioneer Valley Transit Authority","Springfield","MA",1008,10008,"Independent Public Agency or Authority of Transit Service","Full Reporter",621300,264,"DR","PT",110,16,null,31,null,47,null,3708664,null,3112275,null,0,null,0,null,"No"]
["Toledo Area Regional Transit Authority","Toledo","OH",5022,50022,"Independent Public Agency or Authority of Transit Service","Full Reporter",507643,261,"MB","DO",109,120,null,1371,null,1491,null,3757456,null,3364305,"Q",0,null,0,null,"Yes"]
["Toledo Area Regional Transit Authority","Toledo","OH",5022,50022,"Independent Public Agency or Authority of Transit Service","Full Reporter",507643,261,"DR","PT",92,0,null,0,null,0,null,376627,null,334069,"Q",0,null,0,null,"Yes"]
["Toledo Area Regional Transit Authority","Toledo","OH",5022,50022,"Independent Public Agency or Authority of Transit Service","Full Reporter",507643,261,"DR","DO",60,20,null,210,null,230,null,2208724,null,1936731,"Q",0,null,0,null,"Yes"]
["Metropolitan Transit Authority","Nashville","TN",4004,40004,"Independent Public Agency or Authority of Transit Service","Full Reporter",969587,260,"MB","DO",124,875,null,364,null,1239,null,6163383,null,5524292,null,0,null,0,null,"No"]
["Metropolitan Transit Authority","Nashville","TN",4004,40004,"Independent Public Agency or Authority of Transit Service","Full Reporter",969587,260,"DR","DO",63,54,null,45,null,99,null,2713802,null,2224974,null,0,null,0,null,"No"]
["Metropolitan Transit Authority","Nashville","TN",4004,40004,"Independent Public Agency or Authority of Transit Service","Full Reporter",969587,260,"CB","DO",23,33,null,13,null,46,null,596412,null,415431,null,0,null,0,null,"No"]
["RTS - Monroe County","Rochester","NY",2113,20113,"Independent Public Agency or Authority of Transit Service","Full Reporter",720572,257,"MB","DO",213,343,null,86,null,429,null,5844368,null,5069133,null,0,null,0,null,"No"]
["Kitsap Transit","Bremerton","WA",20,20,"Independent Public Agency or Authority of Transit Service","Full Reporter",198979,257,"MB","DO",90,80,null,14,null,94,null,2523873,null,2059850,null,0,null,0,null,"No"]
["Kitsap Transit","Bremerton","WA",20,20,"Independent Public Agency or Authority of Transit Service","Full Reporter",198979,257,"DR","DO",85,10,null,6,null,16,null,1405008,null,1276540,null,0,null,0,null,"No"]
["Kitsap Transit","Bremerton","WA",20,20,"Independent Public Agency or Authority of Transit Service","Full Reporter",198979,257,"VP","DO",78,2,null,4,null,6,null,816444,null,816444,null,0,null,0,null,"No"]
["RTS - Monroe County","Rochester","NY",2113,20113,"Independent Public Agency or Authority of Transit Service","Full Reporter",720572,257,"DR","DO",44,127,null,31,null,158,null,1924076,null,1547149,null,0,null,0,null,"No"]
["Kitsap Transit","Bremerton","WA",20,20,"Independent Public Agency or Authority of Transit Service","Full Reporter",198979,257,"FB","PT",2,4,null,2,null,6,null,46426,null,45025,null,0,null,0,null,{"$f":"IF(OR(Z322=\"Q\",X322=\"Q\",V322=\"Q\",T322=\"Q\",R322=\"Q\",P322=\"Q\",N322=\"Q\"),\"Yes\",\"No\")","v":"No"}]
["Miami Lakes - vRide, Inc.","Miami Lakes","FL",4152,40152,"Private Provider Reporting on Behalf of a Public Entity","Full Reporter",5502379,254,"VP","DO",254,0,null,0,null,0,null,3928217,null,3928217,null,0,null,0,null,"No"]
["Metro Transit System","Madison","WI",5005,50005,"City, County or Local Government Unit or Department of Transportation","Full Reporter",401661,254,"MB","DO",182,414,null,266,null,680,null,5889642,null,5050916,"Q",0,null,0,null,"Yes"]
["Metro Transit System","Madison","WI",5005,50005,"City, County or Local Government Unit or Department of Transportation","Full Reporter",401661,254,"DR","PT",60,2,null,12,null,14,null,1567129,null,1383775,"Q",0,null,0,null,"Yes"]
["Metro Transit System","Madison","WI",5005,50005,"City, County or Local Government Unit or Department of Transportation","Full Reporter",401661,254,"DR","DO",12,13,null,2,null,15,null,372340,null,317764,"Q",0,null,0,null,"Yes"]
["Jacksonville Transportation Authority","Jacksonville","FL",4040,40040,"Independent Public Agency or Authority of Transit Service","Full Reporter",1065219,244,"MB","DO",150,90,null,699,null,789,null,9633030,null,8712949,null,0,null,0,null,"No"]
["Jacksonville Transportation Authority","Jacksonville","FL",4040,40040,"Independent Public Agency or Authority of Transit Service","Full Reporter",1065219,244,"DR","PT",88,11,null,269,null,280,null,4651570,null,4097045,null,0,null,0,null,"No"]
["Jacksonville Transportation Authority","Jacksonville","FL",4040,40040,"Independent Public Agency or Authority of Transit Service","Full Reporter",1065219,244,"MG","DO",5,5,null,5,null,10,null,166543,null,165218,null,166543,null,165218,null,"No"]
["Jacksonville Transportation Authority","Jacksonville","FL",4040,40040,"Independent Public Agency or Authority of Transit Service","Full Reporter",1065219,244,"FB","PT",1,0,null,0,null,0,null,4334,null,4334,null,0,null,0,null,"No"]
["Interurban Transit Partnership","Grand Rapids","MI",5033,50033,"Independent Public Agency or Authority of Transit Service","Full Reporter",569935,241,"MB","DO",125,267,null,655,null,922,null,5366914,null,5091378,null,0,null,0,null,"No"]
["Interurban Transit Partnership","Grand Rapids","MI",5033,50033,"Independent Public Agency or Authority of Transit Service","Full Reporter",569935,241,"DR","PT",81,20,null,9,null,29,null,2530558,null,2183553,null,0,null,0,null,"No"]
["Interurban Transit Partnership","Grand Rapids","MI",5033,50033,"Independent Public Agency or Authority of Transit Service","Full Reporter",569935,241,"VP","DO",27,1,null,0,null,1,null,667820,null,667820,null,0,null,0,null,"No"]
["Interurban Transit Partnership","Grand Rapids","MI",5033,50033,"Independent Public Agency or Authority of Transit Service","Full Reporter",569935,241,"RB","DO",8,3,null,14,null,17,null,398043,null,372368,null,0,null,0,null,"No"]
["Connecticut Department of Transportation - CTTRANSIT - Hartford Division","Hartford","CT",1048,10048,"State Government Unit or Department of Transportation","Full Reporter",924859,232,"MB","DO",223,373,null,5129,null,5502,null,9590052,null,8524513,null,0,null,0,null,"No"]
["Sacramento Regional Transit District","Sacramento","CA",9019,90019,"Independent Public Agency or Authority of Transit Service","Full Reporter",1723634,232,"MB","DO",162,880,null,58,null,938,null,7272140,null,6110247,null,0,null,0,null,"No"]
["Sacramento Regional Transit District","Sacramento","CA",9019,90019,"Independent Public Agency or Authority of Transit Service","Full Reporter",1723634,232,"LR","DO",68,202,null,167,null,369,null,4495564,null,4369542,null,1675625,null,1624749,null,"No"]
["Connecticut Department of Transportation - CTTRANSIT - Hartford Division","Hartford","CT",1048,10048,"State Government Unit or Department of Transportation","Full Reporter",924859,232,"RB","DO",9,33,null,463,null,496,null,750884,null,706225,null,0,null,0,null,"No"]
["Sacramento Regional Transit District","Sacramento","CA",9019,90019,"Independent Public Agency or Authority of Transit Service","Full Reporter",1723634,232,"DR","DO",2,1,null,2,null,3,null,52377,null,41606,null,0,null,0,null,"No"]
["North County Transit District","Oceanside","CA",9030,90030,"Independent Public Agency or Authority of Transit Service","Full Reporter",2956746,230,"MB","PT",137,468,null,0,null,468,null,6328967,null,5612786,null,0,null,0,null,"No"]
["North County Transit District","Oceanside","CA",9030,90030,"Independent Public Agency or Authority of Transit Service","Full Reporter",2956746,230,"DR","PT",61,48,null,0,null,48,null,2496555,null,2095384,null,0,null,0,null,"No"]
["North County Transit District","Oceanside","CA",9030,90030,"Independent Public Agency or Authority of Transit Service","Full Reporter",2956746,230,"CR","PT",24,5,null,13,null,18,null,1460442,null,1372271,null,290075,null,273645,null,"No"]
["North County Transit District","Oceanside","CA",9030,90030,"Independent Public Agency or Authority of Transit Service","Full Reporter",2956746,230,"YR","PT",8,20,null,19,null,39,null,688177,null,684576,null,520809,null,518836,null,"No"]
["Fairfax Connector Bus System","Fairfax","VA",3068,30068,"City, County or Local Government Unit or Department of Transportation","Full Reporter",4586770,226,"MB","PT",226,871,null,1333,null,2204,null,11814839,null,9191836,null,0,null,0,null,"No"]
["Des Moines Area Regional Transit Authority","Des Moines","IA",7010,70010,"Independent Public Agency or Authority of Transit Service","Full Reporter",450070,226,"MB","DO",113,324,null,480,null,804,null,3294288,null,2899540,null,0,null,0,null,"No"]
["Des Moines Area Regional Transit Authority","Des Moines","IA",7010,70010,"Independent Public Agency or Authority of Transit Service","Full Reporter",450070,226,"VP","DO",90,1,null,0,null,1,null,1711169,null,1711169,null,0,null,0,null,"No"]
["Des Moines Area Regional Transit Authority","Des Moines","IA",7010,70010,"Independent Public Agency or Authority of Transit Service","Full Reporter",450070,226,"DR","DO",21,15,null,24,null,39,null,840686,null,716190,null,0,null,0,null,"No"]
["Academy Lines, Inc.","Hoboken","NJ",2122,20122,"Private-For-Profit Corporation","Full Reporter",18351295,225,"CB","DO",225,68,null,565,null,633,null,9794481,null,8628815,null,0,null,0,null,"No"]
["Metropolitan Council","St. Paul","MN",5154,50154,"City, County or Local Government Unit or Department of Transportation","Full Reporter",2650890,219,"VP","PT",76,0,null,4,null,4,null,1648883,null,1648883,null,0,null,0,null,"No"]
["Metropolitan Council","St. Paul","MN",5154,50154,"City, County or Local Government Unit or Department of Transportation","Full Reporter",2650890,219,"DR","PT",75,0,null,0,null,0,null,2728826,null,2376139,null,0,null,0,null,"No"]
["Metropolitan Council","St. Paul","MN",5154,50154,"City, County or Local Government Unit or Department of Transportation","Full Reporter",2650890,219,"MB","PT",68,31,null,178,null,209,null,4056803,null,3300156,null,0,null,0,null,"No"]
["Central New York Regional Transportation Authority","Syracuse","NY",2018,20018,"Independent Public Agency or Authority of Transit Service","Full Reporter",412317,208,"MB","DO",162,490,null,1320,null,1810,null,5266401,null,4916269,null,0,null,0,null,"No"]
["METRO Regional Transit Authority","Akron","OH",5010,50010,"Independent Public Agency or Authority of Transit Service","Full Reporter",569499,208,"MB","DO",110,746,null,37,null,783,null,4263909,null,3778856,null,0,null,0,null,"No"]
["METRO Regional Transit Authority","Akron","OH",5010,50010,"Independent Public Agency or Authority of Transit Service","Full Reporter",569499,208,"DR","DO",91,34,null,5,null,39,null,2063662,null,1665860,null,0,null,0,null,"No"]
["Central New York Regional Transportation Authority","Syracuse","NY",2018,20018,"Independent Public Agency or Authority of Transit Service","Full Reporter",412317,208,"DR","DO",25,1,null,10,null,11,null,715643,null,590143,null,0,null,0,null,"No"]
["Central New York Regional Transportation Authority","Syracuse","NY",2018,20018,"Independent Public Agency or Authority of Transit Service","Full Reporter",412317,208,"DR","PT",21,1,null,5,null,6,null,601509,null,504393,null,0,null,0,null,"No"]
["METRO Regional Transit Authority","Akron","OH",5010,50010,"Independent Public Agency or Authority of Transit Service","Full Reporter",569499,208,"CB","DO",7,11,null,2,null,13,null,366093,null,274406,null,0,null,0,null,"No"]
["Blue Water Area Transportation Commission","Port Huron","MI",5148,50148,"Independent Public Agency or Authority of Transit Service","Full Reporter",87106,205,"DR","PT",150,29,null,96,null,125,null,1420689,null,1235341,null,0,null,0,null,"No"]
["Blue Water Area Transportation Commission","Port Huron","MI",5148,50148,"Independent Public Agency or Authority of Transit Service","Full Reporter",87106,205,"DR","DO",43,7,null,3,null,10,null,1209202,null,1194661,null,0,null,0,null,"No"]
["Blue Water Area Transportation Commission","Port Huron","MI",5148,50148,"Independent Public Agency or Authority of Transit Service","Full Reporter",87106,205,"MB","DO",9,4,null,1,null,5,null,408229,null,399498,null,0,null,0,null,"No"]
["Blue Water Area Transportation Commission","Port Huron","MI",5148,50148,"Independent Public Agency or Authority of Transit Service","Full Reporter",87106,205,"CB","DO",3,0,null,0,null,0,null,99309,null,99045,null,0,null,0,null,"No"]
["Regional Transportation Commission of Washoe County","Reno","NV",9001,90001,"Independent Public Agency or Authority of Transit Service","Full Reporter",392141,204,"VP","PT",93,0,null,0,null,0,null,1832663,null,1832663,null,0,null,0,null,"No"]
["Regional Transportation Commission of Washoe County","Reno","NV",9001,90001,"Independent Public Agency or Authority of Transit Service","Full Reporter",392141,204,"MB","PT",54,97,null,14,null,111,null,2942759,null,2783287,null,0,null,0,null,"No"]
["Regional Transportation Commission of Washoe County","Reno","NV",9001,90001,"Independent Public Agency or Authority of Transit Service","Full Reporter",392141,204,"DR","PT",47,10,null,12,null,22,null,1363275,null,1242658,"W",0,null,0,null,"No"]
["Regional Transportation Commission of Washoe County","Reno","NV",9001,90001,"Independent Public Agency or Authority of Transit Service","Full Reporter",392141,204,"CB","PT",3,1,null,0,null,1,null,115393,null,105537,null,0,null,0,null,"No"]
["Indianapolis and Marion County Public Transportation","Indianapolis","IN",5050,50050,"Independent Public Agency or Authority of Transit Service","Full Reporter",1487483,202,"MB","DO",136,1578,null,378,null,1956,null,7950265,null,6997279,null,0,null,0,null,"No"]
["Mass Transportation Authority","Flint","MI",5032,50032,"Independent Public Agency or Authority of Transit Service","Full Reporter",356218,202,"DR","DO",101,93,null,6,null,99,null,4214646,null,3912003,null,0,null,0,null,"No"]
["Mass Transportation Authority","Flint","MI",5032,50032,"Independent Public Agency or Authority of Transit Service","Full Reporter",356218,202,"MB","DO",99,474,null,88,null,562,null,3663097,null,3351686,null,0,null,0,null,"No"]
["Indianapolis and Marion County Public Transportation","Indianapolis","IN",5050,50050,"Independent Public Agency or Authority of Transit Service","Full Reporter",1487483,202,"DR","PT",66,56,null,6,null,62,null,3560367,null,2928956,null,0,null,0,null,"No"]
["Mass Transportation Authority","Flint","MI",5032,50032,"Independent Public Agency or Authority of Transit Service","Full Reporter",356218,202,"DR","PT",2,0,null,0,null,0,null,51124,null,44348,null,0,null,0,null,"No"]
["Hillsborough Area Regional Transit Authority","Tampa","FL",4041,40041,"Independent Public Agency or Authority of Transit Service","Full Reporter",2441770,201,"MB","DO",162,1564,null,702,null,2266,null,9378110,null,8385009,null,0,null,0,null,"No"]
["Hillsborough Area Regional Transit Authority","Tampa","FL",4041,40041,"Independent Public Agency or Authority of Transit Service","Full Reporter",2441770,201,"DR","DO",36,118,null,62,null,180,null,1627037,null,1420606,null,0,null,0,null,"No"]
["Hillsborough Area Regional Transit Authority","Tampa","FL",4041,40041,"Independent Public Agency or Authority of Transit Service","Full Reporter",2441770,201,"SR","DO",3,95,null,21,null,116,null,66186,null,66163,null,66186,null,66163,null,"No"]
["Long Beach Transit","Long Beach","CA",9023,90023,"Other Publicly-Owned or Privately Chartered Corporation","Full Reporter",12150996,197,"MB","DO",187,1416,null,610,null,2026,null,7673633,null,6946038,null,0,null,0,null,"No"]
["Long Beach Transit","Long Beach","CA",9023,90023,"Other Publicly-Owned or Privately Chartered Corporation","Full Reporter",12150996,197,"DR","PT",10,12,null,43,null,55,null,382231,null,288367,null,0,null,0,null,"No"]
["Southern California Regional Rail Authority dba: Metrolink","Los Angeles","CA",9151,90151,"Independent Public Agency or Authority of Transit Service","Full Reporter",12150996,195,"CR","PT",195,97,null,0,null,97,null,13394664,null,13089698,null,2755653,null,2683606,null,"No"]
["City of Albuquerque Transit Department","Albuquerque","NM",6019,60019,"City, County or Local Government Unit or Department of Transportation","Full Reporter",741318,193,"MB","DO",131,161,null,321,null,482,null,6497552,null,5463320,null,0,null,0,null,"No"]
["City of Albuquerque Transit Department","Albuquerque","NM",6019,60019,"City, County or Local Government Unit or Department of Transportation","Full Reporter",741318,193,"DR","DO",62,10,null,15,null,25,null,2332085,null,2020638,null,0,null,0,null,"No"]
["Fort Worth Transportation Authority","Fort Worth","TX",6007,60007,"Independent Public Agency or Authority of Transit Service","Full Reporter",5121892,192,"MB","DO",108,870,null,765,null,1635,null,4756617,null,4196508,null,0,null,0,null,"No"]
["Fort Worth Transportation Authority","Fort Worth","TX",6007,60007,"Independent Public Agency or Authority of Transit Service","Full Reporter",5121892,192,"DR","PT",46,0,null,0,null,0,"Q",2257835,null,1992000,null,0,null,0,null,"Yes"]
["Fort Worth Transportation Authority","Fort Worth","TX",6007,60007,"Independent Public Agency or Authority of Transit Service","Full Reporter",5121892,192,"DR","DO",34,119,null,72,null,191,null,1663478,null,1409893,null,0,null,0,null,"No"]
["Fort Worth Transportation Authority","Fort Worth","TX",6007,60007,"Independent Public Agency or Authority of Transit Service","Full Reporter",5121892,192,"MB","PT",4,4,null,0,null,4,null,87487,null,53229,null,0,null,0,null,"No"]
["Mass Transit Department - City of El Paso","El Paso","TX",6006,60006,"City, County or Local Government Unit or Department of Transportation","Full Reporter",803086,186,"MB","DO",125,74,null,9,null,83,null,8438010,null,7573558,null,0,null,0,null,"No"]
["Mass Transit Department - City of El Paso","El Paso","TX",6006,60006,"City, County or Local Government Unit or Department of Transportation","Full Reporter",803086,186,"DR","PT",61,52,null,24,null,76,null,3024216,null,2622098,null,0,null,0,null,"No"]
["York County Transportation Authority","York","PA",3027,30027,"Independent Public Agency or Authority of Transit Service","Full Reporter",232045,178,"DR","DO",103,18,null,50,null,68,null,3350817,null,2660728,null,0,null,0,null,"No"]
["Greater Dayton Regional Transit Authority","Dayton","OH",5017,50017,"Independent Public Agency or Authority of Transit Service","Full Reporter",724091,178,"MB","DO",98,3603,null,114,null,3717,null,6257337,null,5884752,null,0,null,0,null,{"$f":"IF(OR(Z386=\"Q\",X386=\"Q\",V386=\"Q\",T386=\"Q\",R386=\"Q\",P386=\"Q\",N386=\"Q\"),\"Yes\",\"No\")","v":"No"}]
["Greater Dayton Regional Transit Authority","Dayton","OH",5017,50017,"Independent Public Agency or Authority of Transit Service","Full Reporter",724091,178,"DR","DO",54,102,null,71,null,173,null,2078645,null,1777856,null,0,null,0,null,"No"]
["York County Transportation Authority","York","PA",3027,30027,"Independent Public Agency or Authority of Transit Service","Full Reporter",232045,178,"MB","DO",35,29,null,327,null,356,null,1335606,null,1238076,null,0,null,0,null,"No"]
["Greater Dayton Regional Transit Authority","Dayton","OH",5017,50017,"Independent Public Agency or Authority of Transit Service","Full Reporter",724091,178,"TB","DO",26,1531,null,135,null,1666,null,929516,null,906749,null,0,null,0,null,"No"]
["York County Transportation Authority","York","PA",3027,30027,"Independent Public Agency or Authority of Transit Service","Full Reporter",232045,178,"DR","PT",13,2,null,5,null,7,null,351056,null,283882,null,0,null,0,null,"No"]
["York County Transportation Authority","York","PA",3027,30027,"Independent Public Agency or Authority of Transit Service","Full Reporter",232045,178,"CB","DO",9,6,null,49,null,55,null,418179,null,397633,null,0,null,0,null,"No"]
["Capital Area Transportation Authority","Lansing","MI",5036,50036,"Independent Public Agency or Authority of Transit Service","Full Reporter",313532,176,"MB","DO",76,491,null,71,null,562,null,3477493,null,3245202,null,0,null,0,null,"No"]
["Capital Area Transportation Authority","Lansing","MI",5036,50036,"Independent Public Agency or Authority of Transit Service","Full Reporter",313532,176,"DR","PT",63,11,null,3,null,14,null,2455169,null,2162605,null,0,null,0,null,"No"]
["Clark County Public Transportation Benefit Area Authority","Vancouver","WA",24,24,"Independent Public Agency or Authority of Transit Service","Full Reporter",1849898,176,"MB","DO",56,209,null,130,null,339,null,3326433,null,3056620,null,0,null,0,null,"No"]
["Clark County Public Transportation Benefit Area Authority","Vancouver","WA",24,24,"Independent Public Agency or Authority of Transit Service","Full Reporter",1849898,176,"DR","DO",46,44,null,12,null,56,null,1658508,"W",1418913,"W",0,null,0,null,"No"]
["Clark County Public Transportation Benefit Area Authority","Vancouver","WA",24,24,"Independent Public Agency or Authority of Transit Service","Full Reporter",1849898,176,"CB","DO",41,44,null,27,null,71,null,1291555,null,796664,null,0,null,0,null,"No"]
["Capital Area Transportation Authority","Lansing","MI",5036,50036,"Independent Public Agency or Authority of Transit Service","Full Reporter",313532,176,"DR","DO",37,51,null,19,null,70,null,914706,null,753655,null,0,null,0,null,"No"]
["Clark County Public Transportation Benefit Area Authority","Vancouver","WA",24,24,"Independent Public Agency or Authority of Transit Service","Full Reporter",1849898,176,"VP","DO",33,34,null,0,null,34,null,388685,null,388685,null,0,null,0,null,"No"]
["Lehigh and Northampton Transportation Authority","Allentown","PA",3010,30010,"Independent Public Agency or Authority of Transit Service","Full Reporter",664651,175,"DR","PT",104,18,null,161,null,179,null,3595848,null,2763986,null,0,null,0,null,"No"]
["Lehigh and Northampton Transportation Authority","Allentown","PA",3010,30010,"Independent Public Agency or Authority of Transit Service","Full Reporter",664651,175,"MB","DO",71,32,null,456,null,488,null,2940555,null,2814812,null,0,null,0,null,"No"]
["Santa Monica's Big Blue Bus","Santa Monica","CA",9008,90008,"City, County or Local Government Unit or Department of Transportation","Full Reporter",12150996,173,"MB","DO",167,397,null,152,null,549,null,5655983,null,4862782,null,0,null,0,null,"No"]
["Santa Monica's Big Blue Bus","Santa Monica","CA",9008,90008,"City, County or Local Government Unit or Department of Transportation","Full Reporter",12150996,173,"DR","PT",6,4,null,10,null,14,null,73333,null,66298,null,0,null,0,null,"No"]
["Montachusett Regional Transit Authority","Fitchburg","MA",1061,10061,"Independent Public Agency or Authority of Transit Service","Full Reporter",116960,170,"DR","PT",143,31,null,33,null,64,null,2604690,null,2261484,null,0,null,0,null,"No"]
["Wichita Transit","Wichita","KS",7015,70015,"City, County or Local Government Unit or Department of Transportation","Full Reporter",472870,170,"DR","PT",107,43,null,22,null,65,null,592530,null,361447,null,0,null,0,null,"No"]
["Mountain Metropolitan Transit","Colorado Springs","CO",8005,80005,"City, County or Local Government Unit or Department of Transportation","Full Reporter",559409,170,"DR","PT",84,27,null,8,null,35,null,1767954,null,1329810,null,0,null,0,null,"No"]
["Mountain Metropolitan Transit","Colorado Springs","CO",8005,80005,"City, County or Local Government Unit or Department of Transportation","Full Reporter",559409,170,"MB","PT",40,268,null,257,null,525,null,2125514,null,1979621,null,0,null,0,null,"No"]
["Wichita Transit","Wichita","KS",7015,70015,"City, County or Local Government Unit or Department of Transportation","Full Reporter",472870,170,"MB","DO",38,222,null,285,null,507,null,1744012,null,1648115,null,0,null,0,null,"No"]
["Mountain Metropolitan Transit","Colorado Springs","CO",8005,80005,"City, County or Local Government Unit or Department of Transportation","Full Reporter",559409,170,"VP","DO",34,0,null,0,null,0,null,698672,null,698672,null,0,null,0,null,"No"]
["Wichita Transit","Wichita","KS",7015,70015,"City, County or Local Government Unit or Department of Transportation","Full Reporter",472870,170,"DR","DO",23,15,null,4,null,19,null,658356,null,564037,null,0,null,0,null,"No"]
["Montachusett Regional Transit Authority","Fitchburg","MA",1061,10061,"Independent Public Agency or Authority of Transit Service","Full Reporter",116960,170,"MB","PT",19,33,null,55,null,88,null,719282,null,698883,null,0,null,0,null,"No"]
["Wichita Transit","Wichita","KS",7015,70015,"City, County or Local Government Unit or Department of Transportation","Full Reporter",472870,170,"VP","PT",2,0,null,0,null,0,null,29829,null,29829,null,0,null,0,null,"No"]
["New Orleans Regional Transit Authority","New Orleans","LA",6032,60032,"Independent Public Agency or Authority of Transit Service","Full Reporter",899703,163,"MB","PT",89,640,null,899,null,1539,null,5601555,null,5327190,null,0,null,0,null,"No"]
["New Orleans Regional Transit Authority","New Orleans","LA",6032,60032,"Independent Public Agency or Authority of Transit Service","Full Reporter",899703,163,"DR","PT",41,23,null,82,null,105,null,1249820,null,1155866,null,0,null,0,null,"No"]
["New Orleans Regional Transit Authority","New Orleans","LA",6032,60032,"Independent Public Agency or Authority of Transit Service","Full Reporter",899703,163,"SR","PT",31,75,null,87,null,162,null,1201611,null,1192948,null,1201611,null,1192948,null,"No"]
["New Orleans Regional Transit Authority","New Orleans","LA",6032,60032,"Independent Public Agency or Authority of Transit Service","Full Reporter",899703,163,"FB","PT",2,11,null,16,null,27,null,21122,null,21122,null,0,null,0,null,"No"]
["Hudson Transit Lines, Inc.","Mahwah","NJ",2126,20126,"Private-For-Profit Corporation","Full Reporter",18351295,161,"CB","DO",161,386,null,8,null,394,null,10063967,null,9472407,null,0,null,0,null,"No"]
["Ann Arbor Area Transportation Authority","Ann Arbor","MI",5040,50040,"Independent Public Agency or Authority of Transit Service","Full Reporter",306022,160,"MB","DO",84,90,null,43,null,133,null,3321648,null,3026342,null,0,null,0,null,"No"]
["Ann Arbor Area Transportation Authority","Ann Arbor","MI",5040,50040,"Independent Public Agency or Authority of Transit Service","Full Reporter",306022,160,"DR","PT",51,2,null,21,null,23,null,1619332,null,1474390,null,0,null,0,null,"No"]
["Ann Arbor Area Transportation Authority","Ann Arbor","MI",5040,50040,"Independent Public Agency or Authority of Transit Service","Full Reporter",306022,160,"DR","DO",9,2,null,5,null,7,null,142559,null,127799,null,0,null,0,null,"No"]
["Ann Arbor Area Transportation Authority","Ann Arbor","MI",5040,50040,"Independent Public Agency or Authority of Transit Service","Full Reporter",306022,160,"CB","DO",2,2,null,0,null,2,null,77898,null,55114,null,0,null,0,null,"No"]
["Ann Arbor Area Transportation Authority","Ann Arbor","MI",5040,50040,"Independent Public Agency or Authority of Transit Service","Full Reporter",306022,160,"CB","PT",2,1,null,2,null,3,null,302527,null,296671,null,0,null,0,null,"No"]
["Research Triangle Regional Public Transportation Authority","Research Triangle Park","NC",4108,40108,"Independent Public Agency or Authority of Transit Service","Full Reporter",347602,153,"VP","DO",60,5,null,1,null,6,null,889337,null,889337,null,0,null,0,null,"No"]
["Research Triangle Regional Public Transportation Authority","Research Triangle Park","NC",4108,40108,"Independent Public Agency or Authority of Transit Service","Full Reporter",347602,153,"MB","DO",58,348,null,151,null,499,null,2953489,null,2238667,null,0,null,0,null,"No"]
["Research Triangle Regional Public Transportation Authority","Research Triangle Park","NC",4108,40108,"Independent Public Agency or Authority of Transit Service","Full Reporter",347602,153,"MB","PT",20,85,null,34,null,119,null,734699,null,581136,null,0,null,0,null,"No"]
["Research Triangle Regional Public Transportation Authority","Research Triangle Park","NC",4108,40108,"Independent Public Agency or Authority of Transit Service","Full Reporter",347602,153,"DR","DO",15,11,null,4,null,15,null,723077,null,556386,null,0,null,0,null,"No"]
["Golden Gate Bridge, Highway and Transportation District","San Francisco","CA",9016,90016,"Independent Public Agency or Authority of Transit Service","Full Reporter",3281212,152,"MB","DO",129,95,null,88,null,183,null,4981706,null,4266294,null,0,null,0,null,"No"]
["Municipality of Anchorage - Public Transportation Department","Anchorage","AK",12,12,"City, County or Local Government Unit or Department of Transportation","Full Reporter",251243,152,"VP","PT",65,0,null,0,null,0,null,1196813,null,1196813,null,0,null,0,null,"No"]
["Space Coast Area Transit","Cocoa","FL",4063,40063,"City, County or Local Government Unit or Department of Transportation","Full Reporter",452791,152,"DR","PT",51,2,null,2,null,4,null,765026,null,663351,null,0,null,0,null,"No"]
["Space Coast Area Transit","Cocoa","FL",4063,40063,"City, County or Local Government Unit or Department of Transportation","Full Reporter",452791,152,"VP","PT",45,7,null,4,null,11,null,983607,null,983607,null,0,null,0,null,"No"]
["Municipality of Anchorage - Public Transportation Department","Anchorage","AK",12,12,"City, County or Local Government Unit or Department of Transportation","Full Reporter",251243,152,"DR","PT",44,15,null,5,null,20,null,1227304,null,1072643,null,0,null,0,null,"No"]
["Municipality of Anchorage - Public Transportation Department","Anchorage","AK",12,12,"City, County or Local Government Unit or Department of Transportation","Full Reporter",251243,152,"MB","DO",43,518,null,312,null,830,null,2122158,null,1915823,null,0,null,0,null,"No"]
["Space Coast Area Transit","Cocoa","FL",4063,40063,"City, County or Local Government Unit or Department of Transportation","Full Reporter",452791,152,"MB","DO",29,17,null,23,null,40,null,1828442,null,1764797,null,0,null,0,null,"No"]
["Space Coast Area Transit","Cocoa","FL",4063,40063,"City, County or Local Government Unit or Department of Transportation","Full Reporter",452791,152,"DR","DO",27,10,null,14,null,24,null,836411,null,690272,null,0,null,0,null,"No"]
["Golden Gate Bridge, Highway and Transportation District","San Francisco","CA",9016,90016,"Independent Public Agency or Authority of Transit Service","Full Reporter",3281212,152,"DR","PT",17,0,null,0,null,0,null,501404,null,427200,null,0,null,0,null,"No"]
["Golden Gate Bridge, Highway and Transportation District","San Francisco","CA",9016,90016,"Independent Public Agency or Authority of Transit Service","Full Reporter",3281212,152,"FB","DO",6,4,null,3,null,7,null,209023,null,190060,null,0,null,0,null,"No"]
["Memphis Area Transit Authority","Memphis","TN",4003,40003,"City, County or Local Government Unit or Department of Transportation","Full Reporter",1060061,150,"MB","DO",108,196,null,1523,null,1719,null,5962068,null,5281242,null,0,null,0,null,"No"]
["Memphis Area Transit Authority","Memphis","TN",4003,40003,"City, County or Local Government Unit or Department of Transportation","Full Reporter",1060061,150,"DR","DO",42,82,null,490,null,572,null,2017020,null,1711992,null,0,null,0,null,"No"]
["Madison County Transit District","Granite City","IL",5146,50146,"Independent Public Agency or Authority of Transit Service","Full Reporter",2150706,145,"MB","PT",74,201,null,75,null,276,null,4669891,null,3738393,null,0,null,0,null,"No"]
["Madison County Transit District","Granite City","IL",5146,50146,"Independent Public Agency or Authority of Transit Service","Full Reporter",2150706,145,"VP","DO",52,6,null,2,null,8,null,806851,null,806851,null,0,null,0,null,"No"]
["Madison County Transit District","Granite City","IL",5146,50146,"Independent Public Agency or Authority of Transit Service","Full Reporter",2150706,145,"DR","PT",19,23,null,4,null,27,null,790368,null,650430,null,0,null,0,null,"No"]
["Greater Hartford Transit District","Hartford","CT",1017,10017,"Independent Public Agency or Authority of Transit Service","Full Reporter",924859,143,"DR","PT",143,33,null,873,null,906,null,5068973,null,3964750,null,0,null,0,null,"No"]
["Gainesville Regional Transit System","Gainesville","FL",4030,40030,"City, County or Local Government Unit or Department of Transportation","Full Reporter",187781,143,"MB","DO",108,102,null,257,null,359,null,3767555,null,3613837,null,0,null,0,null,"No"]
["Central Contra Costa Transit Authority","Concord","CA",9078,90078,"Independent Public Agency or Authority of Transit Service","Full Reporter",615968,143,"MB","DO",93,93,null,55,null,148,null,3296216,null,2491968,null,0,null,0,null,"No"]
["Central Contra Costa Transit Authority","Concord","CA",9078,90078,"Independent Public Agency or Authority of Transit Service","Full Reporter",615968,143,"DR","PT",50,2,null,25,null,27,null,1330810,null,963753,null,0,null,0,null,"No"]
["Gainesville Regional Transit System","Gainesville","FL",4030,40030,"City, County or Local Government Unit or Department of Transportation","Full Reporter",187781,143,"DR","PT",35,30,null,1,null,31,null,635158,null,539345,null,0,null,0,null,"No"]
["vRide, Inc. - Denver","Denver","CO",8109,80109,"Private Provider Reporting on Behalf of a Public Entity","Full Reporter",2374203,135,"VP","DO",135,3,null,1,null,4,null,2463920,null,2463920,null,0,null,0,null,"No"]
["Peninsula Corridor Joint Powers Board dba: Caltrain","San Carlos","CA",9134,90134,"Independent Public Agency or Authority of Transit Service","Full Reporter",3281212,135,"CR","PT",105,56,null,13,null,69,null,7375609,null,7215731,null,1443982,null,1380022,null,"No"]
["Peninsula Corridor Joint Powers Board dba: Caltrain","San Carlos","CA",9134,90134,"Independent Public Agency or Authority of Transit Service","Full Reporter",3281212,135,"MB","PT",30,0,null,0,null,0,null,814743,null,566545,null,0,null,0,null,"No"]
["Minnesota Valley Transit Authority","Burnsville","MN",5222,50519,"Independent Public Agency or Authority of Transit Service","Full Reporter",2650890,134,"MB","PT",134,277,null,201,null,478,null,5349714,null,3353833,null,0,null,0,null,"No"]
["Paratransit, Inc.","Sacramento","CA",9223,90223,"Independent Public Agency or Authority of Transit Service","Full Reporter",1723634,134,"DR","DO",93,144,null,140,null,284,null,3404527,null,2851711,null,0,null,0,null,{"$f":"IF(OR(Z450=\"Q\",X450=\"Q\",V450=\"Q\",T450=\"Q\",R450=\"Q\",P450=\"Q\",N450=\"Q\"),\"Yes\",\"No\")","v":"No"}]
["Paratransit, Inc.","Sacramento","CA",9223,90223,"Independent Public Agency or Authority of Transit Service","Full Reporter",1723634,134,"DR","PT",19,18,null,0,null,18,null,494169,null,391732,null,0,null,0,null,"No"]
["County of Volusia, dba: VOTRAN","South Daytona","FL",4032,40032,"City, County or Local Government Unit or Department of Transportation","Full Reporter",349064,133,"MB","DO",54,302,null,181,null,483,null,2824306,null,2634065,null,0,null,0,null,"No"]
["County of Volusia, dba: VOTRAN","South Daytona","FL",4032,40032,"City, County or Local Government Unit or Department of Transportation","Full Reporter",349064,133,"DR","DO",49,167,null,40,null,207,null,1744546,null,1525423,null,0,null,0,null,"No"]
["County of Volusia, dba: VOTRAN","South Daytona","FL",4032,40032,"City, County or Local Government Unit or Department of Transportation","Full Reporter",349064,133,"DR","PT",25,0,null,0,null,0,null,841964,null,749522,null,0,null,0,null,"No"]
["County of Volusia, dba: VOTRAN","South Daytona","FL",4032,40032,"City, County or Local Government Unit or Department of Transportation","Full Reporter",349064,133,"VP","PT",2,0,null,0,null,0,null,52910,null,52910,null,0,null,0,null,"No"]
["Fresno Area Express","Fresno","CA",9027,90027,"City, County or Local Government Unit or Department of Transportation","Full Reporter",654628,129,"MB","DO",80,642,null,179,null,821,null,4175783,null,3887939,null,0,null,0,null,"No"]
["Fresno Area Express","Fresno","CA",9027,90027,"City, County or Local Government Unit or Department of Transportation","Full Reporter",654628,129,"DR","PT",49,4,null,86,null,90,null,1260911,null,1140144,null,0,null,0,null,"No"]
["Prince George's County Transit","Largo","MD",3085,30085,"City, County or Local Government Unit or Department of Transportation","Full Reporter",4586770,128,"MB","PT",76,92,null,274,null,366,null,3482269,null,3061503,null,0,null,0,null,"No"]
["Prince George's County Transit","Largo","MD",3085,30085,"City, County or Local Government Unit or Department of Transportation","Full Reporter",4586770,128,"DR","DO",52,101,null,76,null,177,null,558889,null,307215,null,0,null,0,null,"No"]
["Ft.Worth - vRide, Inc.","Arlington","TX",6084,60084,"Private Provider Reporting on Behalf of a Public Entity","Full Reporter",5121892,127,"VP","DO",127,1,null,0,null,1,null,2220965,null,2220965,null,0,null,0,null,"No"]
["Hill Country Transit District","San Saba","TX",6091,60091,"Independent Public Agency or Authority of Transit Service","Full Reporter",217630,122,"DR","DO",108,137,null,25,null,162,null,2591465,null,2132237,null,0,null,0,null,"No"]
["Hill Country Transit District","San Saba","TX",6091,60091,"Independent Public Agency or Authority of Transit Service","Full Reporter",217630,122,"MB","DO",14,75,null,5,null,80,null,818164,null,708855,null,0,null,0,null,"No"]
["Champaign-Urbana Mass Transit District","Urbana","IL",5060,50060,"Independent Public Agency or Authority of Transit Service","Full Reporter",145361,120,"MB","DO",97,85,null,46,null,131,null,3248390,null,3117545,null,0,null,0,null,"No"]
["Champaign-Urbana Mass Transit District","Urbana","IL",5060,50060,"Independent Public Agency or Authority of Transit Service","Full Reporter",145361,120,"DR","PT",15,4,null,2,null,6,null,182470,null,165939,null,0,null,0,null,"No"]
["Champaign-Urbana Mass Transit District","Urbana","IL",5060,50060,"Independent Public Agency or Authority of Transit Service","Full Reporter",145361,120,"DR","DO",8,5,null,8,null,13,null,200780,null,186954,null,0,null,0,null,"No"]
["Rides Mass Transit District","Harrisburg","IL",5211,50211,"Independent Public Agency or Authority of Transit Service","Full Reporter",67821,119,"MB","DO",119,63,null,9,null,72,null,3923611,null,3493185,null,0,null,0,null,"No"]
["Metropolitan Bus Authority","San Juan","PR",4086,40086,"Independent Public Agency or Authority of Transit Service","Full Reporter",2148346,118,"MB","DO",88,3216,null,2076,null,5292,null,2573209,null,2351851,null,0,null,0,null,"No"]
["Metropolitan Bus Authority","San Juan","PR",4086,40086,"Independent Public Agency or Authority of Transit Service","Full Reporter",2148346,118,"DR","DO",30,492,null,216,null,708,null,652530,"Q",489929,"Q",0,null,0,null,"Yes"]
["Santa Cruz Metropolitan Transit District","Santa Cruz","CA",9006,90006,"Independent Public Agency or Authority of Transit Service","Full Reporter",163703,117,"MB","DO",67,23,null,120,null,143,null,3003333,null,2650889,null,0,null,0,null,"No"]
["Santa Cruz Metropolitan Transit District","Santa Cruz","CA",9006,90006,"Independent Public Agency or Authority of Transit Service","Full Reporter",163703,117,"DR","DO",29,2,null,10,null,12,null,595231,null,471020,null,0,null,0,null,"No"]
["Santa Cruz Metropolitan Transit District","Santa Cruz","CA",9006,90006,"Independent Public Agency or Authority of Transit Service","Full Reporter",163703,117,"CB","DO",15,7,null,39,null,46,null,838877,null,686891,null,0,null,0,null,"No"]
["Erie Metropolitan Transit Authority","Erie","PA",3013,30013,"Independent Public Agency or Authority of Transit Service","Full Reporter",196611,116,"MB","DO",61,270,null,263,null,533,null,2033847,null,1991405,null,0,null,0,null,"No"]
["Erie Metropolitan Transit Authority","Erie","PA",3013,30013,"Independent Public Agency or Authority of Transit Service","Full Reporter",196611,116,"DR","DO",55,42,null,27,null,69,null,939225,null,788220,null,0,null,0,null,"No"]
["Greater Attleboro-Taunton Regional Transit Authority","Taunton","MA",1064,10064,"Independent Public Agency or Authority of Transit Service","Full Reporter",1190956,114,"DR","PT",71,25,null,18,null,43,null,1709299,null,1445479,null,0,null,0,null,"No"]
["Centre Area Transportation Authority","State College","PA",3054,30054,"Independent Public Agency or Authority of Transit Service","Full Reporter",87454,114,"MB","DO",61,63,null,397,null,460,null,2052873,null,1922320,"W",0,null,0,null,"No"]
["Denton County Transportation Authority","Lewisville","TX",6101,60101,"Independent Public Agency or Authority of Transit Service","Full Reporter",366174,114,"MB","DO",50,248,null,57,null,305,null,1628214,null,1482110,null,0,null,0,null,"No"]
["Centre Area Transportation Authority","State College","PA",3054,30054,"Independent Public Agency or Authority of Transit Service","Full Reporter",87454,114,"VP","DO",43,0,null,3,null,3,null,1010807,null,1010807,null,0,null,0,null,"No"]
["Denton County Transportation Authority","Lewisville","TX",6101,60101,"Independent Public Agency or Authority of Transit Service","Full Reporter",366174,114,"VP","PT",42,6,null,4,null,10,null,822901,null,822901,null,0,null,0,null,"No"]
["Greater Attleboro-Taunton Regional Transit Authority","Taunton","MA",1064,10064,"Independent Public Agency or Authority of Transit Service","Full Reporter",1190956,114,"MB","PT",41,39,null,20,null,59,null,1852937,null,1692692,null,0,null,0,null,"No"]
["Denton County Transportation Authority","Lewisville","TX",6101,60101,"Independent Public Agency or Authority of Transit Service","Full Reporter",366174,114,"DR","DO",14,17,null,3,null,20,null,337206,null,276159,null,0,null,0,null,"No"]
["Centre Area Transportation Authority","State College","PA",3054,30054,"Independent Public Agency or Authority of Transit Service","Full Reporter",87454,114,"DR","PT",10,0,null,0,null,0,null,288881,null,256667,null,0,null,0,null,"No"]
["Denton County Transportation Authority","Lewisville","TX",6101,60101,"Independent Public Agency or Authority of Transit Service","Full Reporter",366174,114,"YR","PT",8,2,null,0,null,2,null,673572,null,644711,null,349479,null,334467,null,"No"]
["Greater Attleboro-Taunton Regional Transit Authority","Taunton","MA",1064,10064,"Independent Public Agency or Authority of Transit Service","Full Reporter",1190956,114,"CB","PT",2,2,null,1,null,3,null,95111,null,94104,null,0,null,0,null,"No"]
["Transit Authority of Northern Kentucky","Fort Wright","KY",4019,40019,"Independent Public Agency or Authority of Transit Service","Full Reporter",1624827,113,"MB","DO",91,428,null,252,null,680,null,3883520,null,3134187,null,0,null,0,null,"No"]
["Transit Authority of Northern Kentucky","Fort Wright","KY",4019,40019,"Independent Public Agency or Authority of Transit Service","Full Reporter",1624827,113,"DR","DO",22,16,null,5,null,21,null,1042262,null,913163,null,0,null,0,null,"No"]
["Transit Authority of Omaha","Omaha","NE",7002,70002,"Independent Public Agency or Authority of Transit Service","Full Reporter",725008,112,"MB","DO",90,224,null,2494,null,2718,null,4064778,null,4064778,null,0,null,0,null,"No"]
["Transit Authority of Omaha","Omaha","NE",7002,70002,"Independent Public Agency or Authority of Transit Service","Full Reporter",725008,112,"DR","DO",22,23,null,200,null,223,null,768599,null,748612,null,0,null,0,null,"No"]
["Cumberland Dauphin-Harrisburg Transit Authority","Harrisburg","PA",3014,30014,"Independent Public Agency or Authority of Transit Service","Full Reporter",444474,111,"MB","DO",63,242,null,148,null,390,null,2006720,null,1667195,null,0,null,0,null,"No"]
["Cumberland Dauphin-Harrisburg Transit Authority","Harrisburg","PA",3014,30014,"Independent Public Agency or Authority of Transit Service","Full Reporter",444474,111,"DR","DO",27,11,null,4,null,15,null,876201,null,760013,null,0,null,0,null,"No"]
["Cumberland Dauphin-Harrisburg Transit Authority","Harrisburg","PA",3014,30014,"Independent Public Agency or Authority of Transit Service","Full Reporter",444474,111,"DR","PT",19,24,null,33,null,57,null,696142,null,605529,null,0,null,0,null,"No"]
["Cumberland Dauphin-Harrisburg Transit Authority","Harrisburg","PA",3014,30014,"Independent Public Agency or Authority of Transit Service","Full Reporter",444474,111,"MB","PT",2,0,null,0,null,0,null,39798,null,39238,null,0,null,0,null,"No"]
["Lexington Transit Authority","Lexington","KY",4017,40017,"Independent Public Agency or Authority of Transit Service","Full Reporter",290263,108,"MB","DO",54,345,null,187,null,532,null,1836763,null,1756049,null,0,null,0,null,"No"]
["Lexington Transit Authority","Lexington","KY",4017,40017,"Independent Public Agency or Authority of Transit Service","Full Reporter",290263,108,"DR","PT",42,87,null,95,null,182,null,1786261,null,1530661,null,0,null,0,null,"No"]
["Lexington Transit Authority","Lexington","KY",4017,40017,"Independent Public Agency or Authority of Transit Service","Full Reporter",290263,108,"VP","PT",12,8,null,7,null,15,null,220701,null,220701,null,0,null,0,null,"No"]
["Montebello Bus Lines","Montebello","CA",9041,90041,"City, County or Local Government Unit or Department of Transportation","Full Reporter",12150996,107,"MB","DO",62,56,null,161,null,217,null,2408192,null,2355285,null,0,null,0,null,"No"]
["Montebello Bus Lines","Montebello","CA",9041,90041,"City, County or Local Government Unit or Department of Transportation","Full Reporter",12150996,107,"MB","PT",5,0,null,0,null,0,null,65447,null,36395,null,0,null,0,null,"No"]
["Monterey-Salinas Transit","Monterey","CA",9062,90062,"Independent Public Agency or Authority of Transit Service","Full Reporter",114237,105,"MB","DO",51,226,null,43,null,269,null,2831609,null,2634513,null,0,null,0,null,"No"]
["Monterey-Salinas Transit","Monterey","CA",9062,90062,"Independent Public Agency or Authority of Transit Service","Full Reporter",114237,105,"DR","PT",30,19,null,2,null,21,null,1224023,null,1049636,null,0,null,0,null,"No"]
["Monterey-Salinas Transit","Monterey","CA",9062,90062,"Independent Public Agency or Authority of Transit Service","Full Reporter",114237,105,"MB","PT",17,25,null,3,null,28,null,1120863,null,921224,null,0,null,0,null,"No"]
["Monterey-Salinas Transit","Monterey","CA",9062,90062,"Independent Public Agency or Authority of Transit Service","Full Reporter",114237,105,"CB","DO",7,29,null,6,null,35,null,878979,null,849172,null,0,null,0,null,"No"]
["Sarasota County Area Transit","Sarasota","FL",4046,40046,"City, County or Local Government Unit or Department of Transportation","Full Reporter",643260,104,"MB","DO",49,200,null,226,null,426,null,3247457,null,3057679,null,0,null,0,null,"No"]
["San Joaquin Regional Transit District","Stockton","CA",9012,90012,"Independent Public Agency or Authority of Transit Service","Full Reporter",370583,104,"MB","DO",48,139,null,99,null,238,null,1523386,null,1352561,null,0,null,0,null,"No"]
["Sarasota County Area Transit","Sarasota","FL",4046,40046,"City, County or Local Government Unit or Department of Transportation","Full Reporter",643260,104,"DR","PT",36,0,null,0,null,0,null,1688691,null,1432607,null,0,null,0,null,"No"]
["San Joaquin Regional Transit District","Stockton","CA",9012,90012,"Independent Public Agency or Authority of Transit Service","Full Reporter",370583,104,"MB","PT",22,141,null,28,null,169,null,896552,null,749511,null,0,null,0,null,"No"]
["San Joaquin Regional Transit District","Stockton","CA",9012,90012,"Independent Public Agency or Authority of Transit Service","Full Reporter",370583,104,"CB","PT",14,24,null,5,null,29,null,750036,null,544073,null,0,null,0,null,"No"]
["Sarasota County Area Transit","Sarasota","FL",4046,40046,"City, County or Local Government Unit or Department of Transportation","Full Reporter",643260,104,"DR","DO",14,23,null,11,null,34,null,148846,null,105323,null,0,null,0,null,"No"]
["Sarasota County Area Transit","Sarasota","FL",4046,40046,"City, County or Local Government Unit or Department of Transportation","Full Reporter",643260,104,"CB","DO",5,9,null,7,null,16,null,249971,null,160233,null,0,null,0,null,"No"]
["San Joaquin Regional Transit District","Stockton","CA",9012,90012,"Independent Public Agency or Authority of Transit Service","Full Reporter",370583,104,"DR","PT",2,0,null,0,null,0,null,5964,null,3179,null,0,null,0,null,"No"]
["Worcester Regional Transit Authority","Worcester","MA",1014,10014,"Independent Public Agency or Authority of Transit Service","Full Reporter",486514,103,"MB","DO",44,146,null,771,null,917,null,2151923,null,2007155,null,0,null,0,null,"No"]
["Cobb County Department of Transportation","Marietta","GA",4078,40078,"City, County or Local Government Unit or Department of Transportation","Full Reporter",4515419,103,"MB","PT",40,183,null,17,null,200,null,2458505,null,2354049,null,0,null,0,null,"No"]
["Cobb County Department of Transportation","Marietta","GA",4078,40078,"City, County or Local Government Unit or Department of Transportation","Full Reporter",4515419,103,"CB","PT",38,119,null,12,null,131,null,1115695,null,619369,null,0,null,0,null,"No"]
["Worcester Regional Transit Authority","Worcester","MA",1014,10014,"Independent Public Agency or Authority of Transit Service","Full Reporter",486514,103,"DR","PT",38,0,null,0,null,0,null,789650,null,684245,null,0,null,0,null,"No"]
["Cobb County Department of Transportation","Marietta","GA",4078,40078,"City, County or Local Government Unit or Department of Transportation","Full Reporter",4515419,103,"DR","PT",25,48,null,71,null,119,null,614370,null,524343,null,0,null,0,null,"No"]
["Worcester Regional Transit Authority","Worcester","MA",1014,10014,"Independent Public Agency or Authority of Transit Service","Full Reporter",486514,103,"DR","DO",10,0,null,0,null,0,null,220157,null,202072,null,0,null,0,null,{"$f":"IF(OR(Z514=\"Q\",X514=\"Q\",V514=\"Q\",T514=\"Q\",R514=\"Q\",P514=\"Q\",N514=\"Q\"),\"Yes\",\"No\")","v":"No"}]
["Worcester Regional Transit Authority","Worcester","MA",1014,10014,"Independent Public Agency or Authority of Transit Service","Full Reporter",486514,103,"MB","PT",1,0,null,0,null,0,null,8635,null,8635,null,0,null,0,null,"No"]
["Suburban Transit Corporation","New Brunswick","NJ",2128,20128,"Private-For-Profit Corporation","Full Reporter",18351295,102,"CB","DO",102,75,null,299,null,374,null,5341959,null,3794644,null,0,null,0,null,"No"]
["Corpus Christi Regional Transportation Authority","Corpus Christi","TX",6051,60051,"Independent Public Agency or Authority of Transit Service","Full Reporter",320069,102,"MB","DO",58,220,null,152,null,372,null,3607860,null,3143541,"W",0,null,0,null,"No"]
["Corpus Christi Regional Transportation Authority","Corpus Christi","TX",6051,60051,"Independent Public Agency or Authority of Transit Service","Full Reporter",320069,102,"DR","PT",27,47,null,27,null,74,null,1569323,null,1341791,null,0,null,0,null,"No"]
["Corpus Christi Regional Transportation Authority","Corpus Christi","TX",6051,60051,"Independent Public Agency or Authority of Transit Service","Full Reporter",320069,102,"MB","PT",9,20,null,12,null,32,null,478360,null,402962,null,0,null,0,null,"No"]
["Corpus Christi Regional Transportation Authority","Corpus Christi","TX",6051,60051,"Independent Public Agency or Authority of Transit Service","Full Reporter",320069,102,"VP","PT",7,0,null,0,null,0,null,184532,null,184532,null,0,null,0,null,"No"]
["Corpus Christi Regional Transportation Authority","Corpus Christi","TX",6051,60051,"Independent Public Agency or Authority of Transit Service","Full Reporter",320069,102,"DR","DO",1,9,null,5,null,14,null,65735,null,59356,null,0,null,0,null,"No"]
["Georgia Regional Transportation Authority","Atlanta","GA",4135,40135,"State Government Unit or Department of Transportation","Full Reporter",4515419,101,"CB","PT",101,161,null,33,null,194,null,4724852,null,2640033,null,0,null,0,null,"No"]
["Whatcom Transportation Authority","Bellingham","WA",21,21,"Independent Public Agency or Authority of Transit Service","Full Reporter",114473,101,"MB","DO",44,124,null,51,null,175,null,1980857,null,1831845,null,0,null,0,null,"No"]
["Whatcom Transportation Authority","Bellingham","WA",21,21,"Independent Public Agency or Authority of Transit Service","Full Reporter",114473,101,"DR","DO",30,21,null,0,null,21,null,963627,null,853744,null,0,null,0,null,"No"]
["Whatcom Transportation Authority","Bellingham","WA",21,21,"Independent Public Agency or Authority of Transit Service","Full Reporter",114473,101,"VP","DO",25,2,null,0,null,2,null,443551,null,443551,null,0,null,0,null,"No"]
["Birmingham-Jefferson County Transit Authority","Birmingham","AL",4042,40042,"Independent Public Agency or Authority of Transit Service","Full Reporter",749495,100,"MB","DO",70,1136,null,950,null,2086,null,3154906,null,2924371,null,0,null,0,null,"No"]
["Birmingham-Jefferson County Transit Authority","Birmingham","AL",4042,40042,"Independent Public Agency or Authority of Transit Service","Full Reporter",749495,100,"DR","DO",30,189,null,113,null,302,null,1139326,null,969171,null,0,null,0,null,"No"]
["City of Alexandria","Alexandria","VA",3071,30071,"City, County or Local Government Unit or Department of Transportation","Full Reporter",4586770,99,"MB","DO",66,96,null,32,null,128,null,1915181,null,1741100,null,0,null,0,null,"No"]
["Connecticut Department of Transportation - CTTRANSIT New Haven Division","Hartford","CT",1055,10055,"State Government Unit or Department of Transportation","Full Reporter",562839,98,"MB","DO",98,375,null,1709,null,2084,null,4134254,null,3739479,null,0,null,0,null,"No"]
["Lee County Transit","Fort Myers","FL",4028,40028,"City, County or Local Government Unit or Department of Transportation","Full Reporter",530290,98,"MB","DO",48,92,null,34,null,126,null,3149106,null,2940880,null,0,null,0,null,"No"]
["Lee County Transit","Fort Myers","FL",4028,40028,"City, County or Local Government Unit or Department of Transportation","Full Reporter",530290,98,"DR","DO",38,30,null,5,null,35,null,1571231,null,1357281,null,0,null,0,null,"No"]
["Lee County Transit","Fort Myers","FL",4028,40028,"City, County or Local Government Unit or Department of Transportation","Full Reporter",530290,98,"VP","PT",12,2,null,0,null,2,null,217715,null,217715,null,0,null,0,null,"No"]
["Virginia Railway Express","Alexandria","VA",3073,30073,"Independent Public Agency or Authority of Transit Service","Full Reporter",4586770,97,"CR","PT",97,1,null,0,null,1,null,2558186,null,2289083,null,391152,null,352876,null,"No"]
["Charleston Area Regional Transportation Authority","Charleston","SC",4110,40110,"Independent Public Agency or Authority of Transit Service","Full Reporter",548404,97,"MB","PT",70,123,null,26,null,149,null,2683187,null,2529215,null,0,null,0,null,"No"]
["Berks Area Regional Transportation Authority","Reading","PA",3024,30024,"Independent Public Agency or Authority of Transit Service","Full Reporter",266254,97,"MB","DO",44,224,null,369,null,593,null,1566326,null,1521108,null,0,null,0,null,"No"]
["Berks Area Regional Transportation Authority","Reading","PA",3024,30024,"Independent Public Agency or Authority of Transit Service","Full Reporter",266254,97,"DR","DO",34,36,null,60,null,96,null,975401,null,757414,null,0,null,0,null,"No"]
["Charleston Area Regional Transportation Authority","Charleston","SC",4110,40110,"Independent Public Agency or Authority of Transit Service","Full Reporter",548404,97,"DR","PT",20,24,null,3,null,27,null,629689,null,550229,null,0,null,0,null,"No"]
["Berks Area Regional Transportation Authority","Reading","PA",3024,30024,"Independent Public Agency or Authority of Transit Service","Full Reporter",266254,97,"DR","PT",19,0,null,5,null,5,null,529226,null,418747,null,0,null,0,null,"No"]
["Charleston Area Regional Transportation Authority","Charleston","SC",4110,40110,"Independent Public Agency or Authority of Transit Service","Full Reporter",548404,97,"CB","PT",7,10,null,1,null,11,null,251923,null,191747,null,0,null,0,null,"No"]
["Chapel Hill Transit","Chapel Hill","NC",4051,40051,"City, County or Local Government Unit or Department of Transportation","Full Reporter",347602,96,"MB","DO",81,150,null,137,null,287,null,1985191,null,1790266,null,0,null,0,null,"No"]
["Red Rose Transit Authority","Lancaster","PA",3018,30018,"Independent Public Agency or Authority of Transit Service","Full Reporter",402004,96,"DR","PT",62,9,null,117,null,126,null,2546933,null,2025700,null,0,null,0,null,"No"]
["Red Rose Transit Authority","Lancaster","PA",3018,30018,"Independent Public Agency or Authority of Transit Service","Full Reporter",402004,96,"MB","DO",34,266,null,158,null,424,null,1631206,null,1568042,null,0,null,0,null,"No"]
["Chapel Hill Transit","Chapel Hill","NC",4051,40051,"City, County or Local Government Unit or Department of Transportation","Full Reporter",347602,96,"DR","DO",15,6,null,8,null,14,null,338901,null,286078,null,0,null,0,null,"No"]
["Laketran","Grand River","OH",5117,50117,"Independent Public Agency or Authority of Transit Service","Full Reporter",1780673,95,"DR","DO",72,113,null,11,null,124,null,2565398,null,2322111,null,0,null,0,null,"No"]
["Westmoreland County Transit Authority","Greensburg","PA",3044,30044,"City, County or Local Government Unit or Department of Transportation","Full Reporter",1733853,95,"MB","PT",31,10,null,106,null,116,null,1435016,null,935469,null,0,null,0,null,"No"]
["Laketran","Grand River","OH",5117,50117,"Independent Public Agency or Authority of Transit Service","Full Reporter",1780673,95,"CB","DO",13,23,null,3,null,26,null,554278,null,301785,null,0,null,0,null,"No"]
["Laketran","Grand River","OH",5117,50117,"Independent Public Agency or Authority of Transit Service","Full Reporter",1780673,95,"MB","DO",10,73,null,32,null,105,null,610306,null,554863,null,0,null,0,null,"No"]
["Metropolitan Tulsa Transit Authority","Tulsa","OK",6018,60018,"City, County or Local Government Unit or Department of Transportation","Full Reporter",655479,93,"MB","DO",53,214,null,107,null,321,null,2797435,null,2703054,null,0,null,0,null,"No"]
["Metropolitan Tulsa Transit Authority","Tulsa","OK",6018,60018,"City, County or Local Government Unit or Department of Transportation","Full Reporter",655479,93,"DR","PT",33,54,null,0,null,54,null,1216553,null,1030708,null,0,null,0,null,"No"]
["Metropolitan Tulsa Transit Authority","Tulsa","OK",6018,60018,"City, County or Local Government Unit or Department of Transportation","Full Reporter",655479,93,"MB","PT",7,27,null,0,null,27,null,148714,null,132995,null,0,null,0,null,"No"]
["Loudoun County Commuter Bus Service - Office of Transportation Services","Leesburg","VA",3081,30081,"City, County or Local Government Unit or Department of Transportation","Full Reporter",4586770,92,"CB","PT",55,85,null,57,null,142,null,2608822,null,1369059,null,0,null,0,null,"No"]
["Norwalk Transit District","Norwalk","CT",1057,10057,"Independent Public Agency or Authority of Transit Service","Full Reporter",923311,92,"MB","DO",44,114,null,220,null,334,null,1177511,null,1037989,null,0,null,0,null,"No"]
["Loudoun County Commuter Bus Service - Office of Transportation Services","Leesburg","VA",3081,30081,"City, County or Local Government Unit or Department of Transportation","Full Reporter",4586770,92,"MB","PT",37,17,null,26,null,43,null,1840213,null,1638149,null,0,null,0,null,"No"]
["Norwalk Transit District","Norwalk","CT",1057,10057,"Independent Public Agency or Authority of Transit Service","Full Reporter",923311,92,"DR","PT",24,9,null,10,null,19,null,383352,null,320135,null,0,null,0,null,"No"]
["Norwalk Transit District","Norwalk","CT",1057,10057,"Independent Public Agency or Authority of Transit Service","Full Reporter",923311,92,"DR","DO",20,18,null,16,null,34,null,316854,null,224706,null,0,null,0,null,"No"]
["Norwalk Transit District","Norwalk","CT",1057,10057,"Independent Public Agency or Authority of Transit Service","Full Reporter",923311,92,"MB","PT",4,8,null,8,null,16,null,39448,null,30329,null,0,null,0,null,"No"]
["Massachusetts Department of Transportation","Boston","MA",1129,10129,"State Government Unit or Department of Transportation","Full Reporter",4181019,91,"VP","PT",91,0,null,0,null,0,null,1711788,null,1711788,null,0,null,0,null,"No"]
["Durham Area Transit Authority","Durham","NC",4087,40087,"City, County or Local Government Unit or Department of Transportation","Full Reporter",347602,91,"DR","PT",46,31,null,22,null,53,null,1923450,null,1718295,null,0,null,0,null,"No"]
["Durham Area Transit Authority","Durham","NC",4087,40087,"City, County or Local Government Unit or Department of Transportation","Full Reporter",347602,91,"MB","PT",45,204,null,36,null,240,null,2922906,"W",2633875,null,0,null,0,null,"No"]
["Tampa Bay Area Regional Transportation Authority","Tampa","FL",4200,40200,"Independent Public Agency or Authority of Transit Service","Full Reporter",2441770,90,"VP","PT",90,6,null,0,null,6,null,1355424,null,1355424,null,0,null,0,null,"No"]
["Skagit Transit","Burlington","WA",44,44,"Independent Public Agency or Authority of Transit Service","Full Reporter",62966,90,"VP","DO",50,1,null,14,null,15,null,1037565,null,1037565,null,0,null,0,null,"No"]
["Santa Clarita Transit","Santa Clarita","CA",9171,90171,"City, County or Local Government Unit or Department of Transportation","Full Reporter",258653,90,"MB","PT",44,94,null,191,null,285,null,2208834,null,1986803,null,0,null,0,null,"No"]
["Santa Clarita Transit","Santa Clarita","CA",9171,90171,"City, County or Local Government Unit or Department of Transportation","Full Reporter",258653,90,"CB","PT",24,63,null,55,null,118,null,1148228,null,941135,null,0,null,0,null,"No"]
["Santa Clarita Transit","Santa Clarita","CA",9171,90171,"City, County or Local Government Unit or Department of Transportation","Full Reporter",258653,90,"DR","PT",22,33,null,9,null,42,null,782237,null,633526,null,0,null,0,null,"No"]
["Skagit Transit","Burlington","WA",44,44,"Independent Public Agency or Authority of Transit Service","Full Reporter",62966,90,"DR","DO",20,4,null,1,null,5,null,394086,null,332791,null,0,null,0,null,"No"]
["Skagit Transit","Burlington","WA",44,44,"Independent Public Agency or Authority of Transit Service","Full Reporter",62966,90,"MB","DO",15,13,null,3,null,16,null,918417,null,858232,null,0,null,0,null,"No"]
["Skagit Transit","Burlington","WA",44,44,"Independent Public Agency or Authority of Transit Service","Full Reporter",62966,90,"CB","DO",5,4,null,1,null,5,null,359589,null,333546,null,0,null,0,null,"No"]
["City Transit Management Company, Inc.","Lubbock","TX",6010,60010,"City, County or Local Government Unit or Department of Transportation","Full Reporter",237356,89,"MB","DO",60,238,null,136,null,374,null,1792023,null,1784801,null,0,null,0,null,"No"]
["City Transit Management Company, Inc.","Lubbock","TX",6010,60010,"City, County or Local Government Unit or Department of Transportation","Full Reporter",237356,89,"DR","DO",29,38,null,69,null,107,null,652881,null,587973,null,0,null,0,null,"No"]
["Pasco County Public Transportation","Port Richey","FL",4074,40074,"City, County or Local Government Unit or Department of Transportation","Full Reporter",2441770,89,"MB","DO",21,85,null,49,null,134,null,1655824,null,1448911,null,0,null,0,null,"No"]
["Pasco County Public Transportation","Port Richey","FL",4074,40074,"City, County or Local Government Unit or Department of Transportation","Full Reporter",2441770,89,"DR","DO",11,3,null,2,null,5,null,190660,null,156991,null,0,null,0,null,"No"]
["Middlesex County Area Transit","New Brunswick","NJ",2196,20196,"City, County or Local Government Unit or Department of Transportation","Full Reporter",18351295,88,"DR","DO",75,7,null,22,null,29,null,642908,null,537630,null,0,null,0,null,"No"]
["SunLine Transit Agency","Thousand Palms","CA",9079,90079,"Independent Public Agency or Authority of Transit Service","Full Reporter",345580,88,"MB","DO",57,258,null,4,null,262,null,3644250,null,3274830,null,0,null,0,null,"No"]
["SunLine Transit Agency","Thousand Palms","CA",9079,90079,"Independent Public Agency or Authority of Transit Service","Full Reporter",345580,88,"DR","DO",31,72,null,34,null,106,null,1179761,null,1087619,null,0,null,0,null,"No"]
["Johnson County Kansas, aka: Johnson County Transit","Olathe","KS",7035,70035,"City, County or Local Government Unit or Department of Transportation","Full Reporter",1519417,88,"MB","PT",22,48,null,19,null,67,null,1354165,null,946734,null,0,null,0,null,"No"]
["Johnson County Kansas, aka: Johnson County Transit","Olathe","KS",7035,70035,"City, County or Local Government Unit or Department of Transportation","Full Reporter",1519417,88,"CB","PT",21,23,null,12,null,35,null,478942,null,338207,null,0,null,0,null,"No"]
["Johnson County Kansas, aka: Johnson County Transit","Olathe","KS",7035,70035,"City, County or Local Government Unit or Department of Transportation","Full Reporter",1519417,88,"DR","PT",20,8,null,2,null,10,null,489486,null,330307,null,0,null,0,null,"No"]
["Middlesex County Area Transit","New Brunswick","NJ",2196,20196,"City, County or Local Government Unit or Department of Transportation","Full Reporter",18351295,88,"MB","DO",13,8,null,13,null,21,null,596131,null,500749,null,0,null,0,null,{"$f":"IF(OR(Z578=\"Q\",X578=\"Q\",V578=\"Q\",T578=\"Q\",R578=\"Q\",P578=\"Q\",N578=\"Q\"),\"Yes\",\"No\")","v":"No"}]
["Santa Barbara Metropolitan Transit District","Santa Barbara","CA",9020,90020,"Independent Public Agency or Authority of Transit Service","Full Reporter",195861,87,"MB","DO",87,411,null,216,null,627,null,2932800,null,2554467,null,0,null,0,null,"No"]
["Rio Metro Regional Transit District","Albuquerque","NM",6111,60111,"Independent Public Agency or Authority of Transit Service","Full Reporter",741318,87,"CR","PT",25,20,null,2,null,22,null,1431074,null,1406934,null,529477,null,520766,null,"No"]
["Rio Metro Regional Transit District","Albuquerque","NM",6111,60111,"Independent Public Agency or Authority of Transit Service","Full Reporter",741318,87,"DR","DO",22,0,null,7,null,7,null,447109,null,371683,null,0,null,0,null,"No"]
["Rio Metro Regional Transit District","Albuquerque","NM",6111,60111,"Independent Public Agency or Authority of Transit Service","Full Reporter",741318,87,"CB","PT",5,0,null,0,null,0,null,360727,null,265419,null,0,null,0,null,"No"]
["Rio Metro Regional Transit District","Albuquerque","NM",6111,60111,"Independent Public Agency or Authority of Transit Service","Full Reporter",741318,87,"MB","DO",2,0,null,0,null,0,null,31777,null,22610,null,0,null,0,null,"No"]
["Rio Metro Regional Transit District","Albuquerque","NM",6111,60111,"Independent Public Agency or Authority of Transit Service","Full Reporter",741318,87,"CB","DO",2,0,null,0,null,0,null,51758,null,45900,null,0,null,0,null,"No"]
["City of Tallahassee","Tallahassee","FL",4036,40036,"City, County or Local Government Unit or Department of Transportation","Full Reporter",240223,86,"MB","DO",68,12,null,158,null,170,null,2237851,null,2169975,null,0,null,0,null,"No"]
["Brockton Area Transit Authority","Brockton","MA",1004,10004,"Independent Public Agency or Authority of Transit Service","Full Reporter",4181019,86,"DR","PT",43,22,null,141,null,163,null,820800,null,745294,null,0,null,0,null,"No"]
["Brockton Area Transit Authority","Brockton","MA",1004,10004,"Independent Public Agency or Authority of Transit Service","Full Reporter",4181019,86,"MB","PT",43,56,null,475,null,531,null,1359736,null,1311921,null,0,null,0,null,"No"]
["City of Tallahassee","Tallahassee","FL",4036,40036,"City, County or Local Government Unit or Department of Transportation","Full Reporter",240223,86,"DR","DO",18,11,null,78,null,89,null,662246,null,589821,null,0,null,0,null,"No"]
["Arlington Transit - Arlington County","Arlington","VA",3080,30080,"City, County or Local Government Unit or Department of Transportation","Full Reporter",4586770,85,"MB","PT",46,47,null,0,null,47,null,1749505,null,1584434,null,0,null,0,null,"No"]
["Arlington Transit - Arlington County","Arlington","VA",3080,30080,"City, County or Local Government Unit or Department of Transportation","Full Reporter",4586770,85,"DR","PT",14,9,null,0,null,9,null,329652,null,235784,"W",0,null,0,null,"No"]
["Ames Transit Agency dba CyRide","Ames","IA",7041,70041,"City, County or Local Government Unit or Department of Transportation","Full Reporter",60438,84,"MB","DO",77,43,null,174,null,217,null,1425542,null,1327377,null,0,null,0,null,"No"]
["Torrance Transit System","Torrance","CA",9010,90010,"City, County or Local Government Unit or Department of Transportation","Full Reporter",12150996,84,"MB","DO",48,170,null,349,null,519,null,2021089,null,1967693,null,0,null,0,null,"No"]
["Ames Transit Agency dba CyRide","Ames","IA",7041,70041,"City, County or Local Government Unit or Department of Transportation","Full Reporter",60438,84,"MB","PT",4,0,null,0,null,0,null,679,null,629,null,0,null,0,null,"No"]
["Ames Transit Agency dba CyRide","Ames","IA",7041,70041,"City, County or Local Government Unit or Department of Transportation","Full Reporter",60438,84,"DR","PT",3,0,null,0,null,0,null,43499,null,39876,null,0,null,0,null,"No"]
["MetroWest Regional Transit Authority","Framingham","MA",1118,10118,"Independent Public Agency or Authority of Transit Service","Full Reporter",4181019,83,"DR","PT",51,19,null,24,null,43,null,954016,null,881230,null,0,null,0,null,"No"]
["Greensboro Transit Authority","Greensboro","NC",4093,40093,"City, County or Local Government Unit or Department of Transportation","Full Reporter",311810,83,"DR","PT",42,101,null,99,null,200,null,1876426,null,1762405,null,0,null,0,null,"No"]
["Greensboro Transit Authority","Greensboro","NC",4093,40093,"City, County or Local Government Unit or Department of Transportation","Full Reporter",311810,83,"MB","PT",41,86,null,116,null,202,null,2169128,null,2096894,null,0,null,0,null,"No"]
["MetroWest Regional Transit Authority","Framingham","MA",1118,10118,"Independent Public Agency or Authority of Transit Service","Full Reporter",4181019,83,"MB","PT",32,18,null,35,null,53,null,1017250,null,1017250,null,0,null,0,null,"No"]
["The Greater New Haven Transit District","Hamden","CT",1049,10049,"Independent Public Agency or Authority of Transit Service","Full Reporter",562839,82,"DR","DO",80,120,null,597,null,717,null,2407958,null,2124053,null,0,null,0,null,"No"]
["Golden Empire Transit District","Bakersfield","CA",9004,90004,"Independent Public Agency or Authority of Transit Service","Full Reporter",523994,82,"MB","DO",66,331,null,85,null,416,null,4100914,null,3848798,null,0,null,0,null,"No"]
["Marin County Transit District","San Rafael","CA",9234,90234,"Independent Public Agency or Authority of Transit Service","Full Reporter",3281212,82,"MB","PT",55,62,null,60,null,122,null,2513002,null,2166258,null,0,null,0,null,"No"]
["Greater Peoria Mass Transit District","Peoria","IL",5056,50056,"Independent Public Agency or Authority of Transit Service","Full Reporter",266921,82,"MB","DO",45,612,null,305,null,917,null,2216017,null,2030607,null,0,null,0,null,"No"]
["Greater Peoria Mass Transit District","Peoria","IL",5056,50056,"Independent Public Agency or Authority of Transit Service","Full Reporter",266921,82,"DR","PT",37,703,null,125,null,828,null,1152496,null,985341,null,0,null,0,null,"No"]
["Marin County Transit District","San Rafael","CA",9234,90234,"Independent Public Agency or Authority of Transit Service","Full Reporter",3281212,82,"DR","PT",27,5,null,1,null,6,null,765730,null,688072,null,0,null,0,null,"No"]
["Golden Empire Transit District","Bakersfield","CA",9004,90004,"Independent Public Agency or Authority of Transit Service","Full Reporter",523994,82,"DR","DO",16,6,null,1,null,7,null,554796,null,481389,null,0,null,0,null,"No"]
["The Greater New Haven Transit District","Hamden","CT",1049,10049,"Independent Public Agency or Authority of Transit Service","Full Reporter",562839,82,"MB","DO",2,0,null,0,null,0,null,12133,null,10026,null,0,null,0,null,"No"]
["Hampton Jitney, Inc.","Southampton","NY",2217,20217,"Private-For-Profit Corporation","Full Reporter",18351295,80,"CB","DO",80,76,null,36,null,112,null,3335239,null,2921344,null,0,null,0,null,"No"]
["Chattanooga Area Regional Transportation Authority","Chattanooga","TN",4001,40001,"City, County or Local Government Unit or Department of Transportation","Full Reporter",381112,80,"MB","DO",60,207,null,128,null,335,null,2367614,null,2310415,null,0,null,0,null,"No"]
["Piedmont Authority for Regional Transportation","Greensboro","NC",4173,40173,"Independent Public Agency or Authority of Transit Service","Full Reporter",311810,80,"VP","DO",54,6,null,16,null,22,null,1341833,null,1341833,null,0,null,0,null,"No"]
["Chatham Area Transit Authority","Savannah","GA",4025,40025,"Independent Public Agency or Authority of Transit Service","Full Reporter",260677,80,"MB","DO",52,242,null,58,null,300,null,2526887,null,2376094,null,0,null,0,null,"No"]
["Piedmont Authority for Regional Transportation","Greensboro","NC",4173,40173,"Independent Public Agency or Authority of Transit Service","Full Reporter",311810,80,"CB","PT",26,20,null,26,null,46,null,1240725,null,949621,null,0,null,0,null,"No"]
["Chatham Area Transit Authority","Savannah","GA",4025,40025,"Independent Public Agency or Authority of Transit Service","Full Reporter",260677,80,"DR","DO",20,12,null,26,null,38,null,754488,null,664781,null,0,null,0,null,"No"]
["Chattanooga Area Regional Transportation Authority","Chattanooga","TN",4001,40001,"City, County or Local Government Unit or Department of Transportation","Full Reporter",381112,80,"DR","DO",15,37,null,8,null,45,null,474560,null,396632,null,0,null,0,null,"No"]
["Chatham Area Transit Authority","Savannah","GA",4025,40025,"Independent Public Agency or Authority of Transit Service","Full Reporter",260677,80,"DR","PT",6,0,null,0,null,0,null,249676,null,233007,null,0,null,0,null,"No"]
["Chattanooga Area Regional Transportation Authority","Chattanooga","TN",4001,40001,"City, County or Local Government Unit or Department of Transportation","Full Reporter",381112,80,"DR","PT",3,0,null,0,null,0,null,24178,null,11912,null,0,null,0,null,"No"]
["Chatham Area Transit Authority","Savannah","GA",4025,40025,"Independent Public Agency or Authority of Transit Service","Full Reporter",260677,80,"FB","DO",2,5,null,8,null,13,null,15661,null,15661,null,0,null,0,null,"No"]
["Chattanooga Area Regional Transportation Authority","Chattanooga","TN",4001,40001,"City, County or Local Government Unit or Department of Transportation","Full Reporter",381112,80,"IP","DO",2,1,null,0,null,1,null,18121,null,18121,null,18121,null,18121,null,"No"]
["Kentuckiana Regional Planning and Development Agency","Louisville","KY",4196,40196,"MPO, COG or Other Planning Agency","Full Reporter",972546,79,"VP","DO",79,8,null,107,null,115,null,1351562,null,1351562,null,0,null,0,null,"No"]
["County of Maui - Dept. of Transportation","Wailuku","HI",9241,90241,"City, County or Local Government Unit or Department of Transportation","Full Reporter",55934,79,"DR","PT",56,1,null,22,null,23,null,1579406,null,1448671,null,0,null,0,null,"No"]
["County of Maui - Dept. of Transportation","Wailuku","HI",9241,90241,"City, County or Local Government Unit or Department of Transportation","Full Reporter",55934,79,"MB","PT",16,4,null,97,null,101,null,1396047,null,1342591,null,0,null,0,null,"No"]
["County of Maui - Dept. of Transportation","Wailuku","HI",9241,90241,"City, County or Local Government Unit or Department of Transportation","Full Reporter",55934,79,"CB","PT",7,0,null,1,null,1,null,297978,null,164003,null,0,null,0,null,"No"]
["Audubon Area Community Services, Inc.","Owensboro","KY","4R04-020",41105,"Private-Non-Profit Corporation","Full Reporter",70543,78,"DR","DO",78,50,null,1068,null,1118,null,2086562,null,2086562,"W",0,null,0,null,"No"]
["Port Authority Transit Corporation","Lindenwold","NJ",2075,20075,"Independent Public Agency or Authority of Transit Service","Full Reporter",5441567,78,"HR","DO",78,215,null,224,null,439,null,4624997,null,4456176,null,985817,null,959547,null,"No"]
["Capital Area Transit System","Baton Rouge","LA",6022,60022,"Independent Public Agency or Authority of Transit Service","Full Reporter",594309,78,"MB","DO",60,622,null,255,null,877,null,3379800,null,3187782,null,0,null,0,null,"No"]
["Knoxville Area Transit","Knoxville","TN",4002,40002,"City, County or Local Government Unit or Department of Transportation","Full Reporter",558696,78,"MB","DO",59,197,null,21,null,218,null,2757233,null,2564899,null,0,null,0,null,"No"]
["StarTran","Lincoln","NE",7001,70001,"City, County or Local Government Unit or Department of Transportation","Full Reporter",258719,78,"MB","DO",56,193,null,170,null,363,null,1681848,null,1602090,null,0,null,0,null,"No"]
["Lowell Regional Transit Authority","Lowell","MA",1005,10005,"Independent Public Agency or Authority of Transit Service","Full Reporter",4181019,78,"MB","PT",42,12,null,0,null,12,null,1392674,null,1338395,null,0,null,0,null,"No"]
["Knoxville Area Transit","Knoxville","TN",4002,40002,"City, County or Local Government Unit or Department of Transportation","Full Reporter",558696,78,"DR","DO",19,32,null,3,null,35,null,455977,null,290266,null,0,null,0,null,"No"]
["Capital Area Transit System","Baton Rouge","LA",6022,60022,"Independent Public Agency or Authority of Transit Service","Full Reporter",594309,78,"DR","PT",18,13,null,2,null,15,null,797032,null,729536,null,0,null,0,null,"No"]
["Lowell Regional Transit Authority","Lowell","MA",1005,10005,"Independent Public Agency or Authority of Transit Service","Full Reporter",4181019,78,"DR","DO",18,3,null,6,null,9,null,240451,null,210857,null,0,null,0,null,"No"]
["Lowell Regional Transit Authority","Lowell","MA",1005,10005,"Independent Public Agency or Authority of Transit Service","Full Reporter",4181019,78,"DR","PT",18,4,null,4,null,8,null,450564,null,425211,null,0,null,0,null,"No"]
["StarTran","Lincoln","NE",7001,70001,"City, County or Local Government Unit or Department of Transportation","Full Reporter",258719,78,"DR","DO",9,10,null,5,null,15,null,274092,null,237677,null,0,null,0,null,"No"]
["Central Oklahoma Transportation and Parking Authority","Oklahoma City","OK",6017,60017,"City, County or Local Government Unit or Department of Transportation","Full Reporter",861505,77,"MB","DO",48,156,null,47,null,203,null,2848830,null,2826932,null,0,null,0,null,"No"]
["Luzerne County Transportation Authority","Kingston","PA",3015,30015,"Independent Public Agency or Authority of Transit Service","Full Reporter",381502,77,"DR","DO",45,24,null,5,null,29,null,1130299,null,944581,null,0,null,0,null,"No"]
["Luzerne County Transportation Authority","Kingston","PA",3015,30015,"Independent Public Agency or Authority of Transit Service","Full Reporter",381502,77,"MB","DO",32,229,null,217,null,446,null,1156636,null,1120077,null,0,null,0,null,"No"]
["Central Oklahoma Transportation and Parking Authority","Oklahoma City","OK",6017,60017,"City, County or Local Government Unit or Department of Transportation","Full Reporter",861505,77,"DR","DO",17,0,null,0,null,0,null,601725,null,513161,null,0,null,0,null,"No"]
["Central Oklahoma Transportation and Parking Authority","Oklahoma City","OK",6017,60017,"City, County or Local Government Unit or Department of Transportation","Full Reporter",861505,77,"MB","PT",4,0,null,0,null,0,null,146310,null,128262,null,0,null,0,null,"No"]
["Central Oklahoma Transportation and Parking Authority","Oklahoma City","OK",6017,60017,"City, County or Local Government Unit or Department of Transportation","Full Reporter",861505,77,"FB","PT",2,0,null,0,null,0,null,4683,null,4683,null,0,null,0,null,"No"]
["Rockland Coaches, Inc.","Westwood","NJ",2149,20149,"Private-For-Profit Corporation","Full Reporter",18351295,75,"CB","DO",75,21,null,431,null,452,null,3933379,null,3158619,null,0,null,0,null,"No"]
["Brazos Transit District","Bryan","TX",6059,60059,"Independent Public Agency or Authority of Transit Service","Full Reporter",171345,75,"DR","DO",48,20,null,23,null,43,null,1523725,null,1145734,null,0,null,0,null,"No"]
["Antelope Valley Transit Authority","Lancaster","CA",9121,90121,"Independent Public Agency or Authority of Transit Service","Full Reporter",341219,75,"MB","PT",37,138,null,83,null,221,null,2474234,null,2151325,null,0,null,0,null,"No"]
["Brazos Transit District","Bryan","TX",6059,60059,"Independent Public Agency or Authority of Transit Service","Full Reporter",171345,75,"MB","DO",27,16,null,61,null,77,null,817913,null,794107,null,0,null,0,null,{"$f":"IF(OR(Z642=\"Q\",X642=\"Q\",V642=\"Q\",T642=\"Q\",R642=\"Q\",P642=\"Q\",N642=\"Q\"),\"Yes\",\"No\")","v":"No"}]
["Antelope Valley Transit Authority","Lancaster","CA",9121,90121,"Independent Public Agency or Authority of Transit Service","Full Reporter",341219,75,"CB","PT",26,21,null,7,null,28,null,1349546,null,931604,null,0,null,0,null,"No"]
["Antelope Valley Transit Authority","Lancaster","CA",9121,90121,"Independent Public Agency or Authority of Transit Service","Full Reporter",341219,75,"DR","PT",12,0,null,0,null,0,null,600226,null,374725,null,0,null,0,null,"No"]
["Port Imperial Ferry Corporation dba NY Waterway","Weehawken","NJ",2190,20190,"Private-For-Profit Corporation","Full Reporter",18351295,74,"MB","DO",62,0,null,0,null,0,null,648691,null,618925,null,0,null,0,null,"No"]
["City of Appleton - Valley Transit","Appleton","WI",5001,50001,"City, County or Local Government Unit or Department of Transportation","Full Reporter",216154,74,"DR","PT",43,8,null,17,null,25,null,925690,null,829191,null,0,null,0,null,"No"]
["Chittenden County Transportation Authority","Burlington","VT",1066,10066,"Independent Public Agency or Authority of Transit Service","Full Reporter",108740,74,"MB","DO",40,82,null,98,null,180,null,1227435,null,1107537,null,0,null,0,null,"No"]
["City of Appleton - Valley Transit","Appleton","WI",5001,50001,"City, County or Local Government Unit or Department of Transportation","Full Reporter",216154,74,"MB","DO",21,36,null,124,null,160,null,938269,null,902746,null,0,null,0,null,"No"]
["Chittenden County Transportation Authority","Burlington","VT",1066,10066,"Independent Public Agency or Authority of Transit Service","Full Reporter",108740,74,"DR","PT",20,8,null,1,null,9,null,393272,null,331466,null,0,null,0,null,"No"]
["Chittenden County Transportation Authority","Burlington","VT",1066,10066,"Independent Public Agency or Authority of Transit Service","Full Reporter",108740,74,"CB","DO",14,16,null,10,null,26,null,584451,null,527629,null,0,null,0,null,"No"]
["Port Imperial Ferry Corporation dba NY Waterway","Weehawken","NJ",2190,20190,"Private-For-Profit Corporation","Full Reporter",18351295,74,"FB","DO",12,0,null,0,null,0,null,447321,null,430930,null,0,null,0,null,"No"]
["City of Appleton - Valley Transit","Appleton","WI",5001,50001,"City, County or Local Government Unit or Department of Transportation","Full Reporter",216154,74,"MB","PT",10,2,null,3,null,5,null,263527,null,159922,null,0,null,0,null,"No"]
["The Eastern Contra Costa Transit Authority","Antioch","CA",9162,90162,"Independent Public Agency or Authority of Transit Service","Full Reporter",277634,73,"MB","PT",52,88,null,38,null,126,null,2399133,null,2054318,null,0,null,0,null,"No"]
["Southeastern Regional Transit Authority","New Bedford","MA",1006,10006,"Independent Public Agency or Authority of Transit Service","Full Reporter",149443,73,"MB","PT",51,29,null,335,null,364,null,1619887,null,1540177,null,0,null,0,null,"No"]
["Southeastern Regional Transit Authority","New Bedford","MA",1006,10006,"Independent Public Agency or Authority of Transit Service","Full Reporter",149443,73,"DR","PT",22,1,null,7,null,8,null,494313,null,435834,null,0,null,0,null,"No"]
["The Eastern Contra Costa Transit Authority","Antioch","CA",9162,90162,"Independent Public Agency or Authority of Transit Service","Full Reporter",277634,73,"DR","PT",21,5,null,1,null,6,null,932338,null,775428,null,0,null,0,null,"No"]
["Ms Coast Transportation Authority","Gulfport","MS",4014,40014,"Independent Public Agency or Authority of Transit Service","Full Reporter",208948,72,"VP","PT",40,1,null,0,null,1,null,911741,null,911741,null,0,null,0,null,"No"]
["Ms Coast Transportation Authority","Gulfport","MS",4014,40014,"Independent Public Agency or Authority of Transit Service","Full Reporter",208948,72,"MB","DO",17,211,null,137,null,348,null,949052,null,879722,null,0,null,0,null,"No"]
["Ms Coast Transportation Authority","Gulfport","MS",4014,40014,"Independent Public Agency or Authority of Transit Service","Full Reporter",208948,72,"DR","DO",15,23,null,4,null,27,null,327096,null,266300,null,0,null,0,null,"No"]
["STAR Transit","Terrell","TX",6114,60114,"City, County or Local Government Unit or Department of Transportation","Full Reporter",5121892,71,"DR","DO",66,63,null,170,null,233,null,1794920,null,1636037,null,0,null,0,null,"No"]
["Transport of Rockland","Pomona","NY",2084,20084,"City, County or Local Government Unit or Department of Transportation","Full Reporter",18351295,71,"MB","PT",52,156,null,314,null,470,null,2867875,null,2454768,null,0,null,0,null,"No"]
["Central Arkansas Transit Authority","North Little Rock","AR",6033,60033,"Independent Public Agency or Authority of Transit Service","Full Reporter",431388,71,"MB","DO",49,95,null,179,null,274,null,2605905,null,2446815,null,0,null,0,null,"No"]
["Gwinnett County Board of Commissioners","Lawrenceville","GA",4138,40138,"City, County or Local Government Unit or Department of Transportation","Full Reporter",4515419,71,"CB","PT",37,8,null,3,null,11,null,1287667,null,826823,null,0,null,0,null,"No"]
["Gwinnett County Board of Commissioners","Lawrenceville","GA",4138,40138,"City, County or Local Government Unit or Department of Transportation","Full Reporter",4515419,71,"MB","PT",26,139,null,9,null,148,null,1386044,null,1265452,null,0,null,0,null,"No"]
["Central Arkansas Transit Authority","North Little Rock","AR",6033,60033,"Independent Public Agency or Authority of Transit Service","Full Reporter",431388,71,"DR","DO",19,8,null,18,null,26,null,740835,null,644240,null,0,null,0,null,"No"]
["Transport of Rockland","Pomona","NY",2084,20084,"City, County or Local Government Unit or Department of Transportation","Full Reporter",18351295,71,"DR","DO",19,0,null,1,null,1,null,571671,null,500408,null,0,null,0,null,"No"]
["Gwinnett County Board of Commissioners","Lawrenceville","GA",4138,40138,"City, County or Local Government Unit or Department of Transportation","Full Reporter",4515419,71,"DR","PT",8,0,null,0,null,0,null,273633,null,222295,null,0,null,0,null,"No"]
["STAR Transit","Terrell","TX",6114,60114,"City, County or Local Government Unit or Department of Transportation","Full Reporter",5121892,71,"CB","DO",4,1,null,13,null,14,null,144881,null,131770,null,0,null,0,null,"No"]
["Central Arkansas Transit Authority","North Little Rock","AR",6033,60033,"Independent Public Agency or Authority of Transit Service","Full Reporter",431388,71,"SR","DO",3,5,null,12,null,17,null,52112,null,52112,null,52112,null,52112,null,"No"]
["STAR Transit","Terrell","TX",6114,60114,"City, County or Local Government Unit or Department of Transportation","Full Reporter",5121892,71,"MB","DO",1,1,null,3,null,4,null,36881,null,36242,null,0,null,0,null,"No"]
["Northern Indiana Commuter Transportation District","Chesterton","IN",5104,50104,"Independent Public Agency or Authority of Transit Service","Full Reporter",8608208,70,"CR","DO",70,6,null,0,null,6,null,4372435,null,4233598,null,791662,null,776475,null,"No"]
["Somerset County Transportation","Somerville","NJ",2209,20209,"City, County or Local Government Unit or Department of Transportation","Full Reporter",18351295,70,"DR","DO",60,57,null,143,null,200,null,1320077,null,1233180,null,0,null,0,null,"No"]
["Connecticut Department of Transportation- CTTransit Waterbury- NET","Waterbury","CT",1128,10128,"Subsidiary Unit of a Transit Agency, Reporting Separately","Full Reporter",194535,70,"DR","PT",35,12,null,0,null,12,null,843754,null,680990,null,0,null,0,null,"No"]
["Connecticut Department of Transportation- CTTransit Waterbury- NET","Waterbury","CT",1128,10128,"Subsidiary Unit of a Transit Agency, Reporting Separately","Full Reporter",194535,70,"MB","PT",35,67,null,19,null,86,null,1253792,null,1105711,null,0,null,0,null,"No"]
["Somerset County Transportation","Somerville","NJ",2209,20209,"City, County or Local Government Unit or Department of Transportation","Full Reporter",18351295,70,"MB","DO",10,23,null,23,null,46,null,289811,null,240021,null,0,null,0,null,"No"]
["Bergen County Community Transportation","Lodi","NJ",2192,20192,"City, County or Local Government Unit or Department of Transportation","Full Reporter",18351295,69,"DR","DO",65,0,null,61,null,61,null,1029440,null,907892,null,0,null,0,null,"No"]
["Kalamazoo Metro Transit System","Kalamazoo","MI",5035,50035,"City, County or Local Government Unit or Department of Transportation","Full Reporter",209703,69,"DR","PT",41,35,null,43,null,78,null,1126133,null,950725,null,0,null,0,null,"No"]
["Kalamazoo Metro Transit System","Kalamazoo","MI",5035,50035,"City, County or Local Government Unit or Department of Transportation","Full Reporter",209703,69,"MB","DO",28,33,null,673,null,706,null,1152351,null,1142554,null,0,null,0,null,"No"]
["Bergen County Community Transportation","Lodi","NJ",2192,20192,"City, County or Local Government Unit or Department of Transportation","Full Reporter",18351295,69,"MB","DO",4,0,null,4,null,4,null,122545,null,90362,null,0,null,0,null,"No"]
["Washington County Transportation Authority","Washington","PA",3111,30111,"Independent Public Agency or Authority of Transit Service","Full Reporter",1733853,68,"DR","PT",60,17,null,6,null,23,null,2214092,null,1847622,null,0,null,0,null,"No"]
["Washington County Transportation Authority","Washington","PA",3111,30111,"Independent Public Agency or Authority of Transit Service","Full Reporter",1733853,68,"MB","PT",8,12,null,12,null,24,null,349631,null,330661,null,0,null,0,null,"No"]
["Gold Coast Transit","Oxnard","CA",9035,90035,"Independent Public Agency or Authority of Transit Service","Full Reporter",367260,67,"MB","DO",45,123,null,17,null,140,null,2283742,null,2168198,null,0,null,0,null,"No"]
["Regional Transportation Authority","Nashville","TN",4159,40159,"Independent Public Agency or Authority of Transit Service","Full Reporter",969587,67,"VP","PT",42,2,null,4,null,6,null,666774,null,666774,null,0,null,0,null,"No"]
["Merrimack Valley Regional Transit Authority","Haverhill","MA",1013,10013,"Independent Public Agency or Authority of Transit Service","Full Reporter",4181019,67,"MB","PT",40,78,null,1,null,79,null,1727736,null,1493376,null,0,null,0,null,"No"]
["Gold Coast Transit","Oxnard","CA",9035,90035,"Independent Public Agency or Authority of Transit Service","Full Reporter",367260,67,"DR","PT",22,16,null,13,null,29,null,757843,null,663954,null,0,null,0,null,"No"]
["Merrimack Valley Regional Transit Authority","Haverhill","MA",1013,10013,"Independent Public Agency or Authority of Transit Service","Full Reporter",4181019,67,"DR","PT",21,3,null,2,null,5,null,660913,null,572376,null,0,null,0,null,"No"]
["Regional Transportation Authority","Nashville","TN",4159,40159,"Independent Public Agency or Authority of Transit Service","Full Reporter",969587,67,"CB","PT",18,12,null,0,null,12,null,632939,null,313242,null,0,null,0,null,"No"]
["Regional Transportation Authority","Nashville","TN",4159,40159,"Independent Public Agency or Authority of Transit Service","Full Reporter",969587,67,"CR","PT",7,3,null,0,null,3,null,226295,null,201335,null,90672,null,85690,null,"No"]
["Merrimack Valley Regional Transit Authority","Haverhill","MA",1013,10013,"Independent Public Agency or Authority of Transit Service","Full Reporter",4181019,67,"CB","PT",6,3,null,0,null,3,null,216524,null,105271,null,0,null,0,null,"No"]
["North Front Range Metropolitan Planning Organization","Fort Collins","CO",8106,80106,"MPO, COG or Other Planning Agency","Full Reporter",264465,66,"VP","DO",66,3,null,6,null,9,null,1561979,null,1561979,null,0,null,0,null,"No"]
["SouthWest Transit","Eden Prairie","MN",5221,50518,"City, County or Local Government Unit or Department of Transportation","Full Reporter",2650890,66,"MB","PT",59,43,null,1,null,44,null,1935422,null,1223763,null,0,null,0,null,"No"]
["South Florida Regional Transportation Authority","Pompano Beach","FL",4077,40077,"Independent Public Agency or Authority of Transit Service","Full Reporter",5502379,66,"CR","PT",42,52,null,0,null,52,null,3708779,null,3595531,null,1176374,null,1140423,null,"No"]
["Sonoma County Transit","Santa Rosa","CA",9089,90089,"City, County or Local Government Unit or Department of Transportation","Full Reporter",308231,66,"MB","PT",40,62,null,23,null,85,null,1910258,null,1496185,null,0,null,0,null,"No"]
["Escambia County Area Transit","Pensacola","FL",4038,40038,"City, County or Local Government Unit or Department of Transportation","Full Reporter",340067,66,"MB","PT",39,80,null,9,null,89,null,1562950,null,1502021,null,0,null,0,null,"No"]
["Winston-Salem Transit Authority - Trans-Aid of Forsyth County","Winston-Salem","NC",4012,40012,"Independent Public Agency or Authority of Transit Service","Full Reporter",391024,66,"MB","DO",36,15,null,282,null,297,null,1601370,null,1589632,null,0,null,0,null,"No"]
["Winston-Salem Transit Authority - Trans-Aid of Forsyth County","Winston-Salem","NC",4012,40012,"Independent Public Agency or Authority of Transit Service","Full Reporter",391024,66,"DR","DO",30,17,null,76,null,93,null,1027751,null,958553,null,0,null,0,null,"No"]
["Escambia County Area Transit","Pensacola","FL",4038,40038,"City, County or Local Government Unit or Department of Transportation","Full Reporter",340067,66,"DR","PT",27,6,null,22,null,28,null,1010454,null,963323,null,0,null,0,null,"No"]
["Sonoma County Transit","Santa Rosa","CA",9089,90089,"City, County or Local Government Unit or Department of Transportation","Full Reporter",308231,66,"DR","PT",25,1,null,4,null,5,null,689964,null,506150,null,0,null,0,null,"No"]
["South Florida Regional Transportation Authority","Pompano Beach","FL",4077,40077,"Independent Public Agency or Authority of Transit Service","Full Reporter",5502379,66,"MB","PT",24,32,null,24,null,56,null,1051280,null,841967,null,0,null,0,null,"No"]
["SouthWest Transit","Eden Prairie","MN",5221,50518,"City, County or Local Government Unit or Department of Transportation","Full Reporter",2650890,66,"DR","PT",7,8,null,3,null,11,null,294123,null,256719,null,0,null,0,null,"No"]
["Sonoma County Transit","Santa Rosa","CA",9089,90089,"City, County or Local Government Unit or Department of Transportation","Full Reporter",308231,66,"MB","DO",1,0,null,1,null,1,null,11227,null,10977,null,0,null,0,null,"No"]
["Livermore / Amador Valley Transit Authority","Livermore","CA",9144,90144,"Independent Public Agency or Authority of Transit Service","Full Reporter",615968,64,"MB","PT",49,104,null,13,null,117,null,2066409,null,1780948,null,0,null,0,null,"No"]
["Greater Bridgeport Transit Authority","Bridgeport","CT",1050,10050,"Independent Public Agency or Authority of Transit Service","Full Reporter",923311,64,"MB","DO",43,399,null,210,null,609,null,2024125,null,1927962,null,0,null,0,null,"No"]
["Greater Bridgeport Transit Authority","Bridgeport","CT",1050,10050,"Independent Public Agency or Authority of Transit Service","Full Reporter",923311,64,"DR","PT",21,23,null,6,null,29,null,571874,null,501768,null,0,null,0,null,"No"]
["Livermore / Amador Valley Transit Authority","Livermore","CA",9144,90144,"Independent Public Agency or Authority of Transit Service","Full Reporter",615968,64,"DR","PT",15,2,null,2,null,4,null,498493,null,421306,null,0,null,0,null,"No"]
["Anaheim Transportation Network","Anaheim","CA",9211,90211,"Private-Non-Profit Corporation","Full Reporter",12150996,63,"MB","PT",63,190,null,104,null,294,null,1663226,null,1527263,null,0,null,0,null,{"$f":"IF(OR(Z706=\"Q\",X706=\"Q\",V706=\"Q\",T706=\"Q\",R706=\"Q\",P706=\"Q\",N706=\"Q\"),\"Yes\",\"No\")","v":"No"}]
["JAUNT, Inc.","Charlottesville","VA",3045,30045,"Other Publicly-Owned or Privately Chartered Corporation","Full Reporter",92359,63,"DR","DO",63,25,null,0,null,25,null,2079309,null,1833282,null,0,null,0,null,"No"]
["Modesto Area Express","Modesto","CA",9007,90007,"City, County or Local Government Unit or Department of Transportation","Full Reporter",358172,63,"MB","PT",46,23,null,2,null,25,null,2013735,null,1947743,null,0,null,0,null,"No"]
["Stark Area Regional Transit Authority","Canton","OH",5011,50011,"Independent Public Agency or Authority of Transit Service","Full Reporter",279245,63,"MB","DO",33,136,null,389,null,525,null,2359920,null,2249630,null,0,null,0,null,"No"]
["Stark Area Regional Transit Authority","Canton","OH",5011,50011,"Independent Public Agency or Authority of Transit Service","Full Reporter",279245,63,"DR","DO",30,50,null,107,null,157,null,1515605,null,1384210,null,0,null,0,null,"No"]
["Yakima Transit","Yakima","WA",6,6,"City, County or Local Government Unit or Department of Transportation","Full Reporter",129534,63,"DR","PT",26,46,null,53,null,99,null,402814,null,371550,null,0,null,0,null,"No"]
["Yakima Transit","Yakima","WA",6,6,"City, County or Local Government Unit or Department of Transportation","Full Reporter",129534,63,"MB","DO",19,35,null,58,null,93,null,815441,"W",803670,"W",0,null,0,null,"No"]
["Yakima Transit","Yakima","WA",6,6,"City, County or Local Government Unit or Department of Transportation","Full Reporter",129534,63,"VP","DO",16,17,null,19,null,36,null,289049,null,289049,null,0,null,0,null,"No"]
["Modesto Area Express","Modesto","CA",9007,90007,"City, County or Local Government Unit or Department of Transportation","Full Reporter",358172,63,"DR","PT",12,14,null,14,null,28,null,483172,null,413404,null,0,null,0,null,"No"]
["Yakima Transit","Yakima","WA",6,6,"City, County or Local Government Unit or Department of Transportation","Full Reporter",129534,63,"CB","PT",2,6,null,4,null,10,null,149038,null,140974,null,0,null,0,null,"No"]
["Rock Island County Metropolitan Mass Transit District","Moline ","IL",5057,50057,"Independent Public Agency or Authority of Transit Service","Full Reporter",280051,62,"MB","DO",46,277,null,228,null,505,null,2324920,null,2211951,null,0,null,0,null,"No"]
["Tompkins Consolidated Area Transit","Ithaca","NY",2145,20145,"Private-Non-Profit Corporation","Full Reporter",53661,62,"MB","DO",40,140,null,369,null,509,null,1616593,null,1583498,null,0,null,0,null,"No"]
["County of Lackawanna Transit System","Scranton","PA",3025,30025,"Independent Public Agency or Authority of Transit Service","Full Reporter",381502,62,"DR","DO",29,17,null,8,null,25,null,790485,null,541993,null,0,null,0,null,"No"]
["County of Lackawanna Transit System","Scranton","PA",3025,30025,"Independent Public Agency or Authority of Transit Service","Full Reporter",381502,62,"MB","DO",26,21,null,781,null,802,null,1075231,null,960234,null,0,null,0,null,"No"]
["Tompkins Consolidated Area Transit","Ithaca","NY",2145,20145,"Private-Non-Profit Corporation","Full Reporter",53661,62,"DR","PT",21,6,null,4,null,10,null,482908,null,440605,null,0,null,0,null,"No"]
["Rock Island County Metropolitan Mass Transit District","Moline ","IL",5057,50057,"Independent Public Agency or Authority of Transit Service","Full Reporter",280051,62,"DR","DO",9,1,null,2,null,3,null,170228,null,144374,null,0,null,0,null,"No"]
["County of Lackawanna Transit System","Scranton","PA",3025,30025,"Independent Public Agency or Authority of Transit Service","Full Reporter",381502,62,"MB","PT",6,1,null,22,null,23,null,179855,null,165426,null,0,null,0,null,"No"]
["Rock Island County Metropolitan Mass Transit District","Moline ","IL",5057,50057,"Independent Public Agency or Authority of Transit Service","Full Reporter",280051,62,"DR","PT",4,6,null,0,null,6,null,158174,null,129346,null,0,null,0,null,"No"]
["Rock Island County Metropolitan Mass Transit District","Moline ","IL",5057,50057,"Independent Public Agency or Authority of Transit Service","Full Reporter",280051,62,"FB","PT",3,2,null,0,null,2,null,14519,null,14478,null,0,null,0,null,"No"]
["County of Lackawanna Transit System","Scranton","PA",3025,30025,"Independent Public Agency or Authority of Transit Service","Full Reporter",381502,62,"DR","PT",1,0,null,1,null,1,null,3692,null,1753,null,0,null,0,null,"No"]
["Tompkins Consolidated Area Transit","Ithaca","NY",2145,20145,"Private-Non-Profit Corporation","Full Reporter",53661,62,"VP","PT",1,0,null,0,null,0,null,8067,null,8067,null,0,null,0,null,"No"]
["Greater Lafayette Public Transportation Corporation","Lafayette","IN",5051,50051,"Independent Public Agency or Authority of Transit Service","Full Reporter",147725,61,"MB","DO",56,23,null,12,null,35,null,1812718,null,1742268,null,0,null,0,null,"No"]
["Lakeland Area Mass Transit District","Lakeland","FL",4031,40031,"Independent Public Agency or Authority of Transit Service","Full Reporter",262596,61,"DR","DO",31,82,null,14,null,96,null,748447,null,641077,null,0,null,0,null,"No"]
["Lakeland Area Mass Transit District","Lakeland","FL",4031,40031,"Independent Public Agency or Authority of Transit Service","Full Reporter",262596,61,"MB","DO",30,56,null,318,null,374,null,1457907,null,1372618,null,0,null,0,null,"No"]
["Greater Lafayette Public Transportation Corporation","Lafayette","IN",5051,50051,"Independent Public Agency or Authority of Transit Service","Full Reporter",147725,61,"DR","DO",5,1,null,1,null,2,null,125725,null,109931,null,0,null,0,null,"No"]
["Springfield Mass Transit District","Springfield","IL",5059,50059,"Independent Public Agency or Authority of Transit Service","Full Reporter",161316,60,"MB","DO",48,109,null,277,null,386,null,1446014,null,1375628,null,0,null,0,null,"No"]
["Valley Regional Transit","Meridian","ID",11,11,"Independent Public Agency or Authority of Transit Service","Full Reporter",349684,60,"MB","DO",40,94,null,15,null,109,null,1634919,null,1442940,null,0,null,0,null,"No"]
["Valley Regional Transit","Meridian","ID",11,11,"Independent Public Agency or Authority of Transit Service","Full Reporter",349684,60,"DR","DO",20,24,null,2,null,26,null,394712,null,331532,null,0,null,0,null,"No"]
["Springfield Mass Transit District","Springfield","IL",5059,50059,"Independent Public Agency or Authority of Transit Service","Full Reporter",161316,60,"DR","DO",12,17,null,41,null,58,null,427630,null,393446,null,0,null,0,null,"No"]
["Lakeland Bus Lines, Inc.","Dover","NJ",2163,20163,"Private-For-Profit Corporation","Full Reporter",18351295,59,"CB","DO",59,12,null,64,null,76,null,3297890,null,2228266,null,0,null,0,null,"No"]
["Transit Authority of Central Kentucky","Elizabethtown","KY",4191,40191,"Independent Public Agency or Authority of Transit Service","Full Reporter",73467,59,"DR","DO",36,3,null,2,null,5,null,1309862,null,1041204,null,0,null,0,null,"No"]
["Transit Authority of Central Kentucky","Elizabethtown","KY",4191,40191,"Independent Public Agency or Authority of Transit Service","Full Reporter",73467,59,"VP","DO",18,0,null,0,null,0,null,301858,null,301858,null,0,null,0,null,"No"]
["Transit Authority of Central Kentucky","Elizabethtown","KY",4191,40191,"Independent Public Agency or Authority of Transit Service","Full Reporter",73467,59,"MB","DO",5,0,null,0,null,0,null,53051,null,39062,null,0,null,0,null,"No"]
["Everett Transit","Everett","WA",5,5,"City, County or Local Government Unit or Department of Transportation","Full Reporter",3059393,58,"MB","DO",34,128,null,43,null,171,null,1421728,null,1239254,null,0,null,0,null,"No"]
["Alternativa de Transporte Integrado -ATI","San Juan","PR",4094,40094,"State Government Unit or Department of Transportation","Full Reporter",2148346,58,"HR","PT",32,42,null,491,null,533,null,2033342,null,1910657,null,625384,null,592614,null,"No"]
["Alternativa de Transporte Integrado -ATI","San Juan","PR",4094,40094,"State Government Unit or Department of Transportation","Full Reporter",2148346,58,"MB","PT",26,127,null,1725,null,1852,null,1064831,null,896447,null,0,null,0,null,"No"]
["Everett Transit","Everett","WA",5,5,"City, County or Local Government Unit or Department of Transportation","Full Reporter",3059393,58,"DR","DO",24,39,null,5,null,44,null,630030,null,563880,null,0,null,0,null,"No"]
["DeCamp Bus Lines","Montclair","NJ",2161,20161,"Private-For-Profit Corporation","Full Reporter",18351295,57,"CB","DO",57,136,null,58,null,194,null,2064516,null,1793033,null,0,null,0,null,"No"]
["Southwestern Pennsylvania Commission","Pittsburgh","PA",3078,30078,"MPO, COG or Other Planning Agency","Full Reporter",1733853,57,"VP","PT",57,0,null,0,null,0,null,902187,null,902187,null,0,null,0,null,"No"]
["DDOT - Progressive Transportation Services Administration","Washington","DC",3112,30112,"State Government Unit or Department of Transportation","Full Reporter",4586770,57,"MB","PT",52,137,null,170,null,307,null,1384770,null,1244488,null,0,null,0,null,"No"]
["Duluth Transit Authority","Duluth","MN",5025,50025,"Independent Public Agency or Authority of Transit Service","Full Reporter",120378,57,"MB","DO",50,241,null,112,null,353,null,1907629,null,1815453,null,0,null,0,null,"No"]
["Duluth Transit Authority","Duluth","MN",5025,50025,"Independent Public Agency or Authority of Transit Service","Full Reporter",120378,57,"DR","PT",7,1,null,21,null,22,null,286162,null,262287,null,0,null,0,null,"No"]
["DDOT - Progressive Transportation Services Administration","Washington","DC",3112,30112,"State Government Unit or Department of Transportation","Full Reporter",4586770,57,"SR","PT",5,6,null,2,null,8,null,60718,null,58285,null,60718,null,58285,null,"No"]
["Senior Citizens United Community Services of Camden County, Inc.","Audubon","NJ",2204,20204,"Private-Non-Profit Corporation","Full Reporter",5441567,56,"DR","DO",56,34,null,0,null,34,null,1000916,null,760430,null,0,null,0,null,"No"]
["Kanawha Valley Regional Transportation Authority","Charleston","WV",3001,30001,"Independent Public Agency or Authority of Transit Service","Full Reporter",153199,54,"MB","DO",42,283,null,764,null,1047,null,2213799,null,2186633,null,0,null,0,null,"No"]
["Broome County Department of Public Transportation","Vestal","NY",2003,20003,"City, County or Local Government Unit or Department of Transportation","Full Reporter",158084,54,"MB","DO",38,193,null,557,null,750,null,1238316,null,1168425,null,0,null,0,null,"No"]
["Central Midlands Transit","Columbia","SC",4141,40141,"Independent Public Agency or Authority of Transit Service","Full Reporter",549777,54,"MB","PT",38,289,null,24,null,313,null,2357129,null,2233328,null,0,null,0,null,"No"]
["Transfort","Fort Collins","CO",8011,80011,"City, County or Local Government Unit or Department of Transportation","Full Reporter",264465,54,"MB","DO",36,83,null,86,null,169,null,1389295,null,1273013,null,0,null,0,null,"No"]
["Shreveport Area Transit System","Shreveport","LA",6024,60024,"City, County or Local Government Unit or Department of Transportation","Full Reporter",298317,54,"MB","DO",36,247,null,1217,null,1464,null,2303451,null,2245220,null,0,null,0,null,"No"]
["Laredo Transit Management, Inc.","Laredo","TX",6009,60009,"City, County or Local Government Unit or Department of Transportation","Full Reporter",235730,54,"MB","DO",36,60,null,78,null,138,null,1766740,null,1705954,null,0,null,0,null,"No"]
["Cambria County Transit Authority","Johnstown","PA",3012,30012,"Independent Public Agency or Authority of Transit Service","Full Reporter",69014,54,"MB","DO",32,201,null,274,null,475,null,1132620,null,1062006,null,0,null,0,null,"No"]
["Yuma County Intergovernmental Public Transportation Authority","Yuma","AZ",9233,90233,"Independent Public Agency or Authority of Transit Service","Full Reporter",135267,54,"VP","PT",32,0,null,0,null,0,null,360817,null,360817,null,0,null,0,null,"No"]
["Cambria County Transit Authority","Johnstown","PA",3012,30012,"Independent Public Agency or Authority of Transit Service","Full Reporter",69014,54,"DR","DO",20,44,null,32,null,76,null,461894,null,355468,null,0,null,0,null,"No"]
["Yuma County Intergovernmental Public Transportation Authority","Yuma","AZ",9233,90233,"Independent Public Agency or Authority of Transit Service","Full Reporter",135267,54,"MB","PT",19,107,null,283,null,390,null,954566,null,842228,null,0,null,0,null,"No"]
["Laredo Transit Management, Inc.","Laredo","TX",6009,60009,"City, County or Local Government Unit or Department of Transportation","Full Reporter",235730,54,"DR","DO",18,16,null,14,null,30,null,287868,null,258691,null,0,null,0,null,"No"]
["Shreveport Area Transit System","Shreveport","LA",6024,60024,"City, County or Local Government Unit or Department of Transportation","Full Reporter",298317,54,"DR","DO",18,8,null,28,null,36,null,714752,null,643933,null,0,null,0,null,"No"]
["Central Midlands Transit","Columbia","SC",4141,40141,"Independent Public Agency or Authority of Transit Service","Full Reporter",549777,54,"DR","PT",16,8,null,13,null,21,null,704657,null,666982,null,0,null,0,null,"No"]
["Kanawha Valley Regional Transportation Authority","Charleston","WV",3001,30001,"Independent Public Agency or Authority of Transit Service","Full Reporter",153199,54,"DR","DO",12,3,null,2,null,5,null,288102,null,260770,null,0,null,0,null,"No"]
["Broome County Department of Public Transportation","Vestal","NY",2003,20003,"City, County or Local Government Unit or Department of Transportation","Full Reporter",158084,54,"DR","PT",10,2,null,4,null,6,null,363720,null,310152,null,0,null,0,null,"No"]
["Transfort","Fort Collins","CO",8011,80011,"City, County or Local Government Unit or Department of Transportation","Full Reporter",264465,54,"RB","DO",6,26,null,37,null,63,null,318376,null,301440,null,0,null,0,null,"No"]
["Broome County Department of Public Transportation","Vestal","NY",2003,20003,"City, County or Local Government Unit or Department of Transportation","Full Reporter",158084,54,"DR","DO",6,6,null,6,null,12,null,249518,null,206020,null,0,null,0,null,"No"]
["Transfort","Fort Collins","CO",8011,80011,"City, County or Local Government Unit or Department of Transportation","Full Reporter",264465,54,"MB","PT",4,0,null,40,null,40,null,44747,null,36327,null,0,null,0,null,"No"]
["Yuma County Intergovernmental Public Transportation Authority","Yuma","AZ",9233,90233,"Independent Public Agency or Authority of Transit Service","Full Reporter",135267,54,"DR","PT",3,2,null,5,null,7,null,91369,null,65856,null,0,null,0,null,"No"]
["Cambria County Transit Authority","Johnstown","PA",3012,30012,"Independent Public Agency or Authority of Transit Service","Full Reporter",69014,54,"IP","DO",2,8,null,0,null,8,null,2415,null,2415,null,2415,null,2415,null,"No"]
["Greater Roanoke Transit Company","Roanoke","VA",3007,30007,"Other Publicly-Owned or Privately Chartered Corporation","Full Reporter",210111,53,"MB","DO",35,2,null,291,null,293,null,1708995,null,1601987,null,0,null,0,null,{"$f":"IF(OR(Z770=\"Q\",X770=\"Q\",V770=\"Q\",T770=\"Q\",R770=\"Q\",P770=\"Q\",N770=\"Q\"),\"Yes\",\"No\")","v":"No"}]
["City of Elk Grove","Elk Grove","CA",9205,90205,"City, County or Local Government Unit or Department of Transportation","Full Reporter",1723634,53,"CB","PT",26,130,null,20,null,150,null,679145,null,377300,null,0,null,0,null,"No"]
["City of Elk Grove","Elk Grove","CA",9205,90205,"City, County or Local Government Unit or Department of Transportation","Full Reporter",1723634,53,"MB","PT",19,66,null,15,null,81,null,635105,null,524279,null,0,null,0,null,"No"]
["Greater Roanoke Transit Company","Roanoke","VA",3007,30007,"Other Publicly-Owned or Privately Chartered Corporation","Full Reporter",210111,53,"DR","PT",17,2,null,18,null,20,null,675003,null,643951,null,0,null,0,null,"No"]
["City of Elk Grove","Elk Grove","CA",9205,90205,"City, County or Local Government Unit or Department of Transportation","Full Reporter",1723634,53,"DR","PT",8,6,null,8,null,14,null,198824,null,172009,null,0,null,0,null,"No"]
["Greater Roanoke Transit Company","Roanoke","VA",3007,30007,"Other Publicly-Owned or Privately Chartered Corporation","Full Reporter",210111,53,"CB","DO",1,0,null,3,null,3,null,128250,null,121248,null,0,null,0,null,"No"]
["Douglas County Rideshare","Douglasville","GA",4082,40082,"City, County or Local Government Unit or Department of Transportation","Full Reporter",4515419,52,"VP","DO",49,43,null,11,null,54,null,777606,null,777606,null,0,null,0,null,"No"]
["Bay Metropolitan Transit Authority","Bay City","MI",5029,50029,"Independent Public Agency or Authority of Transit Service","Full Reporter",70585,52,"MB","DO",38,24,null,13,null,37,null,1022057,null,1020878,null,0,null,0,null,"No"]
["Kenosha Transit","Kenosha","WI",5003,50003,"City, County or Local Government Unit or Department of Transportation","Full Reporter",124064,52,"MB","DO",37,34,null,12,null,46,null,890035,null,818405,null,0,null,0,null,"No"]
["Portage Area Regional Transportation Authority","Kent","OH",5021,50021,"Independent Public Agency or Authority of Transit Service","Full Reporter",569499,52,"DR","DO",27,7,null,1,null,8,null,866234,null,739392,null,0,null,0,null,"No"]
["St. Cloud Metropolitan Transit Commission","St. Cloud","MN",5028,50028,"Independent Public Agency or Authority of Transit Service","Full Reporter",110621,52,"MB","DO",27,12,null,19,null,31,null,1289963,null,1234866,null,0,null,0,null,"No"]
["Portage Area Regional Transportation Authority","Kent","OH",5021,50021,"Independent Public Agency or Authority of Transit Service","Full Reporter",569499,52,"MB","DO",25,31,null,2,null,33,null,864567,null,816175,null,0,null,0,null,"No"]
["St. Cloud Metropolitan Transit Commission","St. Cloud","MN",5028,50028,"Independent Public Agency or Authority of Transit Service","Full Reporter",110621,52,"DR","DO",21,4,null,3,null,7,null,611422,null,572903,null,0,null,0,null,"No"]
["Bay Metropolitan Transit Authority","Bay City","MI",5029,50029,"Independent Public Agency or Authority of Transit Service","Full Reporter",70585,52,"DR","DO",14,7,null,9,null,16,null,465658,null,460246,null,0,null,0,null,"No"]
["Kenosha Transit","Kenosha","WI",5003,50003,"City, County or Local Government Unit or Department of Transportation","Full Reporter",124064,52,"DR","PT",12,4,null,59,null,63,null,195105,null,168830,null,0,null,0,null,"No"]
["St. Cloud Metropolitan Transit Commission","St. Cloud","MN",5028,50028,"Independent Public Agency or Authority of Transit Service","Full Reporter",110621,52,"CB","DO",4,13,null,1,null,14,null,188658,null,174828,null,0,null,0,null,"No"]
["Kenosha Transit","Kenosha","WI",5003,50003,"City, County or Local Government Unit or Department of Transportation","Full Reporter",124064,52,"SR","DO",3,0,null,4,null,4,null,17594,null,17523,null,17594,null,17523,null,"No"]
["Douglas County Rideshare","Douglasville","GA",4082,40082,"City, County or Local Government Unit or Department of Transportation","Full Reporter",4515419,52,"DR","DO",3,2,null,2,null,4,null,71316,null,69089,null,0,null,0,null,"No"]
["University of Georgia Transit System","Athens","GA",4180,40180,"University","Full Reporter",128754,51,"MB","DO",45,23,null,24,null,47,null,958129,null,917206,null,0,null,0,null,"No"]
["Transit Joint Powers Authority for Merced County","Merced","CA",9173,90173,"Independent Public Agency or Authority of Transit Service","Full Reporter",136969,51,"MB","PT",40,25,null,21,null,46,null,2160833,null,1963953,null,0,null,0,null,"No"]
["Western Reserve Transit Authority","Youngstown","OH",5024,50024,"Independent Public Agency or Authority of Transit Service","Full Reporter",387550,51,"MB","DO",35,27,null,19,null,46,null,1313894,null,1237431,null,0,null,0,null,"No"]
["Rockford Mass Transit District","Rockford","IL",5058,50058,"Independent Public Agency or Authority of Transit Service","Full Reporter",296863,51,"DR","DO",26,42,null,8,null,50,null,799983,null,720047,null,0,null,0,null,"No"]
["Rockford Mass Transit District","Rockford","IL",5058,50058,"Independent Public Agency or Authority of Transit Service","Full Reporter",296863,51,"MB","DO",25,333,null,75,null,408,null,1270212,null,1270212,null,0,null,0,null,"No"]
["Western Reserve Transit Authority","Youngstown","OH",5024,50024,"Independent Public Agency or Authority of Transit Service","Full Reporter",387550,51,"DR","DO",16,3,null,3,null,6,null,450803,null,387135,null,0,null,0,null,"No"]
["Transit Joint Powers Authority for Merced County","Merced","CA",9173,90173,"Independent Public Agency or Authority of Transit Service","Full Reporter",136969,51,"DR","PT",11,3,null,2,null,5,null,308289,null,284690,null,0,null,0,null,"No"]
["University of Georgia Transit System","Athens","GA",4180,40180,"University","Full Reporter",128754,51,"DR","DO",6,2,null,11,null,13,null,60141,null,46468,null,0,null,0,null,"No"]
["Trans-Bridge Lines, Inc.","Bethlehem","PA",2169,20169,"Private-For-Profit Corporation","Full Reporter",18351295,50,"CB","DO",50,92,null,222,null,314,null,3939532,null,3791880,null,0,null,0,null,"No"]
["Eau Claire Transit","Eau Claire","WI",5099,50099,"City, County or Local Government Unit or Department of Transportation","Full Reporter",102852,50,"DR","PT",34,11,null,363,null,374,null,964026,null,578671,null,0,null,0,null,"No"]
["Eau Claire Transit","Eau Claire","WI",5099,50099,"City, County or Local Government Unit or Department of Transportation","Full Reporter",102852,50,"MB","DO",16,12,null,105,null,117,null,718727,null,706974,null,0,null,0,null,"No"]
["Orange-Newark-Elizabeth, Inc.","Elizabeth","NJ",2166,20166,"Private-For-Profit Corporation","Full Reporter",18351295,49,"MB","DO",49,46,null,183,null,229,null,1924476,null,1582717,null,0,null,0,null,"No"]
["City of Gardena Transportation Department","Gardena","CA",9042,90042,"City, County or Local Government Unit or Department of Transportation","Full Reporter",12150996,49,"MB","DO",43,334,null,265,null,599,null,1715379,null,1623640,null,0,null,0,null,"No"]
["Western Piedmont Regional Transit Authority","Conover","NC",4172,40172,"Independent Public Agency or Authority of Transit Service","Full Reporter",212195,49,"DR","DO",43,10,null,1,null,11,null,973117,null,838894,null,0,null,0,null,"No"]
["Concho Valley Transit District","San Angelo","TX",6102,60102,"Independent Public Agency or Authority of Transit Service","Full Reporter",92984,49,"DR","DO",42,8,null,8,null,16,null,873914,null,743673,null,0,null,0,null,"No"]
["Concho Valley Transit District","San Angelo","TX",6102,60102,"Independent Public Agency or Authority of Transit Service","Full Reporter",92984,49,"MB","DO",7,2,null,0,null,2,null,352050,null,317389,null,0,null,0,null,"No"]
["City of Gardena Transportation Department","Gardena","CA",9042,90042,"City, County or Local Government Unit or Department of Transportation","Full Reporter",12150996,49,"DR","DO",6,2,null,1,null,3,null,73253,null,65321,null,0,null,0,null,"No"]
["Western Piedmont Regional Transit Authority","Conover","NC",4172,40172,"Independent Public Agency or Authority of Transit Service","Full Reporter",212195,49,"MB","DO",6,6,null,1,null,7,null,285690,null,264528,null,0,null,0,null,"No"]
["West Virginia University - Morgantown Personal Rapid Transit","Morgantown","WV",3107,30107,"University","Full Reporter",70350,48,"MG","DO",48,288,null,224,null,512,null,676717,null,668979,null,676717,null,668979,null,"No"]
["Yolo County Transportation District","Woodland","CA",9090,90090,"Independent Public Agency or Authority of Transit Service","Full Reporter",1723634,48,"MB","PT",39,144,null,111,null,255,null,2331409,null,2017410,null,0,null,0,null,"No"]
["Lower Rio Grande Valley Development Council","Weslaco","TX",6090,60090,"MPO, COG or Other Planning Agency","Full Reporter",728825,48,"CB","DO",26,9,null,26,null,35,null,1139202,null,1130529,null,0,null,0,null,"No"]
["The Wave Transit System","Mobile","AL",4043,40043,"City, County or Local Government Unit or Department of Transportation","Full Reporter",326183,48,"DR","DO",25,8,null,50,null,58,null,674156,null,606565,null,0,null,0,null,"No"]
["The Wave Transit System","Mobile","AL",4043,40043,"City, County or Local Government Unit or Department of Transportation","Full Reporter",326183,48,"MB","DO",23,101,null,163,null,264,null,1297229,null,1244689,null,0,null,0,null,"No"]
["Lower Rio Grande Valley Development Council","Weslaco","TX",6090,60090,"MPO, COG or Other Planning Agency","Full Reporter",728825,48,"MB","DO",17,13,null,68,null,81,null,944168,null,846774,null,0,null,0,null,"No"]
["Yolo County Transportation District","Woodland","CA",9090,90090,"Independent Public Agency or Authority of Transit Service","Full Reporter",1723634,48,"DR","PT",9,6,null,6,null,12,null,408168,null,324546,null,0,null,0,null,"No"]
["Lower Rio Grande Valley Development Council","Weslaco","TX",6090,60090,"MPO, COG or Other Planning Agency","Full Reporter",728825,48,"DR","DO",5,1,null,3,null,4,null,171404,null,144996,null,0,null,0,null,"No"]
["Wake County DSS","Raleigh","NC","4R06-094",40222,"City, County or Local Government Unit or Department of Transportation","Full Reporter",884891,47,"DR","PT",47,6,null,26,null,32,null,2573590,null,2559871,null,0,null,0,null,"No"]
["Western Contra Costa Transit Authority","Pinole","CA",9159,90159,"Independent Public Agency or Authority of Transit Service","Full Reporter",3281212,47,"MB","PT",32,6,null,15,null,21,null,1270920,null,1143526,null,0,null,0,null,"No"]
["Butte County Association of Governments","Chico","CA",9208,90208,"MPO, COG or Other Planning Agency","Full Reporter",98176,47,"MB","PT",26,44,null,27,null,71,null,1138508,null,1019388,null,0,null,0,null,"No"]
["Butte County Association of Governments","Chico","CA",9208,90208,"MPO, COG or Other Planning Agency","Full Reporter",98176,47,"DR","PT",21,1,null,3,null,4,null,454383,null,370153,null,0,null,0,null,"No"]
["Central Oregon Intergovernmental Council","Bend","OR",57,57,"MPO, COG or Other Planning Agency","Full Reporter",83794,47,"CB","DO",14,1,null,0,null,1,null,426155,null,400145,null,0,null,0,null,"No"]
["Central Oregon Intergovernmental Council","Bend","OR",57,57,"MPO, COG or Other Planning Agency","Full Reporter",83794,47,"MB","PT",12,5,null,2,null,7,null,430928,null,407658,null,0,null,0,null,"No"]
["Central Oregon Intergovernmental Council","Bend","OR",57,57,"MPO, COG or Other Planning Agency","Full Reporter",83794,47,"DR","DO",11,7,null,4,null,11,null,178451,null,148394,null,0,null,0,null,"No"]
["Western Contra Costa Transit Authority","Pinole","CA",9159,90159,"Independent Public Agency or Authority of Transit Service","Full Reporter",3281212,47,"DR","PT",9,0,null,1,null,1,null,222966,null,204538,null,0,null,0,null,"No"]
["Central Oregon Intergovernmental Council","Bend","OR",57,57,"MPO, COG or Other Planning Agency","Full Reporter",83794,47,"DR","PT",9,1,null,0,null,1,null,166109,null,144249,null,0,null,0,null,"No"]
["Western Contra Costa Transit Authority","Pinole","CA",9159,90159,"Independent Public Agency or Authority of Transit Service","Full Reporter",3281212,47,"CB","PT",6,3,null,3,null,6,null,453653,null,408981,null,0,null,0,null,"No"]
["Central Oregon Intergovernmental Council","Bend","OR",57,57,"MPO, COG or Other Planning Agency","Full Reporter",83794,47,"MB","DO",1,0,null,1,null,1,null,16058,null,13568,null,0,null,0,null,"No"]
["Culver City Municipal Bus Lines","Culver City","CA",9039,90039,"City, County or Local Government Unit or Department of Transportation","Full Reporter",12150996,46,"MB","DO",44,14,null,127,null,141,null,1817938,null,1669822,null,0,null,0,null,"No"]
["South Bend Public Transportation Corporation","South Bend","IN",5052,50052,"Independent Public Agency or Authority of Transit Service","Full Reporter",278165,46,"MB","DO",35,127,null,26,null,153,null,1358176,null,1283562,null,0,null,0,null,"No"]
["Okaloosa County Board of County Commissioners","Fort Walton Beach","FL",4128,40128,"City, County or Local Government Unit or Department of Transportation","Full Reporter",191917,46,"DR","PT",33,21,null,14,null,35,null,1015691,null,960082,null,0,null,0,null,"No"]
["Fort Bend County Public Transportation","Sugar Land","TX",6103,60103,"City, County or Local Government Unit or Department of Transportation","Full Reporter",4944332,46,"DR","PT",21,111,null,122,null,233,null,1244492,null,1078218,null,0,null,0,null,"No"]
["Fort Bend County Public Transportation","Sugar Land","TX",6103,60103,"City, County or Local Government Unit or Department of Transportation","Full Reporter",4944332,46,"CB","PT",20,40,null,71,null,111,null,863674,null,630822,null,0,null,0,null,"No"]
["Okaloosa County Board of County Commissioners","Fort Walton Beach","FL",4128,40128,"City, County or Local Government Unit or Department of Transportation","Full Reporter",191917,46,"MB","PT",13,15,null,9,null,24,null,423563,null,396416,null,0,null,0,null,"No"]
["South Bend Public Transportation Corporation","South Bend","IN",5052,50052,"Independent Public Agency or Authority of Transit Service","Full Reporter",278165,46,"DR","DO",11,13,null,10,null,23,null,342319,null,306798,null,0,null,0,null,"No"]
["Fort Bend County Public Transportation","Sugar Land","TX",6103,60103,"City, County or Local Government Unit or Department of Transportation","Full Reporter",4944332,46,"MB","PT",5,17,null,21,null,38,null,100753,null,79934,null,0,null,0,null,"No"]
["Culver City Municipal Bus Lines","Culver City","CA",9039,90039,"City, County or Local Government Unit or Department of Transportation","Full Reporter",12150996,46,"DR","DO",2,0,null,7,null,7,null,27359,null,21311,null,0,null,0,null,"No"]
["Manatee County Area Transit","Bradenton","FL",4026,40026,"City, County or Local Government Unit or Department of Transportation","Full Reporter",643260,45,"MB","DO",23,403,null,211,null,614,null,1463838,null,1388068,null,0,null,0,null,{"$f":"IF(OR(Z834=\"Q\",X834=\"Q\",V834=\"Q\",T834=\"Q\",R834=\"Q\",P834=\"Q\",N834=\"Q\"),\"Yes\",\"No\")","v":"No"}]
["Manatee County Area Transit","Bradenton","FL",4026,40026,"City, County or Local Government Unit or Department of Transportation","Full Reporter",643260,45,"DR","DO",22,258,null,159,null,417,null,707410,null,602866,null,0,null,0,null,"No"]
["Staten Island Rapid Transit Operating Authority, dba: MTA Staten Island Railway","Staten Island","NY",2099,20099,"Independent Public Agency or Authority of Transit Service","Full Reporter",18351295,44,"HR","DO",44,45,null,0,null,45,null,2828312,null,2637976,null,707078,null,659494,null,"No"]
["Link Transit","Wenatchee","WA",43,43,"Independent Public Agency or Authority of Transit Service","Full Reporter",67227,44,"MB","DO",30,281,null,140,null,421,null,1837447,null,1747554,null,0,null,0,null,"No"]
["Jefferson Parish Department of Transit Administration","Gretna","LA",6088,60088,"City, County or Local Government Unit or Department of Transportation","Full Reporter",899703,44,"MB","PT",29,54,null,19,null,73,null,1492085,null,1355436,null,0,null,0,null,"No"]
["Ventura Intercity Service Transit Authority","Ventura","CA",9164,90164,"Independent Public Agency or Authority of Transit Service","Full Reporter",367260,44,"CB","PT",29,51,null,16,null,67,null,2185498,null,1585460,null,0,null,0,null,"No"]
["The Tri-County Council for the Lower Eastern Shore of Maryland","Salisbury","MD",3096,30096,"Independent Public Agency or Authority of Transit Service","Full Reporter",98081,44,"DR","DO",23,79,null,42,null,121,null,563337,null,430045,null,0,null,0,null,"No"]
["The Tri-County Council for the Lower Eastern Shore of Maryland","Salisbury","MD",3096,30096,"Independent Public Agency or Authority of Transit Service","Full Reporter",98081,44,"MB","DO",15,262,null,55,null,317,null,1339999,null,1332665,null,0,null,0,null,"No"]
["Jefferson Parish Department of Transit Administration","Gretna","LA",6088,60088,"City, County or Local Government Unit or Department of Transportation","Full Reporter",899703,44,"DR","PT",15,13,null,11,null,24,null,459232,null,312940,null,0,null,0,null,"No"]
["Link Transit","Wenatchee","WA",43,43,"Independent Public Agency or Authority of Transit Service","Full Reporter",67227,44,"DR","DO",13,11,null,0,null,11,null,250586,null,217879,null,0,null,0,null,"No"]
["Ventura Intercity Service Transit Authority","Ventura","CA",9164,90164,"Independent Public Agency or Authority of Transit Service","Full Reporter",367260,44,"DR","PT",10,0,null,1,null,1,null,206300,null,188761,null,0,null,0,null,"No"]
["Ventura Intercity Service Transit Authority","Ventura","CA",9164,90164,"Independent Public Agency or Authority of Transit Service","Full Reporter",367260,44,"MB","PT",5,1,null,1,null,2,null,237025,null,216689,null,0,null,0,null,"No"]
["Link Transit","Wenatchee","WA",43,43,"Independent Public Agency or Authority of Transit Service","Full Reporter",67227,44,"DR","PT",1,0,null,0,null,0,null,5441,null,3217,null,0,null,0,null,"No"]
["Spartanburg Regional Health Services, Inc.","Spartanburg","SC",null,40244,"State Government Unit or Department of Transportation","Full Reporter",180786,43,"DR","DO",43,91,null,7,null,98,null,1992132,null,1766815,null,0,null,0,null,"No"]
["Clay County Council on Aging, Inc., dba Clay Transit","Green Cove Springs","FL",null,40245,"Private-Non-Profit Corporation","Full Reporter",1065219,43,"DR","DO",36,0,null,0,null,0,null,691120,null,671429,null,0,null,0,null,"No"]
["Housatonic Area Regional Transit","Danbury","CT",1051,10051,"Independent Public Agency or Authority of Transit Service","Full Reporter",168136,43,"MB","DO",28,14,null,20,null,34,null,1203049,null,1062816,null,0,null,0,null,"No"]
["Connecticut Department of Transportation","Newington","CT",1102,10102,"State Government Unit or Department of Transportation","Full Reporter",924859,43,"CR","PT",28,75,null,21,null,96,null,2263510,null,1823515,null,613281,null,495368,null,"No"]
["Santee Wateree Regional Transportation Authority","Sumter","SC",4100,40100,"Independent Public Agency or Authority of Transit Service","Full Reporter",73107,43,"DR","DO",25,121,null,122,null,243,null,168157,null,145987,null,0,null,0,null,"No"]
["Cape Fear Public Transportation Authority","Wilmington","NC",4006,40006,"Independent Public Agency or Authority of Transit Service","Full Reporter",219957,43,"MB","PT",25,421,null,269,null,690,null,1278021,null,1223022,null,0,null,0,null,"No"]
["Napa Valley Transportation Authority","Napa","CA",9088,90088,"Independent Public Agency or Authority of Transit Service","Full Reporter",83913,43,"MB","PT",24,4,null,26,null,30,null,1138853,null,1073813,null,0,null,0,null,"No"]
["San Luis Obispo Regional Transit Authority","San Luis Obispo","CA",9206,90206,"Independent Public Agency or Authority of Transit Service","Full Reporter",59219,43,"MB","DO",22,52,null,14,null,66,null,1545190,null,1286371,null,0,null,0,null,"No"]
["San Luis Obispo Regional Transit Authority","San Luis Obispo","CA",9206,90206,"Independent Public Agency or Authority of Transit Service","Full Reporter",59219,43,"DR","DO",21,11,null,1,null,12,null,612873,null,523524,null,0,null,0,null,"No"]
["Clermont Transportation Connection","Batavia","OH",5166,50166,"City, County or Local Government Unit or Department of Transportation","Full Reporter",1624827,43,"DR","PT",18,6,null,13,null,19,null,665638,null,561867,null,0,null,0,null,"No"]
["Clermont Transportation Connection","Batavia","OH",5166,50166,"City, County or Local Government Unit or Department of Transportation","Full Reporter",1624827,43,"DR","DO",16,9,null,3,null,12,null,331114,null,253147,null,0,null,0,null,"No"]
["Cape Fear Public Transportation Authority","Wilmington","NC",4006,40006,"Independent Public Agency or Authority of Transit Service","Full Reporter",219957,43,"DR","DO",16,8,null,0,null,8,null,518610,null,453239,null,0,null,0,null,"No"]
["Wiregrass Transit Authority","Dothan","AL",4103,40103,"MPO, COG or Other Planning Agency","Full Reporter",68781,43,"DR","PT",15,2,null,2,null,4,null,679380,null,660682,null,0,null,0,null,"No"]
["Housatonic Area Regional Transit","Danbury","CT",1051,10051,"Independent Public Agency or Authority of Transit Service","Full Reporter",168136,43,"DR","DO",15,19,null,17,null,36,null,429584,null,394398,null,0,null,0,null,"No"]
["Connecticut Department of Transportation","Newington","CT",1102,10102,"State Government Unit or Department of Transportation","Full Reporter",924859,43,"CB","PT",15,61,null,56,null,117,null,562707,null,324864,null,0,null,0,null,"No"]
["Napa Valley Transportation Authority","Napa","CA",9088,90088,"Independent Public Agency or Authority of Transit Service","Full Reporter",83913,43,"DR","PT",12,3,null,1,null,4,null,317996,null,251046,null,0,null,0,null,"No"]
["Wiregrass Transit Authority","Dothan","AL",4103,40103,"MPO, COG or Other Planning Agency","Full Reporter",68781,43,"DR","DO",12,3,null,6,null,9,null,298059,null,279777,null,0,null,0,null,"No"]
["Santee Wateree Regional Transportation Authority","Sumter","SC",4100,40100,"Independent Public Agency or Authority of Transit Service","Full Reporter",73107,43,"MB","DO",11,198,null,203,null,401,null,322131,null,312681,null,0,null,0,null,"No"]
["Clermont Transportation Connection","Batavia","OH",5166,50166,"City, County or Local Government Unit or Department of Transportation","Full Reporter",1624827,43,"MB","DO",9,9,null,5,null,14,null,255094,null,141591,null,0,null,0,null,"No"]
["Santee Wateree Regional Transportation Authority","Sumter","SC",4100,40100,"Independent Public Agency or Authority of Transit Service","Full Reporter",73107,43,"CB","DO",7,86,null,72,null,158,null,184134,null,184134,null,0,null,0,null,"No"]
["Napa Valley Transportation Authority","Napa","CA",9088,90088,"Independent Public Agency or Authority of Transit Service","Full Reporter",83913,43,"CB","PT",7,3,null,0,null,3,null,439448,null,421650,null,0,null,0,null,"No"]
["Clay County Council on Aging, Inc., dba Clay Transit","Green Cove Springs","FL",null,40245,"Private-Non-Profit Corporation","Full Reporter",1065219,43,"MB","DO",7,0,null,0,null,0,null,299620,null,279934,null,0,null,0,null,"No"]
["Cape Fear Public Transportation Authority","Wilmington","NC",4006,40006,"Independent Public Agency or Authority of Transit Service","Full Reporter",219957,43,"VP","DO",2,0,null,0,null,0,null,45812,null,45812,null,0,null,0,null,"No"]
["Enterprise Rideshare","Atlanta","GA",4203,40203,"Private-For-Profit Corporation","Full Reporter",4515419,42,"VP","DO",42,0,null,1,null,1,null,1161874,null,1161874,null,0,null,0,null,"No"]
["Connecticut Department of Transportation - CTTRANSIT Stamford Division","Hartford","CT",1056,10056,"State Government Unit or Department of Transportation","Full Reporter",923311,42,"MB","DO",42,120,null,336,null,456,null,1580121,null,1508437,null,0,null,0,null,"No"]
["Northwest Alabama Council of Local Governments","Muscle Shoals","AL",4068,40068,"MPO, COG or Other Planning Agency","Full Reporter",77074,42,"DR","DO",42,15,null,3,null,18,null,519603,null,449697,null,0,null,0,null,"No"]
["City of Rochester Public Transportation","Rochester","MN",5092,50092,"City, County or Local Government Unit or Department of Transportation","Full Reporter",107677,42,"MB","PT",37,117,null,50,null,167,null,1275896,null,1089179,null,0,null,0,null,"No"]
["Blacksburg Transit","Blacksburg","VA",3091,30091,"City, County or Local Government Unit or Department of Transportation","Full Reporter",88542,42,"MB","DO",34,136,null,76,null,212,null,797832,null,733793,null,0,null,0,null,"No"]
["Lake County Board of County Commissioners","Tavares","FL",4158,40158,"City, County or Local Government Unit or Department of Transportation","Full Reporter",131337,42,"DR","PT",32,55,null,141,null,196,null,1232051,null,999951,null,0,null,0,null,"No"]
["Fort Wayne Public Transportation Corporation","Fort Wayne","IN",5044,50044,"Independent Public Agency or Authority of Transit Service","Full Reporter",313492,42,"MB","DO",30,18,null,363,null,381,null,1509345,null,1437682,null,0,null,0,null,"No"]
["Monroe County Transportation Authority","Scotrun","PA","3R04-012",30137,"Independent Public Agency or Authority of Transit Service","Full Reporter",54316,42,"DR","DO",27,6,null,30,null,36,null,1005977,null,841216,null,0,null,0,null,"No"]
["Su Tran LLC dba: Sioux Area Metro","Sioux Falls","SD",8002,80002,"Private Provider Reporting on Behalf of a Public Entity","Full Reporter",156777,42,"MB","DO",22,29,null,41,null,70,null,773386,null,763809,null,0,null,0,null,"No"]
["Howard Transit","Ellicott City","MD",3048,30048,"City, County or Local Government Unit or Department of Transportation","Full Reporter",2203663,42,"DR","PT",20,18,null,49,null,67,null,870805,null,761394,null,0,null,0,null,"No"]
["Su Tran LLC dba: Sioux Area Metro","Sioux Falls","SD",8002,80002,"Private Provider Reporting on Behalf of a Public Entity","Full Reporter",156777,42,"DR","DO",20,18,null,15,null,33,null,568716,null,559209,null,0,null,0,null,"No"]
["Howard Transit","Ellicott City","MD",3048,30048,"City, County or Local Government Unit or Department of Transportation","Full Reporter",2203663,42,"MB","PT",17,58,null,176,null,234,null,1341718,null,1202477,null,0,null,0,null,"No"]
["City of Fairfield - Fairfield and Suisun Transit","Fairfield","CA",9092,90092,"City, County or Local Government Unit or Department of Transportation","Full Reporter",133683,42,"CB","PT",17,51,null,15,null,66,null,1061253,null,963798,null,0,null,0,null,"No"]
["City of Fairfield - Fairfield and Suisun Transit","Fairfield","CA",9092,90092,"City, County or Local Government Unit or Department of Transportation","Full Reporter",133683,42,"MB","PT",16,77,null,38,null,115,null,750199,null,723562,null,0,null,0,null,"No"]
["Fort Wayne Public Transportation Corporation","Fort Wayne","IN",5044,50044,"Independent Public Agency or Authority of Transit Service","Full Reporter",313492,42,"DR","DO",12,4,null,4,null,8,null,535283,null,451420,null,0,null,0,null,"No"]
["Claremont Dial-a-Ride","La Verne","CA",9296,90296,"City, County or Local Government Unit or Department of Transportation","Full Reporter",12150996,42,"DR","PT",12,2,null,0,null,2,null,18620,null,11082,null,0,null,0,null,"No"]
["Lake County Board of County Commissioners","Tavares","FL",4158,40158,"City, County or Local Government Unit or Department of Transportation","Full Reporter",131337,42,"MB","PT",10,77,null,62,null,139,null,587672,null,538386,null,0,null,0,null,"No"]
["Monroe County Transportation Authority","Scotrun","PA","3R04-012",30137,"Independent Public Agency or Authority of Transit Service","Full Reporter",54316,42,"MB","DO",10,3,null,22,null,25,null,571669,null,506064,null,0,null,0,null,"No"]
["City of Fairfield - Fairfield and Suisun Transit","Fairfield","CA",9092,90092,"City, County or Local Government Unit or Department of Transportation","Full Reporter",133683,42,"DR","PT",9,7,null,0,null,7,null,252899,null,230894,null,0,null,0,null,"No"]
["Blacksburg Transit","Blacksburg","VA",3091,30091,"City, County or Local Government Unit or Department of Transportation","Full Reporter",88542,42,"DR","DO",8,5,null,2,null,7,null,177655,null,144449,null,0,null,0,null,"No"]
["City of Rochester Public Transportation","Rochester","MN",5092,50092,"City, County or Local Government Unit or Department of Transportation","Full Reporter",107677,42,"DR","PT",5,94,null,21,null,115,null,284819,null,278970,null,0,null,0,null,"No"]
["Greene County Transit Board","Xenia","OH",5165,50165,"City, County or Local Government Unit or Department of Transportation","Full Reporter",724091,41,"DR","PT",41,8,null,2,null,10,null,1391710,null,1109817,null,0,null,0,null,"No"]
["Martz Trailways","Wilkes Barre","PA",3102,30102,"Private-For-Profit Corporation","Full Reporter",18351295,41,"CB","DO",41,96,null,72,null,168,null,3038097,null,2731027,"Q",0,null,0,null,"Yes"]
["River Bend Transit","Davenport","IA",7049,70049,"Private-Non-Profit Corporation","Full Reporter",280051,41,"DR","DO",30,55,null,18,null,73,null,596952,null,422191,null,0,null,0,null,"No"]
["Dutchess County Division of Mass Transportation","Poughkeepsie","NY",2010,20010,"City, County or Local Government Unit or Department of Transportation","Full Reporter",423566,41,"MB","DO",26,19,null,1,null,20,null,989363,null,941687,null,0,null,0,null,"No"]
["Butler County Regional Transit Authority","Hamilton","OH",5157,50157,"Independent Public Agency or Authority of Transit Service","Full Reporter",1624827,41,"DR","DO",24,7,null,6,null,13,null,490374,null,345626,null,0,null,0,null,"No"]
["City of Waukesha Transit Commission","Waukesha","WI",5096,50096,"City, County or Local Government Unit or Department of Transportation","Full Reporter",1376476,41,"MB","DO",20,10,null,15,null,25,null,904828,null,841909,null,0,null,0,null,"No"]
["Dutchess County Division of Mass Transportation","Poughkeepsie","NY",2010,20010,"City, County or Local Government Unit or Department of Transportation","Full Reporter",423566,41,"DR","DO",15,13,null,1,null,14,null,252677,null,156805,null,0,null,0,null,"No"]
["City of Waukesha Transit Commission","Waukesha","WI",5096,50096,"City, County or Local Government Unit or Department of Transportation","Full Reporter",1376476,41,"CB","PT",13,13,null,16,null,29,null,542184,null,377608,null,0,null,0,null,{"$f":"IF(OR(Z898=\"Q\",X898=\"Q\",V898=\"Q\",T898=\"Q\",R898=\"Q\",P898=\"Q\",N898=\"Q\"),\"Yes\",\"No\")","v":"No"}]
["Butler County Regional Transit Authority","Hamilton","OH",5157,50157,"Independent Public Agency or Authority of Transit Service","Full Reporter",1624827,41,"MB","DO",11,4,null,12,null,16,null,268440,null,261290,null,0,null,0,null,"No"]
["River Bend Transit","Davenport","IA",7049,70049,"Private-Non-Profit Corporation","Full Reporter",280051,41,"DR","PT",10,31,null,8,null,39,null,237286,null,195106,null,0,null,0,null,"No"]
["Butler County Regional Transit Authority","Hamilton","OH",5157,50157,"Independent Public Agency or Authority of Transit Service","Full Reporter",1624827,41,"CB","DO",6,0,null,4,null,4,null,378813,null,364703,null,0,null,0,null,"No"]
["City of Waukesha Transit Commission","Waukesha","WI",5096,50096,"City, County or Local Government Unit or Department of Transportation","Full Reporter",1376476,41,"DR","DO",5,3,null,2,null,5,null,70206,null,58518,null,0,null,0,null,"No"]
["City of Waukesha Transit Commission","Waukesha","WI",5096,50096,"City, County or Local Government Unit or Department of Transportation","Full Reporter",1376476,41,"DR","PT",3,0,null,1,null,1,null,22830,null,22830,null,0,null,0,null,"No"]
["River Bend Transit","Davenport","IA",7049,70049,"Private-Non-Profit Corporation","Full Reporter",280051,41,"MB","PT",1,1,null,0,null,1,null,34419,null,28885,null,0,null,0,null,"No"]
["Pennsylvania Department of Transportation","Harrisburg","PA",3057,30057,"State Government Unit or Department of Transportation","Full Reporter",5441567,40,"CR","PT",40,17,null,0,null,17,null,4229658,null,4229658,null,852176,null,852176,null,"No"]
["Baldwin County Commission","Bay Minette ","AL","4R01-005",40928,"City, County or Local Government Unit or Department of Transportation","Full Reporter",57383,40,"DR","DO",36,9,null,0,null,9,null,880720,null,536586,null,0,null,0,null,"No"]
["Fayetteville Area System of Transit","Fayetteville","NC",4009,40009,"City, County or Local Government Unit or Department of Transportation","Full Reporter",310282,40,"MB","DO",23,75,null,26,null,101,null,1239819,null,1184635,null,0,null,0,null,"No"]
["Solano County Transit","Vallejo","CA",9232,90232,"City, County or Local Government Unit or Department of Transportation","Full Reporter",165074,40,"MB","PT",19,74,null,23,null,97,null,780638,null,729960,null,0,null,0,null,"No"]
["Fayetteville Area System of Transit","Fayetteville","NC",4009,40009,"City, County or Local Government Unit or Department of Transportation","Full Reporter",310282,40,"DR","DO",16,15,null,0,null,15,null,507040,null,465203,null,0,null,0,null,"No"]
["Solano County Transit","Vallejo","CA",9232,90232,"City, County or Local Government Unit or Department of Transportation","Full Reporter",165074,40,"CB","PT",12,141,null,30,null,171,null,1205690,null,1172284,null,0,null,0,null,"No"]
["Solano County Transit","Vallejo","CA",9232,90232,"City, County or Local Government Unit or Department of Transportation","Full Reporter",165074,40,"DR","PT",9,11,null,4,null,15,null,192032,null,166387,null,0,null,0,null,"No"]
["Baldwin County Commission","Bay Minette ","AL","4R01-005",40928,"City, County or Local Government Unit or Department of Transportation","Full Reporter",57383,40,"CB","DO",4,1,null,0,null,1,null,97858,null,66076,null,0,null,0,null,"No"]
["Fayetteville Area System of Transit","Fayetteville","NC",4009,40009,"City, County or Local Government Unit or Department of Transportation","Full Reporter",310282,40,"MB","PT",1,0,null,0,null,0,null,37188,null,27639,null,0,null,0,null,"No"]
["County of Atlantic","Northfield","NJ",2199,20199,"City, County or Local Government Unit or Department of Transportation","Full Reporter",248402,39,"DR","DO",39,102,null,55,null,157,null,655671,null,477439,null,0,null,0,null,"No"]
["Alaska Railroad Corporation","Anchorage","AK",41,41,"State Government Unit or Department of Transportation","Full Reporter",251243,39,"AR","DO",39,3,null,2,null,5,null,1104192,null,1103518,null,187671,null,187447,null,"No"]
["Anne Arundel County","Annapolis","MD","3R03-018",30129,"City, County or Local Government Unit or Department of Transportation","Full Reporter",2203663,39,"DR","DO",34,0,null,5,null,5,null,833085,null,706390,null,0,null,0,null,"No"]
["City of Harrisonburg Department of Public Transportation","Harrisonburg","VA",3094,30094,"City, County or Local Government Unit or Department of Transportation","Full Reporter",66784,39,"MB","DO",32,75,null,19,null,94,null,652654,null,629757,null,0,null,0,null,"No"]
["Belle Urban System - Racine","Racine","WI",5006,50006,"City, County or Local Government Unit or Department of Transportation","Full Reporter",133700,39,"MB","DO",29,37,null,110,null,147,null,1026316,null,957132,null,0,null,0,null,"No"]
["City of Visalia - Visalia City Coach","Visalia","CA",9091,90091,"City, County or Local Government Unit or Department of Transportation","Full Reporter",219454,39,"MB","PT",28,69,null,209,null,278,null,1654061,null,1593360,null,0,null,0,null,"No"]
["Collier Area Transit","Naples","FL",4140,40140,"City, County or Local Government Unit or Department of Transportation","Full Reporter",310298,39,"DR","PT",22,26,null,0,null,26,null,1204263,null,1044873,null,0,null,0,null,"No"]
["Collier Area Transit","Naples","FL",4140,40140,"City, County or Local Government Unit or Department of Transportation","Full Reporter",310298,39,"MB","PT",17,23,null,0,null,23,null,1403815,null,1318931,null,0,null,0,null,"No"]
["City of Visalia - Visalia City Coach","Visalia","CA",9091,90091,"City, County or Local Government Unit or Department of Transportation","Full Reporter",219454,39,"DR","PT",8,7,null,3,null,10,null,175668,null,158347,null,0,null,0,null,"No"]
["City of Harrisonburg Department of Public Transportation","Harrisonburg","VA",3094,30094,"City, County or Local Government Unit or Department of Transportation","Full Reporter",66784,39,"DR","DO",7,3,null,0,null,3,null,134236,null,125188,null,0,null,0,null,"No"]
["Belle Urban System - Racine","Racine","WI",5006,50006,"City, County or Local Government Unit or Department of Transportation","Full Reporter",133700,39,"DR","DO",7,7,null,12,null,19,null,130030,null,118174,null,0,null,0,null,"No"]
["Anne Arundel County","Annapolis","MD","3R03-018",30129,"City, County or Local Government Unit or Department of Transportation","Full Reporter",2203663,39,"MB","PT",5,0,null,4,null,4,null,352146,null,311943,null,0,null,0,null,"No"]
["City of Visalia - Visalia City Coach","Visalia","CA",9091,90091,"City, County or Local Government Unit or Department of Transportation","Full Reporter",219454,39,"CB","PT",3,0,null,0,null,0,null,139030,null,138203,null,0,null,0,null,"No"]
["Belle Urban System - Racine","Racine","WI",5006,50006,"City, County or Local Government Unit or Department of Transportation","Full Reporter",133700,39,"CB","PT",3,7,null,10,null,17,null,221288,null,216268,null,0,null,0,null,"No"]
["University of Michigan Parking and Transportation Services","Ann Arbor","MI",5158,50158,"University","Full Reporter",306022,38,"MB","DO",38,78,null,252,null,330,null,1316218,null,1090435,null,0,null,0,null,"No"]
["Alamo Area Council of Governments","San Antonio ","TX",6130,60130,"MPO, COG or Other Planning Agency","Full Reporter",1758210,38,"DR","DO",38,1,null,6,null,7,null,921319,null,704797,null,0,null,0,null,"No"]
["Licking County Transit Board","Newark","OH",5163,50163,"City, County or Local Government Unit or Department of Transportation","Full Reporter",76068,38,"DR","PT",38,57,null,20,null,77,null,1837504,null,1542804,null,0,null,0,null,"No"]
["Valley Metro Rail, Inc.","Phoenix","AZ",9209,90209,"Other Publicly-Owned or Privately Chartered Corporation","Full Reporter",3629114,38,"LR","PT",38,75,null,153,null,228,null,2961035,null,2912029,null,1480019,null,1456016,null,"No"]
["Buncombe County","Asheville ","NC",4224,40224,"City, County or Local Government Unit or Department of Transportation","Full Reporter",280648,38,"DR","PT",35,66,null,31,null,97,null,1295493,null,1034910,null,0,null,0,null,"No"]
["Bloomington Public Transportation Corporation","Bloomington","IN",5110,50110,"Independent Public Agency or Authority of Transit Service","Full Reporter",108657,38,"MB","DO",30,151,null,125,null,276,null,1035279,null,995276,null,0,null,0,null,"No"]
["Santa Fe Trails - City of Santa Fe","Santa Fe","NM",6077,60077,"City, County or Local Government Unit or Department of Transportation","Full Reporter",89284,38,"MB","DO",26,15,null,37,null,52,null,922459,null,873217,null,0,null,0,null,"No"]
["Green Bay Metro","Green Bay","WI",5002,50002,"City, County or Local Government Unit or Department of Transportation","Full Reporter",206520,38,"MB","DO",25,64,null,191,null,255,null,1154383,null,1136885,null,0,null,0,null,"No"]
["Beaver County Transit Authority","Rochester","PA",3023,30023,"Independent Public Agency or Authority of Transit Service","Full Reporter",1733853,38,"MB","DO",20,67,null,16,null,83,null,1074419,null,800751,null,0,null,0,null,"No"]
["Rogue Valley Transportation District","Medford","OR",34,34,"Independent Public Agency or Authority of Transit Service","Full Reporter",154081,38,"DR","PT",20,10,null,2,null,12,null,488485,null,442682,null,0,null,0,null,"No"]
["Rogue Valley Transportation District","Medford","OR",34,34,"Independent Public Agency or Authority of Transit Service","Full Reporter",154081,38,"MB","DO",18,41,null,60,null,101,null,631012,null,592205,null,0,null,0,null,"No"]
["Beaver County Transit Authority","Rochester","PA",3023,30023,"Independent Public Agency or Authority of Transit Service","Full Reporter",1733853,38,"DR","DO",18,16,null,11,null,27,null,514516,null,452800,null,0,null,0,null,"No"]
["Placer County Department of Public Works and Facilities","Auburn","CA",9196,90196,"City, County or Local Government Unit or Department of Transportation","Full Reporter",1723634,38,"MB","DO",15,13,null,2,null,15,null,1358997,null,1244702,null,0,null,0,null,"No"]
["Green Bay Metro","Green Bay","WI",5002,50002,"City, County or Local Government Unit or Department of Transportation","Full Reporter",206520,38,"DR","PT",13,4,null,16,null,20,null,366137,null,303308,null,0,null,0,null,"No"]
["Santa Fe Trails - City of Santa Fe","Santa Fe","NM",6077,60077,"City, County or Local Government Unit or Department of Transportation","Full Reporter",89284,38,"DR","DO",12,4,null,12,null,16,null,287448,null,249929,null,0,null,0,null,"No"]
["Placer County Department of Public Works and Facilities","Auburn","CA",9196,90196,"City, County or Local Government Unit or Department of Transportation","Full Reporter",1723634,38,"VP","PT",10,0,null,0,null,0,null,250910,null,250910,null,0,null,0,null,"No"]
["Bloomington Public Transportation Corporation","Bloomington","IN",5110,50110,"Independent Public Agency or Authority of Transit Service","Full Reporter",108657,38,"DR","DO",8,3,null,0,null,3,null,154944,null,136982,null,0,null,0,null,"No"]
["Placer County Department of Public Works and Facilities","Auburn","CA",9196,90196,"City, County or Local Government Unit or Department of Transportation","Full Reporter",1723634,38,"DR","PT",7,8,null,0,null,8,null,176894,null,144337,null,0,null,0,null,"No"]
["Placer County Department of Public Works and Facilities","Auburn","CA",9196,90196,"City, County or Local Government Unit or Department of Transportation","Full Reporter",1723634,38,"CB","PT",4,0,null,0,null,0,null,126883,null,101281,null,0,null,0,null,"No"]
["Buncombe County","Asheville ","NC",4224,40224,"City, County or Local Government Unit or Department of Transportation","Full Reporter",280648,38,"MB","PT",3,11,null,7,null,18,null,162080,null,138959,null,0,null,0,null,"No"]
["Placer County Department of Public Works and Facilities","Auburn","CA",9196,90196,"City, County or Local Government Unit or Department of Transportation","Full Reporter",1723634,38,"MB","PT",1,1,null,0,null,1,null,65710,null,62947,null,0,null,0,null,"No"]
["Regional Planning Commission of Greater Birmingham","Birmingham","AL",4169,40169,"MPO, COG or Other Planning Agency","Full Reporter",749495,37,"VP","PT",37,1,null,0,null,1,null,995877,null,995877,null,0,null,0,null,"No"]
["Knoxville-Knox County Community Action Committee","Knoxville","TN",4171,40171,"City, County or Local Government Unit or Department of Transportation","Full Reporter",558696,37,"DR","DO",37,10,null,26,null,36,null,1515416,null,1342785,null,0,null,0,null,"No"]
["City of Rome Transit Department","Rome","GA",4058,40058,"City, County or Local Government Unit or Department of Transportation","Full Reporter",60851,37,"MB","DO",31,94,null,19,null,113,null,526971,null,499985,null,0,null,0,null,"No"]
["City of Plymouth","City of Plymouth","MN",5219,50516,"City, County or Local Government Unit or Department of Transportation","Full Reporter",2650890,37,"MB","PT",29,4,null,11,null,15,null,919633,null,503468,null,0,null,0,null,"No"]
["City of Columbia","Columbia","MO",7016,70016,"City, County or Local Government Unit or Department of Transportation","Full Reporter",124748,37,"MB","DO",28,160,null,3,null,163,null,818602,null,808648,null,0,null,0,null,"No"]
["Greater Lynchburg Transit Company","Lynchburg","VA",3008,30008,"Independent Public Agency or Authority of Transit Service","Full Reporter",116636,37,"MB","DO",28,12,null,31,null,43,null,1061243,null,1028025,null,0,null,0,null,"No"]
["The Tri-State Transit Authority","Huntington","WV",3002,30002,"Independent Public Agency or Authority of Transit Service","Full Reporter",202637,37,"MB","DO",27,2,null,275,null,277,null,1039992,null,984751,null,0,null,0,null,"No"]
["Metropolitan Evansville Transit System","Evansville","IN",5043,50043,"City, County or Local Government Unit or Department of Transportation","Full Reporter",229351,37,"MB","DO",24,25,null,17,null,42,null,1251681,null,1228286,null,0,null,0,null,"No"]
["Topeka Metropolitan Transit Authority","Topeka","KS",7014,70014,"Independent Public Agency or Authority of Transit Service","Full Reporter",150003,37,"MB","DO",22,25,null,30,null,55,null,882940,null,854933,null,0,null,0,null,"No"]
["Williamsburg Area Transit Authority","Williamsburg","VA",3076,30076,"Independent Public Agency or Authority of Transit Service","Full Reporter",75689,37,"MB","DO",20,98,null,4,null,102,null,1085276,null,1041014,null,0,null,0,null,"No"]
["City of Lawrence","Lawrence","KS",7048,70048,"City, County or Local Government Unit or Department of Transportation","Full Reporter",88053,37,"DR","PT",19,4,null,18,null,22,null,479741,null,429401,null,0,null,0,null,"No"]
["Pomona Valley Transportation Authority","La Verne","CA",null,99425,"Independent Public Agency or Authority of Transit Service","Full Reporter",12150996,37,"DR","PT",19,12,null,0,null,12,null,346551,null,295431,null,0,null,0,null,"No"]
["City of Lawrence","Lawrence","KS",7048,70048,"City, County or Local Government Unit or Department of Transportation","Full Reporter",88053,37,"MB","PT",18,13,null,107,null,120,null,821498,null,771856,null,0,null,0,null,"No"]
["Metropolitan Evansville Transit System","Evansville","IN",5043,50043,"City, County or Local Government Unit or Department of Transportation","Full Reporter",229351,37,"DR","DO",13,5,null,3,null,8,null,373373,null,344939,null,0,null,0,null,{"$f":"IF(OR(Z962=\"Q\",X962=\"Q\",V962=\"Q\",T962=\"Q\",R962=\"Q\",P962=\"Q\",N962=\"Q\"),\"Yes\",\"No\")","v":"No"}]
["Williamsburg Area Transit Authority","Williamsburg","VA",3076,30076,"Independent Public Agency or Authority of Transit Service","Full Reporter",75689,37,"MB","PT",13,7,null,0,null,7,null,250619,null,231641,null,0,null,0,null,"No"]
["The Tri-State Transit Authority","Huntington","WV",3002,30002,"Independent Public Agency or Authority of Transit Service","Full Reporter",202637,37,"DR","DO",10,3,null,87,null,90,null,355734,null,319725,null,0,null,0,null,"No"]
["Greater Lynchburg Transit Company","Lynchburg","VA",3008,30008,"Independent Public Agency or Authority of Transit Service","Full Reporter",116636,37,"DR","DO",9,1,null,15,null,16,null,194181,null,173630,null,0,null,0,null,"No"]
["City of Columbia","Columbia","MO",7016,70016,"City, County or Local Government Unit or Department of Transportation","Full Reporter",124748,37,"DR","DO",9,8,null,1,null,9,null,346040,null,297120,null,0,null,0,null,"No"]
["City of Plymouth","City of Plymouth","MN",5219,50516,"City, County or Local Government Unit or Department of Transportation","Full Reporter",2650890,37,"DR","PT",8,0,null,2,null,2,null,243634,null,170443,null,0,null,0,null,"No"]
["Topeka Metropolitan Transit Authority","Topeka","KS",7014,70014,"Independent Public Agency or Authority of Transit Service","Full Reporter",150003,37,"DR","DO",8,6,null,9,null,15,null,216109,null,178475,null,0,null,0,null,"No"]
["City of Rome Transit Department","Rome","GA",4058,40058,"City, County or Local Government Unit or Department of Transportation","Full Reporter",60851,37,"DR","DO",6,6,null,1,null,7,null,125469,null,117256,null,0,null,0,null,"No"]
["Williamsburg Area Transit Authority","Williamsburg","VA",3076,30076,"Independent Public Agency or Authority of Transit Service","Full Reporter",75689,37,"DR","DO",4,7,null,0,null,7,null,99965,null,68784,null,0,null,0,null,"No"]
["Unitrans - City of Davis/ASUCD","Davis","CA",9142,90142,"University","Full Reporter",72794,36,"MB","DO",36,81,null,14,null,95,null,950464,null,875283,null,0,null,0,null,"No"]
["Muncie Indiana Transit System","Muncie","IN",5054,50054,"City, County or Local Government Unit or Department of Transportation","Full Reporter",90580,36,"MB","DO",26,0,null,32,null,32,null,878247,null,804851,null,0,null,0,null,"No"]
["Bloomington-Normal Public Transit System","Normal","IL",5047,50047,"Independent Public Agency or Authority of Transit Service","Full Reporter",132600,36,"MB","DO",23,45,null,300,null,345,null,1334158,null,1287354,null,0,null,0,null,"No"]
["Tahoe Transportation District","Zephyr Cove","NV","9R02-137",91092,"Independent Public Agency or Authority of Transit Service","Full Reporter",210000,36,"MB","PT",21,116,null,27,null,143,null,473112,null,442298,null,0,null,0,null,"No"]
["Transit Services of Frederick County","Frederick","MD",3072,30072,"City, County or Local Government Unit or Department of Transportation","Full Reporter",141576,36,"DR","DO",18,2,null,2,null,4,null,624646,null,464893,null,0,null,0,null,"No"]
["Transit Services of Frederick County","Frederick","MD",3072,30072,"City, County or Local Government Unit or Department of Transportation","Full Reporter",141576,36,"MB","DO",18,21,null,43,null,64,null,694045,null,654929,null,0,null,0,null,"No"]
["Bloomington-Normal Public Transit System","Normal","IL",5047,50047,"Independent Public Agency or Authority of Transit Service","Full Reporter",132600,36,"DR","DO",13,5,null,14,null,19,null,408808,null,352242,null,0,null,0,null,"No"]
["Muncie Indiana Transit System","Muncie","IN",5054,50054,"City, County or Local Government Unit or Department of Transportation","Full Reporter",90580,36,"DR","DO",10,0,null,10,null,10,null,251638,null,222595,null,0,null,0,null,"No"]
["Tahoe Transportation District","Zephyr Cove","NV","9R02-137",91092,"Independent Public Agency or Authority of Transit Service","Full Reporter",210000,36,"CB","PT",8,41,null,6,null,47,null,339321,null,267245,null,0,null,0,null,"No"]
["Tahoe Transportation District","Zephyr Cove","NV","9R02-137",91092,"Independent Public Agency or Authority of Transit Service","Full Reporter",210000,36,"DR","PT",5,8,null,3,null,11,null,96602,null,86688,null,0,null,0,null,"No"]
["Bay County Transportation Planning Organization","Panama City","FL",4185,40185,"MPO, COG or Other Planning Agency","Full Reporter",143280,35,"DR","PT",24,7,null,7,null,14,null,398086,null,368086,null,0,null,0,null,"No"]
["City of Fargo, DBA: Metropolitan Area Transit","Fargo","ND",8003,80003,"City, County or Local Government Unit or Department of Transportation","Full Reporter",176676,35,"MB","PT",23,44,null,28,null,72,null,986230,null,957430,null,0,null,0,null,"No"]
["City of Fargo, DBA: Metropolitan Area Transit","Fargo","ND",8003,80003,"City, County or Local Government Unit or Department of Transportation","Full Reporter",176676,35,"DR","PT",12,0,null,1,null,1,null,331495,null,320998,null,0,null,0,null,"No"]
["Bay County Transportation Planning Organization","Panama City","FL",4185,40185,"MPO, COG or Other Planning Agency","Full Reporter",143280,35,"MB","PT",11,6,null,5,null,11,null,552539,null,521765,null,0,null,0,null,"No"]
["City of Glendale","Glendale","CA",null,99423,"City, County or Local Government Unit or Department of Transportation","Full Reporter",12150996,34,"MB","PT",28,27,null,0,null,27,null,746025,null,703061,null,0,null,0,null,"No"]
["Woods Hole, Martha's Vineyard and Nantucket Steamship Authority","Woods Hole","MA",null,10183,"Independent Public Agency or Authority of Transit Service","Full Reporter",246695,34,"MB","DO",24,0,null,0,null,0,null,370550,"Q",185275,"Q",0,null,0,null,"Yes"]
["City of Santa Rosa","Santa Rosa","CA",9017,90017,"City, County or Local Government Unit or Department of Transportation","Full Reporter",308231,34,"MB","DO",23,35,null,43,null,78,null,958550,null,929432,null,0,null,0,null,"No"]
["Altoona Metro Transit","Altoona","PA",3011,30011,"Independent Public Agency or Authority of Transit Service","Full Reporter",79930,34,"MB","DO",21,23,null,30,null,53,null,510813,null,494428,null,0,null,0,null,"No"]
["Yuba-Sutter Transit Authority","Marysville","CA",9061,90061,"Independent Public Agency or Authority of Transit Service","Full Reporter",116719,34,"MB","PT",14,36,null,3,null,39,null,626843,null,589183,null,0,null,0,null,"No"]
["Altoona Metro Transit","Altoona","PA",3011,30011,"Independent Public Agency or Authority of Transit Service","Full Reporter",79930,34,"DR","PT",12,3,null,0,null,3,null,50881,null,42023,null,0,null,0,null,"No"]
["City of Santa Rosa","Santa Rosa","CA",9017,90017,"City, County or Local Government Unit or Department of Transportation","Full Reporter",308231,34,"DR","PT",10,0,null,4,null,4,null,255299,null,228351,null,0,null,0,null,"No"]
["Yuba-Sutter Transit Authority","Marysville","CA",9061,90061,"Independent Public Agency or Authority of Transit Service","Full Reporter",116719,34,"DR","PT",10,20,null,12,null,32,null,365673,null,324815,null,0,null,0,null,"No"]
["Woods Hole, Martha's Vineyard and Nantucket Steamship Authority","Woods Hole","MA",null,10183,"Independent Public Agency or Authority of Transit Service","Full Reporter",246695,34,"FB","DO",10,0,null,0,null,0,null,336250,null,335524,"Q",0,null,0,null,"Yes"]
["Yuba-Sutter Transit Authority","Marysville","CA",9061,90061,"Independent Public Agency or Authority of Transit Service","Full Reporter",116719,34,"CB","PT",10,12,null,2,null,14,null,493337,null,321262,null,0,null,0,null,"No"]
["City of Glendale","Glendale","CA",null,99423,"City, County or Local Government Unit or Department of Transportation","Full Reporter",12150996,34,"DR","PT",6,9,null,0,null,9,null,164854,null,131983,null,0,null,0,null,"No"]
["Altoona Metro Transit","Altoona","PA",3011,30011,"Independent Public Agency or Authority of Transit Service","Full Reporter",79930,34,"DR","DO",1,1,null,1,null,2,null,2174,null,1035,null,0,null,0,null,"No"]
["City of Santa Rosa","Santa Rosa","CA",9017,90017,"City, County or Local Government Unit or Department of Transportation","Full Reporter",308231,34,"MB","PT",1,0,null,2,null,2,null,27233,null,21068,null,0,null,0,null,"No"]
["Washington County Transit","West Bend","WI",5160,50160,"City, County or Local Government Unit or Department of Transportation","Full Reporter",1376476,33,"DR","PT",25,7,null,0,null,7,null,1287781,null,1124185,null,0,null,0,null,"No"]
["Missoula Urban Transportation District","Missoula","MT",8009,80009,"Independent Public Agency or Authority of Transit Service","Full Reporter",82157,33,"MB","DO",24,15,null,8,null,23,null,760803,null,719573,null,0,null,0,null,"No"]
["Council on Aging of St. Lucie, Inc.","Fort Pierce","FL",4097,40097,"Private Provider Reporting on Behalf of a Public Entity","Full Reporter",376047,33,"DR","DO",24,21,null,0,null,21,null,581144,null,532684,null,0,null,0,null,"No"]
["City of Brownsville - Brownsville Metro","Brownsville","TX",6014,60014,"City, County or Local Government Unit or Department of Transportation","Full Reporter",217585,33,"MB","DO",19,229,null,99,null,328,null,791226,null,719791,null,0,null,0,null,"No"]
["Council on Aging of St. Lucie, Inc.","Fort Pierce","FL",4097,40097,"Private Provider Reporting on Behalf of a Public Entity","Full Reporter",376047,33,"MB","DO",9,5,null,0,null,5,null,378431,null,364597,null,0,null,0,null,"No"]
["Missoula Urban Transportation District","Missoula","MT",8009,80009,"Independent Public Agency or Authority of Transit Service","Full Reporter",82157,33,"DR","DO",9,1,null,2,null,3,null,153540,null,142667,null,0,null,0,null,"No"]
["Washington County Transit","West Bend","WI",5160,50160,"City, County or Local Government Unit or Department of Transportation","Full Reporter",1376476,33,"CB","PT",8,1,null,2,null,3,null,430867,null,217323,null,0,null,0,null,"No"]
["City of Brownsville - Brownsville Metro","Brownsville","TX",6014,60014,"City, County or Local Government Unit or Department of Transportation","Full Reporter",217585,33,"DR","DO",8,3,null,1,null,4,null,174778,null,156464,null,0,null,0,null,"No"]
["City of Brownsville - Brownsville Metro","Brownsville","TX",6014,60014,"City, County or Local Government Unit or Department of Transportation","Full Reporter",217585,33,"CB","PT",6,18,null,4,null,22,null,681797,null,668898,null,0,null,0,null,"No"]
["North Carolina State University Transportation Department","Raleigh","NC",4147,40147,"University","Full Reporter",884891,32,"MB","PT",32,4,null,10,null,14,null,803887,null,754190,null,0,null,0,null,"No"]
["Monsey New Square Trails Corporation","Spring Valley","NY",2135,20135,"Private-For-Profit Corporation","Full Reporter",18351295,32,"CB","DO",32,18,null,36,null,54,null,1176428,null,1096406,null,0,null,0,null,"No"]
["The Woodlands Township","The Woodlands","TX",6134,60134,"City, County or Local Government Unit or Department of Transportation","Full Reporter",239938,32,"CB","PT",30,0,null,11,null,11,null,1026541,null,940659,null,0,null,0,null,"No"]
["Saginaw Transit Authority Regional Service","Saginaw","MI",5039,50039,"Independent Public Agency or Authority of Transit Service","Full Reporter",126265,32,"MB","DO",28,5,null,100,null,105,null,558080,null,558080,null,0,null,0,null,"No"]
["Western Maine Transportation Services, Inc.","Auburn","ME",1098,10098,"Private-Non-Profit Corporation","Full Reporter",59397,32,"DR","DO",20,117,null,309,null,426,null,532500,null,356685,null,0,null,0,null,"No"]
["Fayette Area Coordinated Transportation","Lemont Furnace","PA",3087,30087,"City, County or Local Government Unit or Department of Transportation","Full Reporter",51370,32,"DR","DO",20,9,null,24,null,33,null,883143,null,746227,null,0,null,0,null,"No"]
["City of Huntsville, Alabama - Public Transportation Division","Huntsville","AL",4071,40071,"City, County or Local Government Unit or Department of Transportation","Full Reporter",286692,32,"DR","DO",19,12,null,94,null,106,null,531078,null,493795,null,0,null,0,null,"No"]
["Northern Arizona Intergovernmental Public Transportation Authority","Flagstaff","AZ",9219,90219,"Independent Public Agency or Authority of Transit Service","Full Reporter",71957,32,"MB","DO",18,95,null,51,null,146,null,883792,null,851565,null,0,null,0,null,"No"]
["El Dorado County Transit Authority","Diamond Springs","CA",9229,90229,"Independent Public Agency or Authority of Transit Service","Full Reporter",1723634,32,"DR","DO",15,16,null,5,null,21,null,450430,null,352999,null,0,null,0,null,"No"]
["City of Huntsville, Alabama - Public Transportation Division","Huntsville","AL",4071,40071,"City, County or Local Government Unit or Department of Transportation","Full Reporter",286692,32,"MB","DO",13,35,null,162,null,197,null,573203,null,570916,null,0,null,0,null,"No"]
["Western Maine Transportation Services, Inc.","Auburn","ME",1098,10098,"Private-Non-Profit Corporation","Full Reporter",59397,32,"MB","DO",12,53,null,126,null,179,null,155670,null,131404,null,0,null,0,null,"No"]
["El Dorado County Transit Authority","Diamond Springs","CA",9229,90229,"Independent Public Agency or Authority of Transit Service","Full Reporter",1723634,32,"CB","DO",11,23,null,11,null,34,null,627252,null,462828,null,0,null,0,null,"No"]
["Northern Arizona Intergovernmental Public Transportation Authority","Flagstaff","AZ",9219,90219,"Independent Public Agency or Authority of Transit Service","Full Reporter",71957,32,"VP","PT",8,0,null,0,null,0,null,50770,null,50770,null,0,null,0,null,"No"]
["Fayette Area Coordinated Transportation","Lemont Furnace","PA",3087,30087,"City, County or Local Government Unit or Department of Transportation","Full Reporter",51370,32,"MB","DO",7,27,null,44,null,71,null,365224,null,348943,null,0,null,0,null,"No"]
["North Township of Lake County Dial-A-Ride","Hammond","IN",5103,50103,"City, County or Local Government Unit or Department of Transportation","Full Reporter",8608208,32,"DR","DO",7,0,null,3,null,3,null,128023,null,111269,null,0,null,0,null,"No"]
["Northern Arizona Intergovernmental Public Transportation Authority","Flagstaff","AZ",9219,90219,"Independent Public Agency or Authority of Transit Service","Full Reporter",71957,32,"DR","DO",6,18,null,25,null,43,null,121559,null,112971,null,0,null,0,null,"No"]
["El Dorado County Transit Authority","Diamond Springs","CA",9229,90229,"Independent Public Agency or Authority of Transit Service","Full Reporter",1723634,32,"MB","DO",6,28,null,24,null,52,null,378868,null,323918,null,0,null,0,null,"No"]
["Saginaw Transit Authority Regional Service","Saginaw","MI",5039,50039,"Independent Public Agency or Authority of Transit Service","Full Reporter",126265,32,"DR","DO",4,1,null,20,null,21,null,147613,null,141201,null,0,null,0,null,"No"]
["Fayette Area Coordinated Transportation","Lemont Furnace","PA",3087,30087,"City, County or Local Government Unit or Department of Transportation","Full Reporter",51370,32,"MB","PT",3,14,null,20,null,34,null,199982,null,179600,null,0,null,0,null,"No"]
["The Woodlands Township","The Woodlands","TX",6134,60134,"City, County or Local Government Unit or Department of Transportation","Full Reporter",239938,32,"MB","PT",2,0,null,2,null,2,null,39538,null,38992,null,0,null,0,null,{"$f":"IF(OR(Z1026=\"Q\",X1026=\"Q\",V1026=\"Q\",T1026=\"Q\",R1026=\"Q\",P1026=\"Q\",N1026=\"Q\"),\"Yes\",\"No\")","v":"No"}]
["Fayette Area Coordinated Transportation","Lemont Furnace","PA",3087,30087,"City, County or Local Government Unit or Department of Transportation","Full Reporter",51370,32,"DR","PT",2,2,null,5,null,7,null,43802,null,39009,null,0,null,0,null,"No"]
["Billings Metropolitan Transit","Billings","MT",8004,80004,"City, County or Local Government Unit or Department of Transportation","Full Reporter",114773,31,"MB","DO",20,248,null,283,null,531,null,616039,null,571224,null,0,null,0,null,"No"]
["Decatur Public Transit System","Decatur","IL",5061,50061,"City, County or Local Government Unit or Department of Transportation","Full Reporter",93863,31,"MB","DO",19,163,null,72,null,235,null,971500,null,961794,null,0,null,0,null,"No"]
["Billings Metropolitan Transit","Billings","MT",8004,80004,"City, County or Local Government Unit or Department of Transportation","Full Reporter",114773,31,"DR","DO",11,74,null,124,null,198,null,191425,null,148288,null,0,null,0,null,"No"]
["Decatur Public Transit System","Decatur","IL",5061,50061,"City, County or Local Government Unit or Department of Transportation","Full Reporter",93863,31,"DR","DO",6,2,null,0,null,2,null,116385,null,94799,null,0,null,0,null,"No"]
["Mid-Ohio Regional Planning Commission","Columbus","OH",5191,50191,"MPO, COG or Other Planning Agency","Full Reporter",1368035,30,"VP","PT",30,0,null,0,null,0,null,688416,null,688416,null,0,null,0,null,"No"]
["Pima Association of Governments","Tucson","AZ",9222,90222,"MPO, COG or Other Planning Agency","Full Reporter",843168,30,"VP","PT",30,0,null,0,null,0,null,682115,null,682115,null,0,null,0,null,"No"]
["City of Kokomo","Kokomo","IN",5145,50145,"City, County or Local Government Unit or Department of Transportation","Full Reporter",62182,30,"DR","DO",25,7,null,0,null,7,null,418023,null,371989,null,0,null,0,null,"No"]
["Ozaukee County Transit Services","Port Washington","WI",5161,50161,"City, County or Local Government Unit or Department of Transportation","Full Reporter",1376476,30,"DR","PT",23,8,null,2,null,10,null,1209517,null,1113205,null,0,null,0,null,"No"]
["LaCrosse Municipal Transit Utility","La Crosse","WI",5004,50004,"City, County or Local Government Unit or Department of Transportation","Full Reporter",100868,30,"MB","DO",16,89,null,128,null,217,null,853771,null,830979,null,0,null,0,null,"No"]
["LaCrosse Municipal Transit Utility","La Crosse","WI",5004,50004,"City, County or Local Government Unit or Department of Transportation","Full Reporter",100868,30,"DR","PT",14,6,null,185,null,191,null,305296,null,281540,null,0,null,0,null,"No"]
["GO Transit","Oshkosh","WI",5009,50009,"City, County or Local Government Unit or Department of Transportation","Full Reporter",74495,30,"MB","DO",9,58,null,70,null,128,null,497300,null,483085,null,0,null,0,null,"No"]
["Ozaukee County Transit Services","Port Washington","WI",5161,50161,"City, County or Local Government Unit or Department of Transportation","Full Reporter",1376476,30,"CB","DO",7,3,null,4,null,7,null,274045,null,191112,null,0,null,0,null,"No"]
["City of Kokomo","Kokomo","IN",5145,50145,"City, County or Local Government Unit or Department of Transportation","Full Reporter",62182,30,"MB","DO",5,1,null,0,null,1,null,155394,null,145619,null,0,null,0,null,"No"]
["GO Transit","Oshkosh","WI",5009,50009,"City, County or Local Government Unit or Department of Transportation","Full Reporter",74495,30,"MB","PT",1,0,null,3,null,3,null,74036,null,68104,null,0,null,0,null,"No"]
["New York City Department of Transportation","New York","NY",2082,20082,"City, County or Local Government Unit or Department of Transportation","Full Reporter",18351295,29,"MB","PT",25,9,null,33,null,42,null,1257802,null,607498,null,0,null,0,null,"No"]
["Cedar Rapids Transit","Cedar Rapids","IA",7008,70008,"City, County or Local Government Unit or Department of Transportation","Full Reporter",177844,29,"MB","DO",22,25,null,78,null,103,null,1000135,null,978000,null,0,null,0,null,"No"]
["Indian River County","Vero Beach","FL",4104,40104,"City, County or Local Government Unit or Department of Transportation","Full Reporter",149422,29,"MB","PT",16,2,null,5,null,7,null,1176160,null,1038784,null,0,null,0,null,"No"]
["Redding Area Bus Authority","Redding","CA",9093,90093,"Independent Public Agency or Authority of Transit Service","Full Reporter",117731,29,"DR","PT",16,3,null,12,null,15,null,342555,null,302227,null,0,null,0,null,"No"]
["Redding Area Bus Authority","Redding","CA",9093,90093,"Independent Public Agency or Authority of Transit Service","Full Reporter",117731,29,"MB","PT",13,4,null,10,null,14,null,718651,null,690454,null,0,null,0,null,"No"]
["Indian River County","Vero Beach","FL",4104,40104,"City, County or Local Government Unit or Department of Transportation","Full Reporter",149422,29,"DR","PT",13,5,null,11,null,16,null,460338,null,404475,null,0,null,0,null,"No"]
["Cedar Rapids Transit","Cedar Rapids","IA",7008,70008,"City, County or Local Government Unit or Department of Transportation","Full Reporter",177844,29,"DR","PT",7,6,null,19,null,25,null,302664,null,271261,null,0,null,0,null,"No"]
["New York City Department of Transportation","New York","NY",2082,20082,"City, County or Local Government Unit or Department of Transportation","Full Reporter",18351295,29,"FB","DO",4,20,null,24,null,44,null,195177,null,193954,null,0,null,0,null,"No"]
["Laguna Beach Municipal Transit","Laguna Beach","CA",9119,90119,"City, County or Local Government Unit or Department of Transportation","Full Reporter",583681,28,"MB","DO",28,71,null,91,null,162,null,378658,null,362922,null,0,null,0,null,"No"]
["University of Iowa","Iowa City","IA",7019,70019,"University","Full Reporter",106621,28,"MB","DO",25,23,null,56,null,79,null,752749,null,732843,null,0,null,0,null,"No"]
["Charlotte County Transit Division","Punta Gorda","FL",4129,40129,"City, County or Local Government Unit or Department of Transportation","Full Reporter",169541,28,"DR","PT",22,32,null,0,null,32,null,834010,null,793788,null,0,null,0,null,"No"]
["Santa Maria Area Transit","Santa Maria","CA",9087,90087,"City, County or Local Government Unit or Department of Transportation","Full Reporter",130447,28,"MB","PT",19,34,null,0,null,34,null,951580,null,873683,null,0,null,0,null,"No"]
["Ozark Regional Transit","Springdale","AR",6072,60072,"Independent Public Agency or Authority of Transit Service","Full Reporter",295083,28,"MB","DO",16,61,null,121,null,182,null,953090,null,883533,null,0,null,0,null,"No"]
["Ozark Regional Transit","Springdale","AR",6072,60072,"Independent Public Agency or Authority of Transit Service","Full Reporter",295083,28,"DR","DO",12,6,null,12,null,18,null,352807,null,300133,null,0,null,0,null,"No"]
["The Gulf Coast Center","Texas City","TX",6082,60082,"Independent Public Agency or Authority of Transit Service","Full Reporter",106383,28,"MB","DO",12,24,null,29,null,53,null,745793,null,651267,null,0,null,0,null,"No"]
["Santa Maria Area Transit","Santa Maria","CA",9087,90087,"City, County or Local Government Unit or Department of Transportation","Full Reporter",130447,28,"DR","PT",9,5,null,0,null,5,null,176777,null,158623,"Q",0,null,0,null,"Yes"]
["Charlotte County Transit Division","Punta Gorda","FL",4129,40129,"City, County or Local Government Unit or Department of Transportation","Full Reporter",169541,28,"VP","DO",6,0,null,0,null,0,null,68685,null,68685,null,0,null,0,null,"No"]
["The Gulf Coast Center","Texas City","TX",6082,60082,"Independent Public Agency or Authority of Transit Service","Full Reporter",106383,28,"DR","DO",4,2,null,11,null,13,null,129286,null,108568,null,0,null,0,null,"No"]
["University of Iowa","Iowa City","IA",7019,70019,"University","Full Reporter",106621,28,"DR","DO",3,4,null,19,null,23,null,63032,null,56786,null,0,null,0,null,"No"]
["Shenango Valley Shuttle Service","Hermitage","PA",3055,30055,"City, County or Local Government Unit or Department of Transportation","Full Reporter",387550,27,"DR","DO",22,9,null,2,null,11,null,671112,null,559340,null,0,null,0,null,"No"]
["City of Montgomery-Montgomery Area Transit System","Montgomery","AL",4044,40044,"City, County or Local Government Unit or Department of Transportation","Full Reporter",263907,27,"MB","DO",19,55,null,22,null,77,null,1077406,null,1065977,null,0,null,0,null,"No"]
["County Commissioners of Charles County, MD","Port Tobacco","MD",3088,30088,"City, County or Local Government Unit or Department of Transportation","Full Reporter",109919,27,"MB","PT",16,96,null,5,null,101,null,1339424,null,1286286,null,0,null,0,null,"No"]
["Handitran Special Transit Division - City of Arlington","Arlington","TX",6041,60041,"City, County or Local Government Unit or Department of Transportation","Full Reporter",5121892,27,"DR","DO",16,0,null,0,null,0,null,380144,null,343920,null,0,null,0,null,"No"]
["City of Jackson, Department of Planning and Development, Transit Services Division","Jackson","MS",4015,40015,"City, County or Local Government Unit or Department of Transportation","Full Reporter",351478,27,"MB","PT",14,14,null,1185,null,1199,null,772732,null,746497,null,0,null,0,null,"No"]
["City of Jackson, Department of Planning and Development, Transit Services Division","Jackson","MS",4015,40015,"City, County or Local Government Unit or Department of Transportation","Full Reporter",351478,27,"DR","PT",13,7,null,362,null,369,null,311912,null,275906,null,0,null,0,null,"No"]
["County Commissioners of Charles County, MD","Port Tobacco","MD",3088,30088,"City, County or Local Government Unit or Department of Transportation","Full Reporter",109919,27,"DR","PT",11,0,null,4,null,4,null,283687,null,241439,null,0,null,0,null,"No"]
["City of Montgomery-Montgomery Area Transit System","Montgomery","AL",4044,40044,"City, County or Local Government Unit or Department of Transportation","Full Reporter",263907,27,"DR","DO",8,7,null,1,null,8,null,282642,null,245659,null,0,null,0,null,"No"]
["Shenango Valley Shuttle Service","Hermitage","PA",3055,30055,"City, County or Local Government Unit or Department of Transportation","Full Reporter",387550,27,"MB","DO",5,2,null,0,null,2,null,157208,null,152371,null,0,null,0,null,"No"]
["Handitran Special Transit Division - City of Arlington","Arlington","TX",6041,60041,"City, County or Local Government Unit or Department of Transportation","Full Reporter",5121892,27,"MB","PT",2,0,null,0,null,0,null,131817,null,90155,null,0,null,0,null,"No"]
["Greater Portland Transit District","Portland","ME",1016,10016,"Independent Public Agency or Authority of Transit Service","Full Reporter",203914,26,"MB","DO",26,77,null,404,null,481,null,960216,null,929732,null,0,null,0,null,"No"]
["Adirondack Transit Lines, Inc,","Hurley","NY",2177,20177,"Private-For-Profit Corporation","Full Reporter",18351295,26,"CB","DO",26,67,null,20,null,87,null,2701996,"Q",2552769,"Q",0,null,0,null,"Yes"]
["Altamont Corridor Express","Stockton","CA",9182,90182,"Independent Public Agency or Authority of Transit Service","Full Reporter",370583,26,"CR","PT",26,6,null,0,null,6,null,1121395,null,1078543,null,179694,null,172734,null,"No"]
["Williamsport Bureau of Transportation","Williamsport","PA",3026,30026,"City, County or Local Government Unit or Department of Transportation","Full Reporter",56142,26,"MB","DO",23,119,null,392,null,511,null,916690,null,872026,null,0,null,0,null,"No"]
["Sioux City Transit System","Sioux City","IA",7012,70012,"City, County or Local Government Unit or Department of Transportation","Full Reporter",106494,26,"MB","DO",21,70,null,33,null,103,null,613436,null,608404,null,0,null,0,null,"No"]
["Imperial County Transportation Commission","El Centro","CA",9226,90226,"Independent Public Agency or Authority of Transit Service","Full Reporter",107672,26,"MB","PT",18,12,null,10,null,22,null,1033951,null,887107,null,0,null,0,null,"No"]
["Imperial County Transportation Commission","El Centro","CA",9226,90226,"Independent Public Agency or Authority of Transit Service","Full Reporter",107672,26,"DR","PT",8,10,null,2,null,12,null,318142,null,290287,null,0,null,0,null,"No"]
["Sioux City Transit System","Sioux City","IA",7012,70012,"City, County or Local Government Unit or Department of Transportation","Full Reporter",106494,26,"DR","PT",5,3,null,0,null,3,null,141744,null,126652,null,0,null,0,null,"No"]
["Williamsport Bureau of Transportation","Williamsport","PA",3026,30026,"City, County or Local Government Unit or Department of Transportation","Full Reporter",56142,26,"DR","PT",2,0,null,0,null,0,null,5250,null,5250,null,0,null,0,null,"No"]
["Williamsport Bureau of Transportation","Williamsport","PA",3026,30026,"City, County or Local Government Unit or Department of Transportation","Full Reporter",56142,26,"DR","DO",1,0,null,0,null,0,null,180,null,180,null,0,null,0,null,"No"]
["City of Riverside Special Transportation","Riverside","CA",9086,90086,"City, County or Local Government Unit or Department of Transportation","Full Reporter",1932666,25,"DR","DO",25,12,null,7,null,19,null,741042,null,661302,null,0,null,0,null,"No"]
["University Of New Hampshire - University Transportation Services","Durham","NH",1119,10119,"University","Full Reporter",88087,25,"MB","DO",25,10,null,401,null,411,null,505920,null,486394,null,0,null,0,null,"No"]
["Athens Transit System","Athens","GA",4047,40047,"City, County or Local Government Unit or Department of Transportation","Full Reporter",128754,25,"MB","DO",22,12,null,258,null,270,null,887760,null,819247,null,0,null,0,null,"No"]
["Berkshire Regional Transit Authority","Pittsfield","MA",1007,10007,"Subsidiary Unit of a Transit Agency, Reporting Separately","Full Reporter",59124,25,"MB","PT",17,79,null,156,null,235,null,1019771,null,924426,null,0,null,0,null,"No"]
["Waco Transit System, Inc.","Waco","TX",6012,60012,"City, County or Local Government Unit or Department of Transportation","Full Reporter",172378,25,"MB","DO",16,60,null,3,null,63,null,871203,null,853815,null,0,null,0,null,"No"]
["Waco Transit System, Inc.","Waco","TX",6012,60012,"City, County or Local Government Unit or Department of Transportation","Full Reporter",172378,25,"DR","DO",9,17,null,1,null,18,null,376028,null,332869,null,0,null,0,null,"No"]
["Berkshire Regional Transit Authority","Pittsfield","MA",1007,10007,"Subsidiary Unit of a Transit Agency, Reporting Separately","Full Reporter",59124,25,"DR","PT",8,2,null,0,null,2,null,348852,null,289052,null,0,null,0,null,"No"]
["Athens Transit System","Athens","GA",4047,40047,"City, County or Local Government Unit or Department of Transportation","Full Reporter",128754,25,"DR","DO",3,0,null,5,null,5,null,66796,null,59843,null,0,null,0,null,"No"]
["University of Kansas Parking & Transit","Lawrence","KS",null,70044,"University","Full Reporter",88053,24,"MB","PT",24,10,null,19,null,29,null,204054,null,184006,null,0,null,0,null,"No"]
["Johnson County SEATS","Iowa City","IA",7045,70045,"City, County or Local Government Unit or Department of Transportation","Full Reporter",106621,24,"DR","DO",24,82,null,64,null,146,null,555251,null,483305,null,0,null,0,null,{"$f":"IF(OR(Z1090=\"Q\",X1090=\"Q\",V1090=\"Q\",T1090=\"Q\",R1090=\"Q\",P1090=\"Q\",N1090=\"Q\"),\"Yes\",\"No\")","v":"No"}]
["Trumbull County Transit Board","Warren","OH",5197,50197,"City, County or Local Government Unit or Department of Transportation","Full Reporter",387550,24,"DR","PT",24,0,null,7,null,7,null,1003969,null,909464,null,0,null,0,null,"No"]
["Las Vegas Monorail Company","Las Vegas","NV",9242,90242,"Private-Non-Profit Corporation","Full Reporter",1886011,24,"MG","DO",24,102,null,133,null,235,null,1879172,null,1867222,null,469793,null,466806,null,"No"]
["Flagler Co. Public Transportation","Bunnell","FL","4R02-028",41068,"City, County or Local Government Unit or Department of Transportation","Full Reporter",349064,24,"DR","DO",24,0,null,0,null,0,null,709235,null,616466,null,0,null,0,null,"No"]
["University of Minnesota Transit","Minneapolis","MN",5218,50515,"University","Full Reporter",2650890,24,"MB","PT",21,0,null,62,null,62,null,530534,null,522240,null,0,null,0,null,"No"]
["City Utilities of Springfield","Springfield","MO",7003,70003,"City, County or Local Government Unit or Department of Transportation","Full Reporter",273724,24,"MB","DO",20,60,null,412,null,472,null,1082752,null,1073726,null,0,null,0,null,"No"]
["Norwalk Transit System","Norwalk","CA",9022,90022,"City, County or Local Government Unit or Department of Transportation","Full Reporter",12150996,24,"MB","DO",19,163,null,244,null,407,null,908952,null,891155,null,0,null,0,null,"No"]
["Pueblo Transit System","Pueblo","CO",8007,80007,"City, County or Local Government Unit or Department of Transportation","Full Reporter",136550,24,"MB","DO",13,52,null,112,null,164,null,553997,null,549121,null,0,null,0,null,"No"]
["County of Lebanon Transit Authority","Lebanon","PA",3095,30095,"Independent Public Agency or Authority of Transit Service","Full Reporter",77086,24,"DR","DO",12,1,null,3,null,4,null,282608,null,241257,null,0,null,0,null,"No"]
["Pueblo Transit System","Pueblo","CO",8007,80007,"City, County or Local Government Unit or Department of Transportation","Full Reporter",136550,24,"DR","PT",11,8,null,6,null,14,null,350417,null,323417,null,0,null,0,null,"No"]
["County of Lebanon Transit Authority","Lebanon","PA",3095,30095,"Independent Public Agency or Authority of Transit Service","Full Reporter",77086,24,"MB","DO",8,2,null,6,null,8,null,361941,null,361941,null,0,null,0,null,"No"]
["Norwalk Transit System","Norwalk","CA",9022,90022,"City, County or Local Government Unit or Department of Transportation","Full Reporter",12150996,24,"DR","PT",5,38,null,249,null,287,null,66292,null,46020,null,0,null,0,null,"No"]
["City Utilities of Springfield","Springfield","MO",7003,70003,"City, County or Local Government Unit or Department of Transportation","Full Reporter",273724,24,"DR","DO",4,5,null,4,null,9,null,148303,null,132028,null,0,null,0,null,"No"]
["County of Lebanon Transit Authority","Lebanon","PA",3095,30095,"Independent Public Agency or Authority of Transit Service","Full Reporter",77086,24,"CB","DO",4,1,null,0,null,1,null,134716,null,134716,null,0,null,0,null,"No"]
["University of Minnesota Transit","Minneapolis","MN",5218,50515,"University","Full Reporter",2650890,24,"DR","DO",3,0,null,5,null,5,null,20937,null,17201,null,0,null,0,null,"No"]
["Mid Mon Valley Transit Authority","Charleroi","PA",3061,30061,"Independent Public Agency or Authority of Transit Service","Full Reporter",66086,23,"MB","PT",22,23,null,45,null,68,null,876526,null,800141,null,0,null,0,null,"No"]
["Baltimore City Department of Transportation","Baltimore","MD",null,30201,"City, County or Local Government Unit or Department of Transportation","Full Reporter",2203663,23,"MB","PT",20,13,null,28,null,41,null,604444,null,564085,null,0,null,0,null,"No"]
["Southeast Area Transit","Preston","CT",1040,10040,"Independent Public Agency or Authority of Transit Service","Full Reporter",209190,23,"MB","DO",18,120,null,480,null,600,null,1122328,null,974074,null,0,null,0,null,"No"]
["Connecticut Department of Transportation - CTTransit New Britain -Dattco.","New Britain","CT",1045,10045,"Private Provider Reporting on Behalf of a Public Entity","Full Reporter",924859,23,"CB","PT",18,17,null,22,null,39,null,1148802,null,838135,null,0,null,0,null,"No"]
["Shoreline Metro","Sheboygan","WI",5088,50088,"City, County or Local Government Unit or Department of Transportation","Full Reporter",71313,23,"MB","DO",17,5,null,37,null,42,null,593595,null,577824,null,0,null,0,null,"No"]
["RiverCities Transit","Longview","WA",16,16,"City, County or Local Government Unit or Department of Transportation","Full Reporter",63952,23,"DR","PT",13,11,null,1,null,12,null,198763,null,177479,null,0,null,0,null,"No"]
["RiverCities Transit","Longview","WA",16,16,"City, County or Local Government Unit or Department of Transportation","Full Reporter",63952,23,"MB","DO",9,56,null,6,null,62,null,377411,null,365564,null,0,null,0,null,"No"]
["Shoreline Metro","Sheboygan","WI",5088,50088,"City, County or Local Government Unit or Department of Transportation","Full Reporter",71313,23,"DR","DO",6,0,null,5,null,5,null,170905,null,151655,null,0,null,0,null,"No"]
["Southeast Area Transit","Preston","CT",1040,10040,"Independent Public Agency or Authority of Transit Service","Full Reporter",209190,23,"DR","PT",5,36,null,140,null,176,null,76316,null,65649,null,0,null,0,null,"No"]
["Connecticut Department of Transportation - CTTransit New Britain -Dattco.","New Britain","CT",1045,10045,"Private Provider Reporting on Behalf of a Public Entity","Full Reporter",924859,23,"MB","PT",5,8,null,3,null,11,null,204604,null,187417,null,0,null,0,null,"No"]
["Baltimore City Department of Transportation","Baltimore","MD",null,30201,"City, County or Local Government Unit or Department of Transportation","Full Reporter",2203663,23,"FB","PT",3,0,null,0,null,0,null,28621,null,26632,null,0,null,0,null,"No"]
["RiverCities Transit","Longview","WA",16,16,"City, County or Local Government Unit or Department of Transportation","Full Reporter",63952,23,"VP","DO",1,0,null,0,null,0,null,3711,null,3711,null,0,null,0,null,"No"]
["Mid Mon Valley Transit Authority","Charleroi","PA",3061,30061,"Independent Public Agency or Authority of Transit Service","Full Reporter",66086,23,"DR","PT",1,0,null,0,null,0,null,6523,null,3131,null,0,null,0,null,"No"]
["Ulster County Area Transit","Kingston","NY",2178,20178,"City, County or Local Government Unit or Department of Transportation","Full Reporter",423566,22,"MB","DO",18,97,null,90,null,187,null,991597,null,961547,null,0,null,0,null,"No"]
["Cache Valley Transit District","Logan","UT",8028,80028,"Independent Public Agency or Authority of Transit Service","Full Reporter",94983,22,"MB","DO",17,62,null,106,null,168,null,830174,null,809608,null,0,null,0,null,"No"]
["Huntington Area Rapid Transit","Huntington Station","NY",2071,20071,"City, County or Local Government Unit or Department of Transportation","Full Reporter",18351295,22,"DR","DO",14,5,null,1,null,6,null,278083,null,254110,null,0,null,0,null,"No"]
["Huntington Area Rapid Transit","Huntington Station","NY",2071,20071,"City, County or Local Government Unit or Department of Transportation","Full Reporter",18351295,22,"MB","DO",8,26,null,11,null,37,null,409883,null,378369,null,0,null,0,null,"No"]
["Cache Valley Transit District","Logan","UT",8028,80028,"Independent Public Agency or Authority of Transit Service","Full Reporter",94983,22,"DR","DO",5,9,null,2,null,11,null,152643,null,133431,null,0,null,0,null,"No"]
["Ulster County Area Transit","Kingston","NY",2178,20178,"City, County or Local Government Unit or Department of Transportation","Full Reporter",423566,22,"DR","DO",4,2,null,1,null,3,null,143053,null,116033,null,0,null,0,null,"No"]
["The Transportation Management Association Group","Franklin","TN",4178,40178,"Private Provider Reporting on Behalf of a Public Entity","Full Reporter",969587,21,"VP","DO",21,1,null,3,null,4,null,463156,null,463156,null,0,null,0,null,"No"]
["Iowa City Transit","Iowa City","IA",7018,70018,"City, County or Local Government Unit or Department of Transportation","Full Reporter",106621,21,"MB","DO",21,12,null,68,null,80,null,727562,null,708473,null,0,null,0,null,"No"]
["Kings County Area Public Transit Agency","Hanford","CA",9200,90200,"Independent Public Agency or Authority of Transit Service","Full Reporter",87941,21,"MB","PT",16,43,null,9,null,52,null,705550,null,690179,null,0,null,0,null,"No"]
["Macatawa Area Express Transportation Authority","Holland","MI",5184,50184,"Independent Public Agency or Authority of Transit Service","Full Reporter",99941,21,"DR","DO",13,19,null,55,null,74,null,390268,null,363376,null,0,null,0,null,"No"]
["Macatawa Area Express Transportation Authority","Holland","MI",5184,50184,"Independent Public Agency or Authority of Transit Service","Full Reporter",99941,21,"MB","DO",8,22,null,83,null,105,null,424948,null,409852,null,0,null,0,null,"No"]
["Kings County Area Public Transit Agency","Hanford","CA",9200,90200,"Independent Public Agency or Authority of Transit Service","Full Reporter",87941,21,"DR","PT",5,2,null,1,null,3,null,71353,null,62219,null,0,null,0,null,"No"]
["Northern New England Passenger Rail Authority","Portland","ME",1115,10115,"Independent Public Agency or Authority of Transit Service","Full Reporter",203914,20,"CR","PT",20,0,null,1,null,1,null,2233430,null,2129947,null,481468,null,459627,null,"No"]
["Cumberland Area Transit System","Bridgeton","NJ",2193,20193,"City, County or Local Government Unit or Department of Transportation","Full Reporter",95259,20,"DR","DO",20,32,null,26,null,58,null,563552,null,493550,null,0,null,0,null,"No"]
["Greenville Transit Authority","Greenville","SC",4053,40053,"Independent Public Agency or Authority of Transit Service","Full Reporter",400492,20,"MB","DO",17,482,"Q",530,null,1012,null,1122488,null,1085142,null,0,null,0,null,"Yes"]
["Gary Public Transportation Corporation","Gary","IN",5045,50045,"City, County or Local Government Unit or Department of Transportation","Full Reporter",8608208,20,"MB","DO",16,160,null,174,null,334,null,806884,null,806884,null,0,null,0,null,"No"]
["Great Falls Transit District","Great Falls","MT",8012,80012,"Independent Public Agency or Authority of Transit Service","Full Reporter",65207,20,"MB","DO",13,103,null,13,null,116,null,455970,null,419085,null,0,null,0,null,"No"]
["City of Jackson Transportation Authority","Jackson","MI",5034,50034,"Independent Public Agency or Authority of Transit Service","Full Reporter",90057,20,"DR","DO",10,9,null,11,null,20,null,249597,null,216279,null,0,null,0,null,"No"]
["City of Jackson Transportation Authority","Jackson","MI",5034,50034,"Independent Public Agency or Authority of Transit Service","Full Reporter",90057,20,"MB","DO",10,113,null,28,null,141,null,362300,null,346082,null,0,null,0,null,"No"]
["Great Falls Transit District","Great Falls","MT",8012,80012,"Independent Public Agency or Authority of Transit Service","Full Reporter",65207,20,"DR","DO",7,5,null,0,null,5,null,165187,null,149920,null,0,null,0,null,"No"]
["Gary Public Transportation Corporation","Gary","IN",5045,50045,"City, County or Local Government Unit or Department of Transportation","Full Reporter",8608208,20,"DR","DO",4,51,null,75,null,126,null,134684,null,82789,null,0,null,0,null,"No"]
["Greenville Transit Authority","Greenville","SC",4053,40053,"Independent Public Agency or Authority of Transit Service","Full Reporter",400492,20,"DR","DO",3,96,"Q",106,"Q",202,null,89016,null,82458,null,0,null,0,null,"Yes"]
["Washington State Ferries","Seattle","WA",35,35,"State Government Unit or Department of Transportation","Full Reporter",3059393,19,"FB","DO",19,50,null,1,null,51,null,921821,null,913727,null,0,null,0,null,"No"]
["Lafayette Transit System","Lafayette","LA",6038,60038,"City, County or Local Government Unit or Department of Transportation","Full Reporter",252720,19,"MB","DO",13,30,null,348,null,378,null,789836,"Q",707634,null,0,null,0,null,"Yes"]
["Augusta Richmond County Transit Department","Augusta","GA",4023,40023,"City, County or Local Government Unit or Department of Transportation","Full Reporter",386787,19,"MB","PT",12,268,null,124,null,392,null,580764,null,552821,null,0,null,0,null,"No"]
["Cape Ann Transportation Authority","Gloucester","MA",1053,10053,"Independent Public Agency or Authority of Transit Service","Full Reporter",4181019,19,"MB","PT",11,2,null,12,null,14,null,215551,null,208869,null,0,null,0,null,"No"]
["Cape Ann Transportation Authority","Gloucester","MA",1053,10053,"Independent Public Agency or Authority of Transit Service","Full Reporter",4181019,19,"DR","PT",8,1,null,2,null,3,null,152558,null,126252,null,0,null,0,null,"No"]
["Augusta Richmond County Transit Department","Augusta","GA",4023,40023,"City, County or Local Government Unit or Department of Transportation","Full Reporter",386787,19,"DR","PT",7,34,null,26,null,60,null,202875,null,187666,null,0,null,0,null,"No"]
["Lafayette Transit System","Lafayette","LA",6038,60038,"City, County or Local Government Unit or Department of Transportation","Full Reporter",252720,19,"DR","PT",6,4,null,16,null,20,null,263017,"Q",250721,null,0,null,0,null,"Yes"]
["Central Florida Commuter Rail","Sanford","FL",4232,40232,"State Government Unit or Department of Transportation","Full Reporter",1510516,18,"CR","PT",18,0,null,3,null,3,null,657408,null,649088,null,284416,null,279552,null,"No"]
["City of Glendale Transit","Glendale","AZ",9034,90034,"City, County or Local Government Unit or Department of Transportation","Full Reporter",3629114,18,"DR","DO",15,25,null,0,null,25,null,356836,null,322813,null,0,null,0,null,"No"]
["Cooperative Alliance for Seacoast Transportation","Dover","NH",1086,10086,"Independent Public Agency or Authority of Transit Service","Full Reporter",88087,18,"MB","DO",14,53,null,6,null,59,null,801383,null,672908,null,0,null,0,null,"No"]
["Delaware County Transit Board","Delaware","OH",5199,50199,"Independent Public Agency or Authority of Transit Service","Full Reporter",1368035,18,"MB","DO",12,13,null,2,null,15,null,275539,null,255333,null,0,null,0,null,"No"]
["Beaumont Municipal Transit System","Beaumont","TX",6016,60016,"City, County or Local Government Unit or Department of Transportation","Full Reporter",147922,18,"MB","PT",12,5,null,15,null,20,null,726809,null,715160,null,0,null,0,null,"No"]
["Cities Area Transit","Grand Forks","ND",8008,80008,"City, County or Local Government Unit or Department of Transportation","Full Reporter",61270,18,"DR","PT",10,0,null,32,null,32,null,226005,null,207711,null,0,null,0,null,"No"]
["Cities Area Transit","Grand Forks","ND",8008,80008,"City, County or Local Government Unit or Department of Transportation","Full Reporter",61270,18,"MB","DO",8,2,null,115,null,117,null,395128,null,371166,null,0,null,0,null,"No"]
["Delaware County Transit Board","Delaware","OH",5199,50199,"Independent Public Agency or Authority of Transit Service","Full Reporter",1368035,18,"DR","DO",6,7,null,1,null,8,null,197530,null,162865,null,0,null,0,null,{"$f":"IF(OR(Z1154=\"Q\",X1154=\"Q\",V1154=\"Q\",T1154=\"Q\",R1154=\"Q\",P1154=\"Q\",N1154=\"Q\"),\"Yes\",\"No\")","v":"No"}]
["Beaumont Municipal Transit System","Beaumont","TX",6016,60016,"City, County or Local Government Unit or Department of Transportation","Full Reporter",147922,18,"DR","PT",6,2,null,10,null,12,null,153132,null,97622,null,0,null,0,null,"No"]
["Cooperative Alliance for Seacoast Transportation","Dover","NH",1086,10086,"Independent Public Agency or Authority of Transit Service","Full Reporter",88087,18,"DR","DO",4,2,null,7,null,9,null,237507,null,189309,null,0,null,0,null,"No"]
["City of Glendale Transit","Glendale","AZ",9034,90034,"City, County or Local Government Unit or Department of Transportation","Full Reporter",3629114,18,"MB","DO",3,8,null,0,null,8,null,96225,null,93336,null,0,null,0,null,"No"]
["Texoma Area Paratransit System, Inc","Sherman","TX",6107,60107,"City, County or Local Government Unit or Department of Transportation","Full Reporter",61900,17,"DR","PT",17,0,null,6,null,6,null,233159,null,200844,null,0,null,0,null,"No"]
["Miami County Public Transit","Troy","OH",5169,50169,"City, County or Local Government Unit or Department of Transportation","Full Reporter",724091,17,"DR","PT",17,4,null,0,null,4,null,449411,null,377410,null,0,null,0,null,"No"]
["River Valley Metro Mass Transit District","Bourbonnais","IL",5159,50159,"City, County or Local Government Unit or Department of Transportation","Full Reporter",81926,17,"MB","PT",13,127,null,520,null,647,null,1029832,null,979576,null,0,null,0,null,"No"]
["Medina County Public Transit","Medina","OH",5198,50198,"City, County or Local Government Unit or Department of Transportation","Full Reporter",1780673,17,"DR","DO",11,16,null,27,null,43,null,321512,null,253655,null,0,null,0,null,"No"]
["Medina County Public Transit","Medina","OH",5198,50198,"City, County or Local Government Unit or Department of Transportation","Full Reporter",1780673,17,"MB","DO",5,10,null,18,null,28,null,128582,null,106919,null,0,null,0,null,"No"]
["River Valley Metro Mass Transit District","Bourbonnais","IL",5159,50159,"City, County or Local Government Unit or Department of Transportation","Full Reporter",81926,17,"DR","PT",2,3,null,22,null,25,null,100557,null,89377,null,0,null,0,null,"No"]
["River Valley Metro Mass Transit District","Bourbonnais","IL",5159,50159,"City, County or Local Government Unit or Department of Transportation","Full Reporter",81926,17,"CB","PT",2,6,null,43,null,49,null,318833,null,306803,null,0,null,0,null,"No"]
["ART (Asheville Redefines Transit)","Asheville","NC",4005,40005,"City, County or Local Government Unit or Department of Transportation","Full Reporter",280648,16,"MB","DO",16,22,null,347,null,369,null,965744,null,935064,null,0,null,0,null,"No"]
["City of Clemson/ Clemson Area Transit","Clemson","SC",4208,40208,"City, County or Local Government Unit or Department of Transportation","Full Reporter",400492,16,"MB","DO",16,10,null,0,null,10,null,434324,null,434324,null,0,null,0,null,"No"]
["City of Fort Lauderdale","Fort Lauderdale","FL",null,44929,"City, County or Local Government Unit or Department of Transportation","Full Reporter",5502379,16,"MB","PT",15,27,null,162,null,189,null,359403,null,299736,null,0,null,0,null,"No"]
["City of Portland","Portland","OR",58,58,"City, County or Local Government Unit or Department of Transportation","Full Reporter",1849898,16,"SR","PT",14,74,null,111,null,185,null,405871,null,405109,null,405871,null,405109,null,"No"]
["Ohio Valley Regional Transportation Authority","Wheeling","WV",3035,30035,"Independent Public Agency or Authority of Transit Service","Full Reporter",81249,16,"MB","DO",14,8,null,160,null,168,null,738280,null,735293,null,0,null,0,null,"No"]
["Middletown Transit District","Middletown","CT",1063,10063,"Independent Public Agency or Authority of Transit Service","Full Reporter",924859,16,"MB","DO",9,6,null,11,null,17,null,407055,null,389888,null,0,null,0,null,"No"]
["City of Petaluma","Petaluma","CA",9213,90213,"City, County or Local Government Unit or Department of Transportation","Full Reporter",64078,16,"MB","PT",9,10,null,0,null,10,null,258732,null,249769,null,0,null,0,null,"No"]
["Michiana Area Council of Governments","South Bend","IN",5149,50149,"MPO, COG or Other Planning Agency","Full Reporter",143592,16,"DR","PT",8,3,null,0,null,3,null,277686,null,241662,null,0,null,0,null,"No"]
["Putnam County Transit","Carmel","NY",2096,20096,"City, County or Local Government Unit or Department of Transportation","Full Reporter",18351295,16,"DR","PT",8,7,null,12,null,19,null,200668,null,171054,null,0,null,0,null,"No"]
["City of Lodi - Transit Division","Lodi","CA",9175,90175,"City, County or Local Government Unit or Department of Transportation","Full Reporter",68738,16,"DR","PT",8,39,null,22,null,61,null,113897,null,106162,null,0,null,0,null,"No"]
["Michiana Area Council of Governments","South Bend","IN",5149,50149,"MPO, COG or Other Planning Agency","Full Reporter",143592,16,"MB","PT",8,10,null,10,null,20,null,631050,null,585316,null,0,null,0,null,"No"]
["Putnam County Transit","Carmel","NY",2096,20096,"City, County or Local Government Unit or Department of Transportation","Full Reporter",18351295,16,"MB","PT",8,33,null,13,null,46,null,525746,null,492862,null,0,null,0,null,"No"]
["City of Lodi - Transit Division","Lodi","CA",9175,90175,"City, County or Local Government Unit or Department of Transportation","Full Reporter",68738,16,"MB","PT",8,60,null,43,null,103,null,247708,null,245241,null,0,null,0,null,"No"]
["Middletown Transit District","Middletown","CT",1063,10063,"Independent Public Agency or Authority of Transit Service","Full Reporter",924859,16,"DR","DO",7,5,null,6,null,11,null,197442,null,176357,null,0,null,0,null,"No"]
["City of Petaluma","Petaluma","CA",9213,90213,"City, County or Local Government Unit or Department of Transportation","Full Reporter",64078,16,"DR","PT",7,1,null,0,null,1,null,89067,null,82607,null,0,null,0,null,"No"]
["Ohio Valley Regional Transportation Authority","Wheeling","WV",3035,30035,"Independent Public Agency or Authority of Transit Service","Full Reporter",81249,16,"DR","DO",2,0,null,3,null,3,null,46955,null,28200,null,0,null,0,null,"No"]
["City of Portland","Portland","OR",58,58,"City, County or Local Government Unit or Department of Transportation","Full Reporter",1849898,16,"TR","PT",2,0,null,0,null,0,null,32729,null,32729,null,0,null,0,null,"No"]
["City of Fort Lauderdale","Fort Lauderdale","FL",null,44929,"City, County or Local Government Unit or Department of Transportation","Full Reporter",5502379,16,"FB","PT",1,2,null,0,null,2,null,14683,null,12141,null,0,null,0,null,"No"]
["Opportunity Enterprises, Inc.","Valparaiso","IN",5131,50131,"Private-Non-Profit Corporation","Full Reporter",8608208,15,"DR","DO",15,1,null,2,null,3,null,408319,null,361865,null,0,null,0,null,"No"]
["Jackson Transit Authority","Jackson","TN",4057,40057,"Independent Public Agency or Authority of Transit Service","Full Reporter",71880,15,"MB","DO",9,78,null,67,null,145,null,561238,null,555877,null,0,null,0,null,"No"]
["Nashua Transit System","Nashua","NH",1087,10087,"City, County or Local Government Unit or Department of Transportation","Full Reporter",226400,15,"MB","PT",9,50,null,26,null,76,null,460614,null,448249,null,0,null,0,null,"No"]
["Jackson Transit Authority","Jackson","TN",4057,40057,"Independent Public Agency or Authority of Transit Service","Full Reporter",71880,15,"DR","DO",6,10,null,1,null,11,null,214732,null,210555,null,0,null,0,null,"No"]
["Nashua Transit System","Nashua","NH",1087,10087,"City, County or Local Government Unit or Department of Transportation","Full Reporter",226400,15,"DR","PT",6,13,null,2,null,15,null,169771,null,151329,null,0,null,0,null,"No"]
["City of Scottsdale - Scottsdale Trolley","Scottsdale","AZ",9131,90131,"City, County or Local Government Unit or Department of Transportation","Full Reporter",3629114,14,"MB","PT",14,22,null,55,null,77,null,774748,null,729750,null,0,null,0,null,"No"]
["South Lake County Community Services, Inc.","Crown Point","IN",5167,50167,"Private-Non-Profit Corporation","Full Reporter",8608208,14,"DR","DO",14,2,null,1,null,3,null,355742,null,278696,null,0,null,0,null,"No"]
["City of Commerce Municipal Buslines","Commerce","CA",9043,90043,"City, County or Local Government Unit or Department of Transportation","Full Reporter",12150996,14,"MB","DO",10,0,null,8,null,8,null,406142,null,398494,null,0,null,0,null,"No"]
["City of Redondo Beach - Beach Cities Transit","Redondo Beach","CA",9214,90214,"City, County or Local Government Unit or Department of Transportation","Full Reporter",12150996,14,"MB","PT",10,18,null,11,null,29,null,422470,null,388347,null,0,null,0,null,"No"]
["Milford Transit District","Milford","CT",1107,10107,"Independent Public Agency or Authority of Transit Service","Full Reporter",923311,14,"DR","DO",8,8,null,12,null,20,null,242184,null,230652,null,0,null,0,null,"No"]
["Albany Transit System","Albany","GA",4021,40021,"City, County or Local Government Unit or Department of Transportation","Full Reporter",95779,14,"MB","DO",8,35,null,291,null,326,null,600696,null,592032,null,0,null,0,null,"No"]
["Milford Transit District","Milford","CT",1107,10107,"Independent Public Agency or Authority of Transit Service","Full Reporter",923311,14,"MB","DO",6,14,null,22,null,36,null,304002,null,299814,null,0,null,0,null,"No"]
["Albany Transit System","Albany","GA",4021,40021,"City, County or Local Government Unit or Department of Transportation","Full Reporter",95779,14,"DR","DO",6,0,null,42,null,42,null,106977,null,100151,null,0,null,0,null,"No"]
["City of Commerce Municipal Buslines","Commerce","CA",9043,90043,"City, County or Local Government Unit or Department of Transportation","Full Reporter",12150996,14,"DR","DO",4,0,null,2,null,2,null,64764,null,59772,null,0,null,0,null,"No"]
["City of Redondo Beach - Beach Cities Transit","Redondo Beach","CA",9214,90214,"City, County or Local Government Unit or Department of Transportation","Full Reporter",12150996,14,"DR","PT",4,2,null,1,null,3,null,76145,null,69851,null,0,null,0,null,"No"]
["Connecticut Department of Transportation -CTTRANSIT New Britain","Berlin","CT",1130,10130,"Private Provider Reporting on Behalf of a Public Entity","Full Reporter",924859,13,"MB","PT",13,30,null,32,null,62,null,867649,null,786002,null,0,null,0,null,"No"]
["Valley Transit District","Derby","CT",1042,10042,"Independent Public Agency or Authority of Transit Service","Full Reporter",923311,12,"DR","DO",12,5,null,4,null,9,null,292174,null,261830,null,0,null,0,null,"No"]
["Monroe Bus Corporation","Brooklyn","NY",2137,20137,"Private-For-Profit Corporation","Full Reporter",423566,12,"CB","DO",12,7,null,20,null,27,null,720101,null,686007,null,0,null,0,null,"No"]
["City of Corvallis","Corvallis","OR",47,47,"City, County or Local Government Unit or Department of Transportation","Full Reporter",62433,11,"MB","PT",11,16,null,10,null,26,null,444256,null,433488,null,0,null,0,null,"No"]
["Terre Haute Transit Utility","Terre Haute","IN",5053,50053,"City, County or Local Government Unit or Department of Transportation","Full Reporter",92742,11,"MB","DO",8,24,null,41,null,65,null,446071,null,436596,null,0,null,0,null,"No"]
["City of Long Beach","Long Beach","NY",2006,20006,"City, County or Local Government Unit or Department of Transportation","Full Reporter",18351295,11,"MB","DO",8,1,null,2,null,3,null,351489,null,337927,null,0,null,0,null,"No"]
["City of Moorhead, DBA: Metropolitan Area Transit","Moorhead","MN",5026,50026,"City, County or Local Government Unit or Department of Transportation","Full Reporter",176676,11,"MB","PT",8,16,null,49,null,65,null,415894,null,399666,null,0,null,0,null,"No"]
["Martin County","Stuart","FL",4192,40192,"City, County or Local Government Unit or Department of Transportation","Full Reporter",376047,11,"MB","PT",5,0,null,11,null,11,null,260784,null,251063,null,0,null,0,null,"No"]
["Martin County","Stuart","FL",4192,40192,"City, County or Local Government Unit or Department of Transportation","Full Reporter",376047,11,"DR","PT",4,0,null,2,null,2,null,84292,null,73643,null,0,null,0,null,"No"]
["City of Moorhead, DBA: Metropolitan Area Transit","Moorhead","MN",5026,50026,"City, County or Local Government Unit or Department of Transportation","Full Reporter",176676,11,"DR","PT",3,0,null,0,null,0,null,84305,null,77999,null,0,null,0,null,"No"]
["Terre Haute Transit Utility","Terre Haute","IN",5053,50053,"City, County or Local Government Unit or Department of Transportation","Full Reporter",92742,11,"DR","DO",3,28,null,33,null,61,null,70685,null,42346,null,0,null,0,null,"No"]
["City of Long Beach","Long Beach","NY",2006,20006,"City, County or Local Government Unit or Department of Transportation","Full Reporter",18351295,11,"DR","DO",3,0,null,1,null,1,null,56575,null,51588,null,0,null,0,null,"No"]
["Martin County","Stuart","FL",4192,40192,"City, County or Local Government Unit or Department of Transportation","Full Reporter",376047,11,"CB","PT",2,0,null,0,null,0,null,107593,null,100781,null,0,null,0,null,"No"]
["Puerto Rico Maritime Transport Authority","Puerto Real","PR",4175,40175,"State Government Unit or Department of Transportation","Full Reporter",2148346,10,"FB","DO",10,24,null,12,null,36,null,178537,null,178537,null,0,null,0,null,"No"]
["City of San Luis Obispo","San Luis Obispo","CA",9156,90156,"City, County or Local Government Unit or Department of Transportation","Full Reporter",59219,10,"MB","PT",10,47,null,37,null,84,null,444207,null,412377,null,0,null,0,null,"No"]
["San Francisco Bay Area Water Emergency Transportation Authority","San Francisco","CA",9225,90225,"Independent Public Agency or Authority of Transit Service","Full Reporter",3281212,10,"FB","PT",10,35,null,0,null,35,null,358178,null,318683,null,0,null,0,null,"No"]
["Detroit Transportation Corporation","Detroit","MI",5141,50141,"Independent Public Agency or Authority of Transit Service","Full Reporter",3734090,10,"MG","DO",10,60,null,188,null,248,null,547934,null,543526,null,273967,null,271763,null,"No"]
["City of Tulare","Tulare","CA",9244,90244,"City, County or Local Government Unit or Department of Transportation","Full Reporter",219454,10,"MB","PT",7,4,null,52,null,56,null,671612,null,576282,null,0,null,0,null,"No"]
["City of Tulare","Tulare","CA",9244,90244,"City, County or Local Government Unit or Department of Transportation","Full Reporter",219454,10,"DR","PT",3,7,null,39,null,46,null,90202,null,78474,null,0,null,0,null,"No"]
["City of Fairfax CUE Bus","Fairfax","VA",3058,30058,"City, County or Local Government Unit or Department of Transportation","Full Reporter",4586770,8,"MB","DO",8,17,null,121,null,138,null,445396,null,432039,null,0,null,0,null,"No"]
["Jolley Trolley Transportation of Clearwater, Inc.","Clearwater","FL",null,40259,"Private-Non-Profit Corporation","Full Reporter",2441770,8,"MB","DO",8,10,null,63,null,73,null,155016,null,147615,null,0,null,0,null,{"$f":"IF(OR(Z1218=\"Q\",X1218=\"Q\",V1218=\"Q\",T1218=\"Q\",R1218=\"Q\",P1218=\"Q\",N1218=\"Q\"),\"Yes\",\"No\")","v":"No"}]
["City of Seattle - Seattle Center Monorail Transit","Seattle","WA",23,23,"City, County or Local Government Unit or Department of Transportation","Full Reporter",3059393,8,"MG","PT",8,0,null,37,null,37,null,229784,null,229784,null,57446,null,57446,null,"No"]
["City of Ocala, Florida","Ocala","FL",4120,40120,"City, County or Local Government Unit or Department of Transportation","Full Reporter",156909,8,"MB","PT",6,64,null,28,null,92,null,514205,null,494223,null,0,null,0,null,"No"]
["City of Valparaiso","Valparaiso","IN",5183,50183,"City, County or Local Government Unit or Department of Transportation","Full Reporter",8608208,8,"CB","PT",4,4,null,3,null,7,null,144716,null,120437,null,0,null,0,null,"No"]
["City of Turlock","Turlock","CA",9201,90201,"City, County or Local Government Unit or Department of Transportation","Full Reporter",99904,8,"MB","PT",4,14,null,18,null,32,null,168581,null,163534,null,0,null,0,null,"No"]
["City of Valparaiso","Valparaiso","IN",5183,50183,"City, County or Local Government Unit or Department of Transportation","Full Reporter",8608208,8,"MB","PT",4,0,null,0,null,0,null,207005,null,203401,null,0,null,0,null,"No"]
["City of Turlock","Turlock","CA",9201,90201,"City, County or Local Government Unit or Department of Transportation","Full Reporter",99904,8,"DR","PT",4,0,null,7,null,7,null,34205,null,31132,null,0,null,0,null,"No"]
["City of Ocala, Florida","Ocala","FL",4120,40120,"City, County or Local Government Unit or Department of Transportation","Full Reporter",156909,8,"DR","PT",2,0,null,0,null,0,null,93000,null,87612,null,0,null,0,null,"No"]
["Martz Group, National Coach Works of Virginia","Fredericksburg","VA",3103,30103,"Private-For-Profit Corporation","Full Reporter",4586770,7,"CB","DO",7,0,null,0,null,0,null,221005,null,204509,null,0,null,0,null,"No"]
["Coralville Transit System","Coralville","IA",7030,70030,"City, County or Local Government Unit or Department of Transportation","Full Reporter",106621,7,"MB","DO",7,12,null,4,null,16,null,225606,null,201155,null,0,null,0,null,"No"]
["Porter County Aging and Community Services, Inc.","Valparaiso","IN",5179,50179,"Private-Non-Profit Corporation","Full Reporter",8608208,7,"DR","DO",7,10,null,21,null,31,null,216873,null,187977,null,0,null,0,null,"No"]
["City of La Mirada Transit","La Mirada","CA",9024,90024,"City, County or Local Government Unit or Department of Transportation","Full Reporter",12150996,7,"DR","PT",7,14,null,3,null,17,null,82163,null,73006,null,0,null,0,null,"No"]
["City of Maple Grove","Maple Grove","MN",5220,50517,"City, County or Local Government Unit or Department of Transportation","Full Reporter",2650890,7,"DR","PT",6,4,null,0,null,4,null,260660,null,229420,null,0,null,0,null,"No"]
["City of Maple Grove","Maple Grove","MN",5220,50517,"City, County or Local Government Unit or Department of Transportation","Full Reporter",2650890,7,"MB","PT",1,0,null,0,null,0,null,29383,null,23021,null,0,null,0,null,"No"]
["Private Transportation Corporation","Brooklyn","NY",2175,20175,"Private-For-Profit Corporation","Full Reporter",18351295,6,"MB","PT",6,8,null,16,null,24,null,216790,null,209106,null,0,null,0,null,"No"]
["BillyBey Ferry Company, LLC","New York","NY",2189,20189,"Private-For-Profit Corporation","Full Reporter",18351295,6,"FB","DO",6,0,null,0,null,0,null,247396,null,247396,null,0,null,0,null,"No"]
["Borough of Pottstown - Pottstown Area Rapid Transit","Pottstown","PA",3077,30077,"City, County or Local Government Unit or Department of Transportation","Full Reporter",107682,6,"MB","PT",5,4,null,3,null,7,null,259134,null,252780,null,0,null,0,null,"No"]
["Plaquemines Parish Government","Belle Chasse","LA",6127,60127,"City, County or Local Government Unit or Department of Transportation","Full Reporter",899703,6,"DR","DO",4,0,null,3,null,3,null,141589,"Q",107274,"Q",0,null,0,null,"Yes"]
["Plaquemines Parish Government","Belle Chasse","LA",6127,60127,"City, County or Local Government Unit or Department of Transportation","Full Reporter",899703,6,"FB","DO",2,0,null,5,null,5,null,22487,null,22487,null,0,null,0,null,"No"]
["Borough of Pottstown - Pottstown Area Rapid Transit","Pottstown","PA",3077,30077,"City, County or Local Government Unit or Department of Transportation","Full Reporter",107682,6,"DR","PT",1,0,null,0,null,0,null,14922,null,13087,null,0,null,0,null,"No"]
["The University of Montana - ASUM Transportation","Missoula","MT",8107,80107,"University","Full Reporter",82157,5,"MB","DO",5,10,null,8,null,18,null,129070,null,125198,null,0,null,0,null,"No"]
["Peoria Transit","Peoria","AZ",9140,90140,"City, County or Local Government Unit or Department of Transportation","Full Reporter",3629114,5,"DR","DO",5,5,null,9,null,14,null,88308,null,81683,null,0,null,0,null,"No"]
["City of Loveland Transit","Loveland","CO",8025,80025,"City, County or Local Government Unit or Department of Transportation","Full Reporter",264465,5,"MB","DO",3,16,null,90,null,106,null,198406,null,181106,null,0,null,0,null,"No"]
["City of Loveland Transit","Loveland","CO",8025,80025,"City, County or Local Government Unit or Department of Transportation","Full Reporter",264465,5,"DR","DO",2,5,null,23,null,28,null,63205,null,57111,null,0,null,0,null,"No"]
["Casco Bay Island Transit District","Portland","ME",1088,10088,"Independent Public Agency or Authority of Transit Service","Full Reporter",203914,4,"FB","DO",4,1,null,0,null,1,null,83875,null,83288,null,0,null,0,null,"No"]
["East Chicago Transit","East Chicago","IN",5042,50042,"City, County or Local Government Unit or Department of Transportation","Full Reporter",8608208,4,"MB","DO",3,24,null,7,null,31,null,124114,null,117294,null,0,null,0,null,"No"]
["East Chicago Transit","East Chicago","IN",5042,50042,"City, County or Local Government Unit or Department of Transportation","Full Reporter",8608208,4,"DR","DO",1,3,null,1,null,4,null,30818,null,22865,null,0,null,0,null,"No"]
["City of Atlanta - Department of Public Works - Transit Division","Atlanta","GA",4230,40230,"City, County or Local Government Unit or Department of Transportation","Full Reporter",4515419,3,"SR","DO",3,6,null,9,null,15,null,63754,null,63298,null,63754,null,63298,null,"No"]
["McKinney Avenue Transit Authority","Dallas","TX",6133,60133,"Private-Non-Profit Corporation","Full Reporter",5121892,3,"SR","DO",3,7,null,4,null,11,null,53903,null,52458,null,53903,null,52458,null,"No"]
["New York City Economic Development Corporation","New York","NY",null,22930,"Private-Non-Profit Corporation","Full Reporter",18351295,3,"FB","PT",3,0,null,22,null,22,null,108746,null,95751,null,0,null,0,null,"No"]
["Pierce County Ferry Operations","Tacoma","WA",28,28,"City, County or Local Government Unit or Department of Transportation","Full Reporter",3059393,2,"FB","PT",2,0,null,4,null,4,null,38350,null,38350,null,0,null,0,null,"No"]
["The Looper Group, Inc.","St. Petersburg","FL",null,40258,"Private-Non-Profit Corporation","Full Reporter",2441770,2,"MB","DO",2,8,null,32,null,40,null,46006,null,42116,null,0,null,0,null,"No"]
["Brunswick Transit Alternative","Brunswick","OH",5143,50143,"City, County or Local Government Unit or Department of Transportation","Full Reporter",1780673,2,"MB","DO",2,5,null,9,null,14,null,111529,null,107959,null,0,null,0,null,"No"]

{"sheet":"Summary","index":3,"n_rows":121,"n_cols":22,"rows_kept":121,"cut":false,"hidden":false,"merged":[]}
["To bring up the accessible control panel, press ctrl + a. Some screen reading functionality will not work while the sheet is protected. To unprotect the sheet press alt h o p and enter the password ntd.",null,null,null,null,"National Totals",null,null,null,null,null,null,null,null,null,{"$f":"IF(P4=1,0,1)","v":0}]
[null,null,null,null,null,"VOMS","Major Mechanical Failures","Other Mechanical Failures","Total Mechanical Failures","Vehicle/Passenger Car Miles","Vehicle/Passenger Car Revenue Miles","Train Miles","Train Revenue Miles",null,null,"Include Questionable Data"]
[null,null,null,null,null,{"$f":"IF($P$1,SUMIFS(Breakdowns!L:L,Breakdowns!$AA:$AA,\"=No\"),SUM(Breakdowns!L:L))","v":106299},{"$f":"IF($P$1,SUMIFS(Breakdowns!M:M,Breakdowns!$AA:$AA,\"=No\"),SUM(Breakdowns!M:M))","v":249404},{"$f":"IF($P$1,SUMIFS(Breakdowns!O:O,Breakdowns!$AA:$AA,\"=No\"),SUM(Breakdowns!O:O))","v":266737},{"$f":"IF($P$1,SUMIFS(Breakdowns!Q:Q,Breakdowns!$AA:$AA,\"=No\"),SUM(Breakdowns!Q:Q))","v":516141},{"$f":"IF($P$1,SUMIFS(Breakdowns!S:S,Breakdowns!$AA:$AA,\"=No\"),SUM(Breakdowns!S:S))","v":4522027867},{"$f":"IF($P$1,SUMIFS(Breakdowns!U:U,Breakdowns!$AA:$AA,\"=No\"),SUM(Breakdowns!U:U))","v":4016193005},{"$f":"IF($P$1,SUMIFS(Breakdowns!W:W,Breakdowns!$AA:$AA,\"=No\"),SUM(Breakdowns!W:W))","v":223426532},{"$f":"IF($P$1,SUMIFS(Breakdowns!Y:Y,Breakdowns!$AA:$AA,\"=No\"),SUM(Breakdowns!Y:Y))","v":215231596},null,null,"Exclude Questionable Data"]
[null,null,null,null,null,null,null,null,null,null,null,null,null,null,null,1]
["By Urbanized Area Size"]
[null,null,null,"edit bins below","Column1","VOMS","Major Mechanical Failures","Other Mechanical Failures","Total Mechanical Failures","Vehicle/Passenger Car Miles","Vehicle/Passenger Car Revenue Miles","Train Miles","Train Revenue Miles",null,null,null,null,null,{"$f":"\"Under \"&FIXED(B7,0,0)","v":"Under 200,000"},{"$f":"IFERROR($K7/$G7,\"\")","v":18535.044523099852}]
["Under",{"$f":"D7","v":200000},null,200000,{"$f":"A7&\" \"&FIXED(B7,0,0)","v":"Under 200,000"},{"$f":"IF($P$1,SUMIFS(Breakdowns!L:L,Breakdowns!$H:$H,\"<\"&$D7,Breakdowns!$AA:$AA,\"=No\"),SUMIFS(Breakdowns!L:L,Breakdowns!$H:$H,\"<\"&$D7))","v":6946},{"$f":"IF($P$1,SUMIFS(Breakdowns!M:M,Breakdowns!$H:$H,\"<\"&$D7,Breakdowns!$AA:$AA,\"=No\"),SUMIFS(Breakdowns!M:M,Breakdowns!$H:$H,\"<\"&$D7))","v":10736},{"$f":"IF($P$1,SUMIFS(Breakdowns!O:O,Breakdowns!$H:$H,\"<\"&$D7,Breakdowns!$AA:$AA,\"=No\"),SUMIFS(Breakdowns!O:O,Breakdowns!$H:$H,\"<\"&$D7))","v":15503},{"$f":"IF($P$1,SUMIFS(Breakdowns!Q:Q,Breakdowns!$H:$H,\"<\"&$D7,Breakdowns!$AA:$AA,\"=No\"),SUMIFS(Breakdowns!Q:Q,Breakdowns!$H:$H,\"<\"&$D7))","v":26239},{"$f":"IF($P$1,SUMIFS(Breakdowns!S:S,Breakdowns!$H:$H,\"<\"&$D7,Breakdowns!$AA:$AA,\"=No\"),SUMIFS(Breakdowns!S:S,Breakdowns!$H:$H,\"<\"&$D7))","v":216058288},{"$f":"IF($P$1,SUMIFS(Breakdowns!U:U,Breakdowns!$H:$H,\"<\"&$D7,Breakdowns!$AA:$AA,\"=No\"),SUMIFS(Breakdowns!U:U,Breakdowns!$H:$H,\"<\"&$D7))","v":198992238},{"$f":"IF($P$1,SUMIFS(Breakdowns!W:W,Breakdowns!$H:$H,\"<\"&$D7,Breakdowns!$AA:$AA,\"=No\"),SUMIFS(Breakdowns!W:W,Breakdowns!$H:$H,\"<\"&$D7))","v":696726},{"$f":"IF($P$1,SUMIFS(Breakdowns!Y:Y,Breakdowns!$H:$H,\"<\"&$D7,Breakdowns!$AA:$AA,\"=No\"),SUMIFS(Breakdowns!Y:Y,Breakdowns!$H:$H,\"<\"&$D7))","v":688917},null,null,null,null,null,{"$f":"IFERROR(IF(A8=\"Over\",\"Over \"&FIXED(B8,0,0),FIXED(B8,0,0)&\" to \"&FIXED(D8,0,0)),\"\")","v":"200,000 to 1,000,000"},{"$f":"IFERROR($K8/$G8,\"\")","v":12348.094332521585}]
[{"$f":"IF(D8<>\"\",\"Between\",\"Over\")","v":"Between"},{"$f":"D7","v":200000},{"$f":"IF(D8<>\"\",\"and\",\"\")","v":"and"},1000000,{"$f":"IFERROR(IF(A8=\"between\",A8&\" \"&FIXED(B8,0,0)&\" \"&C8&\" \"&FIXED(D8,0,0),A8&\" \"&FIXED(B8,0,0)),\"invalid bin\")","v":"Between 200,000 and 1,000,000"},{"$f":"IF($P$1,IF($A8=\"between\",SUMIFS(Breakdowns!L:L,Breakdowns!$H:$H,\">=\"&$B8,Breakdowns!$H:$H,\"<\"&$D8,Breakdowns!$AA:$AA,\"=No\"),SUMIFS(Breakdowns!L:L,Breakdowns!$H:$H,\">=\"&$B8,Breakdowns!$AA:$AA,\"=No\")),IF($A8=\"between\",SUMIFS(Breakdowns!L:L,Breakdowns!$H:$H,\">=\"&$B8,Breakdowns!$H:$H,\"<\"&$D8),SUMIFS(Breakdowns!L:L,Breakdowns!$H:$H,\">=\"&$B8)))","v":16492},{"$f":"IF($P$1,IF($A8=\"between\",SUMIFS(Breakdowns!M:M,Breakdowns!$H:$H,\">=\"&$B8,Breakdowns!$H:$H,\"<\"&$D8,Breakdowns!$AA:$AA,\"=No\"),SUMIFS(Breakdowns!M:M,Breakdowns!$H:$H,\">=\"&$B8,Breakdowns!$AA:$AA,\"=No\")),IF($A8=\"between\",SUMIFS(Breakdowns!M:M,Breakdowns!$H:$H,\">=\"&$B8,Breakdowns!$H:$H,\"<\"&$D8),SUMIFS(Breakdowns!M:M,Breakdowns!$H:$H,\">=\"&$B8)))","v":45170},{"$f":"IF($P$1,IF($A8=\"between\",SUMIFS(Breakdowns!O:O,Breakdowns!$H:$H,\">=\"&$B8,Breakdowns!$H:$H,\"<\"&$D8,Breakdowns!$AA:$AA,\"=No\"),SUMIFS(Breakdowns!O:O,Breakdowns!$H:$H,\">=\"&$B8,Breakdowns!$AA:$AA,\"=No\")),IF($A8=\"between\",SUMIFS(Breakdowns!O:O,Breakdowns!$H:$H,\">=\"&$B8,Breakdowns!$H:$H,\"<\"&$D8),SUMIFS(Breakdowns!O:O,Breakdowns!$H:$H,\">=\"&$B8)))","v":58994},{"$f":"IF($P$1,IF($A8=\"between\",SUMIFS(Breakdowns!Q:Q,Breakdowns!$H:$H,\">=\"&$B8,Breakdowns!$H:$H,\"<\"&$D8,Breakdowns!$AA:$AA,\"=No\"),SUMIFS(Breakdowns!Q:Q,Breakdowns!$H:$H,\">=\"&$B8,Breakdowns!$AA:$AA,\"=No\")),IF($A8=\"between\",SUMIFS(Breakdowns!Q:Q,Breakdowns!$H:$H,\">=\"&$B8,Breakdowns!$H:$H,\"<\"&$D8),SUMIFS(Breakdowns!Q:Q,Breakdowns!$H:$H,\">=\"&$B8)))","v":104164},{"$f":"IF($P$1,IF($A8=\"between\",SUMIFS(Breakdowns!S:S,Breakdowns!$H:$H,\">=\"&$B8,Breakdowns!$H:$H,\"<\"&$D8,Breakdowns!$AA:$AA,\"=No\"),SUMIFS(Breakdowns!S:S,Breakdowns!$H:$H,\">=\"&$B8,Breakdowns!$AA:$AA,\"=No\")),IF($A8=\"between\",SUMIFS(Breakdowns!S:S,Breakdowns!$H:$H,\">=\"&$B8,Breakdowns!$H:$H,\"<\"&$D8),SUMIFS(Breakdowns!S:S,Breakdowns!$H:$H,\">=\"&$B8)))","v":623869003},{"$f":"IF($P$1,IF($A8=\"between\",SUMIFS(Breakdowns!U:U,Breakdowns!$H:$H,\">=\"&$B8,Breakdowns!$H:$H,\"<\"&$D8,Breakdowns!$AA:$AA,\"=No\"),SUMIFS(Breakdowns!U:U,Breakdowns!$H:$H,\">=\"&$B8,Breakdowns!$AA:$AA,\"=No\")),IF($A8=\"between\",SUMIFS(Breakdowns!U:U,Breakdowns!$H:$H,\">=\"&$B8,Breakdowns!$H:$H,\"<\"&$D8),SUMIFS(Breakdowns!U:U,Breakdowns!$H:$H,\">=\"&$B8)))","v":557763421},{"$f":"IF($P$1,IF($A8=\"between\",SUMIFS(Breakdowns!W:W,Breakdowns!$H:$H,\">=\"&$B8,Breakdowns!$H:$H,\"<\"&$D8,Breakdowns!$AA:$AA,\"=No\"),SUMIFS(Breakdowns!W:W,Breakdowns!$H:$H,\">=\"&$B8,Breakdowns!$AA:$AA,\"=No\")),IF($A8=\"between\",SUMIFS(Breakdowns!W:W,Breakdowns!$H:$H,\">=\"&$B8,Breakdowns!$H:$H,\"<\"&$D8),SUMIFS(Breakdowns!W:W,Breakdowns!$H:$H,\">=\"&$B8)))","v":4259852},{"$f":"IF($P$1,IF($A8=\"between\",SUMIFS(Breakdowns!Y:Y,Breakdowns!$H:$H,\">=\"&$B8,Breakdowns!$H:$H,\"<\"&$D8,Breakdowns!$AA:$AA,\"=No\"),SUMIFS(Breakdowns!Y:Y,Breakdowns!$H:$H,\">=\"&$B8,Breakdowns!$AA:$AA,\"=No\")),IF($A8=\"between\",SUMIFS(Breakdowns!Y:Y,Breakdowns!$H:$H,\">=\"&$B8,Breakdowns!$H:$H,\"<\"&$D8),SUMIFS(Breakdowns!Y:Y,Breakdowns!$H:$H,\">=\"&$B8)))","v":4069277},null,null,null,null,null,{"$f":"IFERROR(IF(A9=\"Over\",\"Over \"&FIXED(B9,0,0),FIXED(B9,0,0)&\" to \"&FIXED(D9,0,0)),\"\")","v":"Over 1,000,000"},16844.811553607789]
[{"$f":"IF(OR(A8=\"Over\",A8=\"\"),\"\",IF(D9=\"\",\"Over\",\"Between\"))","v":"Over"},{"$f":"IF(D8=\"\",\"\",D8)","v":1000000},{"$f":"IF(D9<>\"\",\"and\",\"\")","v":""},null,{"$f":"IFERROR(IF(A9=\"between\",A9&\" \"&FIXED(B9,0,0)&\" \"&C9&\" \"&FIXED(D9,0,0),A9&\" \"&FIXED(B9,0,0)),\"invalid bin\")","v":"Over 1,000,000"},{"$f":"IF($P$1,IF($A9=\"\",\"\",IF($A9=\"between\",SUMIFS(Breakdowns!L:L,Breakdowns!$H:$H,\">=\"&$B9,Breakdowns!$H:$H,\"<\"&$D9,Breakdowns!$AA:$AA,\"=No\"),SUMIFS(Breakdowns!L:L,Breakdowns!$H:$H,\">=\"&$B9,Breakdowns!$AA:$AA,\"=No\"))),IF($A9=\"\",\"\",IF($A9=\"between\",SUMIFS(Breakdowns!L:L,Breakdowns!$H:$H,\">=\"&$B9,Breakdowns!$H:$H,\"<\"&$D9),SUMIFS(Breakdowns!L:L,Breakdowns!$H:$H,\">=\"&$B9))))","v":82861},{"$f":"IF($P$1,IF($A9=\"\",\"\",IF($A9=\"between\",SUMIFS(Breakdowns!M:M,Breakdowns!$H:$H,\">=\"&$B9,Breakdowns!$H:$H,\"<\"&$D9,Breakdowns!$AA:$AA,\"=No\"),SUMIFS(Breakdowns!M:M,Breakdowns!$H:$H,\">=\"&$B9,Breakdowns!$AA:$AA,\"=No\"))),IF($A9=\"\",\"\",IF($A9=\"between\",SUMIFS(Breakdowns!M:M,Breakdowns!$H:$H,\">=\"&$B9,Breakdowns!$H:$H,\"<\"&$D9),SUMIFS(Breakdowns!M:M,Breakdowns!$H:$H,\">=\"&$B9))))","v":193498},{"$f":"IF($P$1,IF($A9=\"\",\"\",IF($A9=\"between\",SUMIFS(Breakdowns!O:O,Breakdowns!$H:$H,\">=\"&$B9,Breakdowns!$H:$H,\"<\"&$D9,Breakdowns!$AA:$AA,\"=No\"),SUMIFS(Breakdowns!O:O,Breakdowns!$H:$H,\">=\"&$B9,Breakdowns!$AA:$AA,\"=No\"))),IF($A9=\"\",\"\",IF($A9=\"between\",SUMIFS(Breakdowns!O:O,Breakdowns!$H:$H,\">=\"&$B9,Breakdowns!$H:$H,\"<\"&$D9),SUMIFS(Breakdowns!O:O,Breakdowns!$H:$H,\">=\"&$B9))))","v":192240},{"$f":"IF($P$1,IF($A9=\"\",\"\",IF($A9=\"between\",SUMIFS(Breakdowns!Q:Q,Breakdowns!$H:$H,\">=\"&$B9,Breakdowns!$H:$H,\"<\"&$D9,Breakdowns!$AA:$AA,\"=No\"),SUMIFS(Breakdowns!Q:Q,Breakdowns!$H:$H,\">=\"&$B9,Breakdowns!$AA:$AA,\"=No\"))),IF($A9=\"\",\"\",IF($A9=\"between\",SUMIFS(Breakdowns!Q:Q,Breakdowns!$H:$H,\">=\"&$B9,Breakdowns!$H:$H,\"<\"&$D9),SUMIFS(Breakdowns!Q:Q,Breakdowns!$H:$H,\">=\"&$B9))))","v":385738},{"$f":"IF($P$1,IF($A9=\"\",\"\",IF($A9=\"between\",SUMIFS(Breakdowns!S:S,Breakdowns!$H:$H,\">=\"&$B9,Breakdowns!$H:$H,\"<\"&$D9,Breakdowns!$AA:$AA,\"=No\"),SUMIFS(Breakdowns!S:S,Breakdowns!$H:$H,\">=\"&$B9,Breakdowns!$AA:$AA,\"=No\"))),IF($A9=\"\",\"\",IF($A9=\"between\",SUMIFS(Breakdowns!S:S,Breakdowns!$H:$H,\">=\"&$B9,Breakdowns!$H:$H,\"<\"&$D9),SUMIFS(Breakdowns!S:S,Breakdowns!$H:$H,\">=\"&$B9))))","v":3682100576},{"$f":"IF($P$1,IF($A9=\"\",\"\",IF($A9=\"between\",SUMIFS(Breakdowns!U:U,Breakdowns!$H:$H,\">=\"&$B9,Breakdowns!$H:$H,\"<\"&$D9,Breakdowns!$AA:$AA,\"=No\"),SUMIFS(Breakdowns!U:U,Breakdowns!$H:$H,\">=\"&$B9,Breakdowns!$AA:$AA,\"=No\"))),IF($A9=\"\",\"\",IF($A9=\"between\",SUMIFS(Breakdowns!U:U,Breakdowns!$H:$H,\">=\"&$B9,Breakdowns!$H:$H,\"<\"&$D9),SUMIFS(Breakdowns!U:U,Breakdowns!$H:$H,\">=\"&$B9))))","v":3259437346},{"$f":"IF($P$1,IF($A9=\"\",\"\",IF($A9=\"between\",SUMIFS(Breakdowns!W:W,Breakdowns!$H:$H,\">=\"&$B9,Breakdowns!$H:$H,\"<\"&$D9,Breakdowns!$AA:$AA,\"=No\"),SUMIFS(Breakdowns!W:W,Breakdowns!$H:$H,\">=\"&$B9,Breakdowns!$AA:$AA,\"=No\"))),IF($A9=\"\",\"\",IF($A9=\"between\",SUMIFS(Breakdowns!W:W,Breakdowns!$H:$H,\">=\"&$B9,Breakdowns!$H:$H,\"<\"&$D9),SUMIFS(Breakdowns!W:W,Breakdowns!$H:$H,\">=\"&$B9))))","v":218469954},{"$f":"IF($P$1,IF($A9=\"\",\"\",IF($A9=\"between\",SUMIFS(Breakdowns!Y:Y,Breakdowns!$H:$H,\">=\"&$B9,Breakdowns!$H:$H,\"<\"&$D9,Breakdowns!$AA:$AA,\"=No\"),SUMIFS(Breakdowns!Y:Y,Breakdowns!$H:$H,\">=\"&$B9,Breakdowns!$AA:$AA,\"=No\"))),IF($A9=\"\",\"\",IF($A9=\"between\",SUMIFS(Breakdowns!Y:Y,Breakdowns!$H:$H,\">=\"&$B9,Breakdowns!$H:$H,\"<\"&$D9),SUMIFS(Breakdowns!Y:Y,Breakdowns!$H:$H,\">=\"&$B9))))","v":210473402},null,null,null,null,null,{"$f":"IFERROR(IF(A10=\"Over\",\"Over \"&FIXED(B10,0,0),FIXED(B10,0,0)&\" to \"&FIXED(D10,0,0)),\"\")","v":""},""]
[{"$f":"IF(OR(A9=\"Over\",A9=\"\"),\"\",IF(D10=\"\",\"Over\",\"Between\"))","v":""},"",{"$f":"IF(D10<>\"\",\"and\",\"\")","v":""},null,"invalid bin",{"$f":"IF($P$1,IF($A10=\"\",\"\",IF($A10=\"between\",SUMIFS(Breakdowns!L:L,Breakdowns!$H:$H,\">=\"&$B10,Breakdowns!$H:$H,\"<\"&$D10,Breakdowns!$AA:$AA,\"=No\"),SUMIFS(Breakdowns!L:L,Breakdowns!$H:$H,\">=\"&$B10,Breakdowns!$AA:$AA,\"=No\"))),IF($A10=\"\",\"\",IF($A10=\"between\",SUMIFS(Breakdowns!L:L,Breakdowns!$H:$H,\">=\"&$B10,Breakdowns!$H:$H,\"<\"&$D10),SUMIFS(Breakdowns!L:L,Breakdowns!$H:$H,\">=\"&$B10))))","v":""},{"$f":"IF($P$1,IF($A10=\"\",\"\",IF($A10=\"between\",SUMIFS(Breakdowns!M:M,Breakdowns!$H:$H,\">=\"&$B10,Breakdowns!$H:$H,\"<\"&$D10,Breakdowns!$AA:$AA,\"=No\"),SUMIFS(Breakdowns!M:M,Breakdowns!$H:$H,\">=\"&$B10,Breakdowns!$AA:$AA,\"=No\"))),IF($A10=\"\",\"\",IF($A10=\"between\",SUMIFS(Breakdowns!M:M,Breakdowns!$H:$H,\">=\"&$B10,Breakdowns!$H:$H,\"<\"&$D10),SUMIFS(Breakdowns!M:M,Breakdowns!$H:$H,\">=\"&$B10))))","v":""},{"$f":"IF($P$1,IF($A10=\"\",\"\",IF($A10=\"between\",SUMIFS(Breakdowns!O:O,Breakdowns!$H:$H,\">=\"&$B10,Breakdowns!$H:$H,\"<\"&$D10,Breakdowns!$AA:$AA,\"=No\"),SUMIFS(Breakdowns!O:O,Breakdowns!$H:$H,\">=\"&$B10,Breakdowns!$AA:$AA,\"=No\"))),IF($A10=\"\",\"\",IF($A10=\"between\",SUMIFS(Breakdowns!O:O,Breakdowns!$H:$H,\">=\"&$B10,Breakdowns!$H:$H,\"<\"&$D10),SUMIFS(Breakdowns!O:O,Breakdowns!$H:$H,\">=\"&$B10))))","v":""},{"$f":"IF($P$1,IF($A10=\"\",\"\",IF($A10=\"between\",SUMIFS(Breakdowns!Q:Q,Breakdowns!$H:$H,\">=\"&$B10,Breakdowns!$H:$H,\"<\"&$D10,Breakdowns!$AA:$AA,\"=No\"),SUMIFS(Breakdowns!Q:Q,Breakdowns!$H:$H,\">=\"&$B10,Breakdowns!$AA:$AA,\"=No\"))),IF($A10=\"\",\"\",IF($A10=\"between\",SUMIFS(Breakdowns!Q:Q,Breakdowns!$H:$H,\">=\"&$B10,Breakdowns!$H:$H,\"<\"&$D10),SUMIFS(Breakdowns!Q:Q,Breakdowns!$H:$H,\">=\"&$B10))))","v":""},{"$f":"IF($P$1,IF($A10=\"\",\"\",IF($A10=\"between\",SUMIFS(Breakdowns!S:S,Breakdowns!$H:$H,\">=\"&$B10,Breakdowns!$H:$H,\"<\"&$D10,Breakdowns!$AA:$AA,\"=No\"),SUMIFS(Breakdowns!S:S,Breakdowns!$H:$H,\">=\"&$B10,Breakdowns!$AA:$AA,\"=No\"))),IF($A10=\"\",\"\",IF($A10=\"between\",SUMIFS(Breakdowns!S:S,Breakdowns!$H:$H,\">=\"&$B10,Breakdowns!$H:$H,\"<\"&$D10),SUMIFS(Breakdowns!S:S,Breakdowns!$H:$H,\">=\"&$B10))))","v":""},{"$f":"IF($P$1,IF($A10=\"\",\"\",IF($A10=\"between\",SUMIFS(Breakdowns!U:U,Breakdowns!$H:$H,\">=\"&$B10,Breakdowns!$H:$H,\"<\"&$D10,Breakdowns!$AA:$AA,\"=No\"),SUMIFS(Breakdowns!U:U,Breakdowns!$H:$H,\">=\"&$B10,Breakdowns!$AA:$AA,\"=No\"))),IF($A10=\"\",\"\",IF($A10=\"between\",SUMIFS(Breakdowns!U:U,Breakdowns!$H:$H,\">=\"&$B10,Breakdowns!$H:$H,\"<\"&$D10),SUMIFS(Breakdowns!U:U,Breakdowns!$H:$H,\">=\"&$B10))))","v":""},{"$f":"IF($P$1,IF($A10=\"\",\"\",IF($A10=\"between\",SUMIFS(Breakdowns!W:W,Breakdowns!$H:$H,\">=\"&$B10,Breakdowns!$H:$H,\"<\"&$D10,Breakdowns!$AA:$AA,\"=No\"),SUMIFS(Breakdowns!W:W,Breakdowns!$H:$H,\">=\"&$B10,Breakdowns!$AA:$AA,\"=No\"))),IF($A10=\"\",\"\",IF($A10=\"between\",SUMIFS(Breakdowns!W:W,Breakdowns!$H:$H,\">=\"&$B10,Breakdowns!$H:$H,\"<\"&$D10),SUMIFS(Breakdowns!W:W,Breakdowns!$H:$H,\">=\"&$B10))))","v":""},{"$f":"IF($P$1,IF($A10=\"\",\"\",IF($A10=\"between\",SUMIFS(Breakdowns!Y:Y,Breakdowns!$H:$H,\">=\"&$B10,Breakdowns!$H:$H,\"<\"&$D10,Breakdowns!$AA:$AA,\"=No\"),SUMIFS(Breakdowns!Y:Y,Breakdowns!$H:$H,\">=\"&$B10,Breakdowns!$AA:$AA,\"=No\"))),IF($A10=\"\",\"\",IF($A10=\"between\",SUMIFS(Breakdowns!Y:Y,Breakdowns!$H:$H,\">=\"&$B10,Breakdowns!$H:$H,\"<\"&$D10),SUMIFS(Breakdowns!Y:Y,Breakdowns!$H:$H,\">=\"&$B10))))","v":""},null,null,null,null,null,"",""]
["","","",null,"invalid bin",{"$f":"IF($P$1,IF($A11=\"\",\"\",IF($A11=\"between\",SUMIFS(Breakdowns!L:L,Breakdowns!$H:$H,\">=\"&$B11,Breakdowns!$H:$H,\"<\"&$D11,Breakdowns!$AA:$AA,\"=No\"),SUMIFS(Breakdowns!L:L,Breakdowns!$H:$H,\">=\"&$B11,Breakdowns!$AA:$AA,\"=No\"))),IF($A11=\"\",\"\",IF($A11=\"between\",SUMIFS(Breakdowns!L:L,Breakdowns!$H:$H,\">=\"&$B11,Breakdowns!$H:$H,\"<\"&$D11),SUMIFS(Breakdowns!L:L,Breakdowns!$H:$H,\">=\"&$B11))))","v":""},{"$f":"IF($P$1,IF($A11=\"\",\"\",IF($A11=\"between\",SUMIFS(Breakdowns!M:M,Breakdowns!$H:$H,\">=\"&$B11,Breakdowns!$H:$H,\"<\"&$D11,Breakdowns!$AA:$AA,\"=No\"),SUMIFS(Breakdowns!M:M,Breakdowns!$H:$H,\">=\"&$B11,Breakdowns!$AA:$AA,\"=No\"))),IF($A11=\"\",\"\",IF($A11=\"between\",SUMIFS(Breakdowns!M:M,Breakdowns!$H:$H,\">=\"&$B11,Breakdowns!$H:$H,\"<\"&$D11),SUMIFS(Breakdowns!M:M,Breakdowns!$H:$H,\">=\"&$B11))))","v":""},{"$f":"IF($P$1,IF($A11=\"\",\"\",IF($A11=\"between\",SUMIFS(Breakdowns!O:O,Breakdowns!$H:$H,\">=\"&$B11,Breakdowns!$H:$H,\"<\"&$D11,Breakdowns!$AA:$AA,\"=No\"),SUMIFS(Breakdowns!O:O,Breakdowns!$H:$H,\">=\"&$B11,Breakdowns!$AA:$AA,\"=No\"))),IF($A11=\"\",\"\",IF($A11=\"between\",SUMIFS(Breakdowns!O:O,Breakdowns!$H:$H,\">=\"&$B11,Breakdowns!$H:$H,\"<\"&$D11),SUMIFS(Breakdowns!O:O,Breakdowns!$H:$H,\">=\"&$B11))))","v":""},{"$f":"IF($P$1,IF($A11=\"\",\"\",IF($A11=\"between\",SUMIFS(Breakdowns!Q:Q,Breakdowns!$H:$H,\">=\"&$B11,Breakdowns!$H:$H,\"<\"&$D11,Breakdowns!$AA:$AA,\"=No\"),SUMIFS(Breakdowns!Q:Q,Breakdowns!$H:$H,\">=\"&$B11,Breakdowns!$AA:$AA,\"=No\"))),IF($A11=\"\",\"\",IF($A11=\"between\",SUMIFS(Breakdowns!Q:Q,Breakdowns!$H:$H,\">=\"&$B11,Breakdowns!$H:$H,\"<\"&$D11),SUMIFS(Breakdowns!Q:Q,Breakdowns!$H:$H,\">=\"&$B11))))","v":""},{"$f":"IF($P$1,IF($A11=\"\",\"\",IF($A11=\"between\",SUMIFS(Breakdowns!S:S,Breakdowns!$H:$H,\">=\"&$B11,Breakdowns!$H:$H,\"<\"&$D11,Breakdowns!$AA:$AA,\"=No\"),SUMIFS(Breakdowns!S:S,Breakdowns!$H:$H,\">=\"&$B11,Breakdowns!$AA:$AA,\"=No\"))),IF($A11=\"\",\"\",IF($A11=\"between\",SUMIFS(Breakdowns!S:S,Breakdowns!$H:$H,\">=\"&$B11,Breakdowns!$H:$H,\"<\"&$D11),SUMIFS(Breakdowns!S:S,Breakdowns!$H:$H,\">=\"&$B11))))","v":""},{"$f":"IF($P$1,IF($A11=\"\",\"\",IF($A11=\"between\",SUMIFS(Breakdowns!U:U,Breakdowns!$H:$H,\">=\"&$B11,Breakdowns!$H:$H,\"<\"&$D11,Breakdowns!$AA:$AA,\"=No\"),SUMIFS(Breakdowns!U:U,Breakdowns!$H:$H,\">=\"&$B11,Breakdowns!$AA:$AA,\"=No\"))),IF($A11=\"\",\"\",IF($A11=\"between\",SUMIFS(Breakdowns!U:U,Breakdowns!$H:$H,\">=\"&$B11,Breakdowns!$H:$H,\"<\"&$D11),SUMIFS(Breakdowns!U:U,Breakdowns!$H:$H,\">=\"&$B11))))","v":""},{"$f":"IF($P$1,IF($A11=\"\",\"\",IF($A11=\"between\",SUMIFS(Breakdowns!W:W,Breakdowns!$H:$H,\">=\"&$B11,Breakdowns!$H:$H,\"<\"&$D11,Breakdowns!$AA:$AA,\"=No\"),SUMIFS(Breakdowns!W:W,Breakdowns!$H:$H,\">=\"&$B11,Breakdowns!$AA:$AA,\"=No\"))),IF($A11=\"\",\"\",IF($A11=\"between\",SUMIFS(Breakdowns!W:W,Breakdowns!$H:$H,\">=\"&$B11,Breakdowns!$H:$H,\"<\"&$D11),SUMIFS(Breakdowns!W:W,Breakdowns!$H:$H,\">=\"&$B11))))","v":""},{"$f":"IF($P$1,IF($A11=\"\",\"\",IF($A11=\"between\",SUMIFS(Breakdowns!Y:Y,Breakdowns!$H:$H,\">=\"&$B11,Breakdowns!$H:$H,\"<\"&$D11,Breakdowns!$AA:$AA,\"=No\"),SUMIFS(Breakdowns!Y:Y,Breakdowns!$H:$H,\">=\"&$B11,Breakdowns!$AA:$AA,\"=No\"))),IF($A11=\"\",\"\",IF($A11=\"between\",SUMIFS(Breakdowns!Y:Y,Breakdowns!$H:$H,\">=\"&$B11,Breakdowns!$H:$H,\"<\"&$D11),SUMIFS(Breakdowns!Y:Y,Breakdowns!$H:$H,\">=\"&$B11))))","v":""},null,null,null,null,null,"",""]
["","","",null,"invalid bin",{"$f":"IF($P$1,IF($A12=\"\",\"\",IF($A12=\"between\",SUMIFS(Breakdowns!L:L,Breakdowns!$H:$H,\">=\"&$B12,Breakdowns!$H:$H,\"<\"&$D12,Breakdowns!$AA:$AA,\"=No\"),SUMIFS(Breakdowns!L:L,Breakdowns!$H:$H,\">=\"&$B12,Breakdowns!$AA:$AA,\"=No\"))),IF($A12=\"\",\"\",IF($A12=\"between\",SUMIFS(Breakdowns!L:L,Breakdowns!$H:$H,\">=\"&$B12,Breakdowns!$H:$H,\"<\"&$D12),SUMIFS(Breakdowns!L:L,Breakdowns!$H:$H,\">=\"&$B12))))","v":""},{"$f":"IF($P$1,IF($A12=\"\",\"\",IF($A12=\"between\",SUMIFS(Breakdowns!M:M,Breakdowns!$H:$H,\">=\"&$B12,Breakdowns!$H:$H,\"<\"&$D12,Breakdowns!$AA:$AA,\"=No\"),SUMIFS(Breakdowns!M:M,Breakdowns!$H:$H,\">=\"&$B12,Breakdowns!$AA:$AA,\"=No\"))),IF($A12=\"\",\"\",IF($A12=\"between\",SUMIFS(Breakdowns!M:M,Breakdowns!$H:$H,\">=\"&$B12,Breakdowns!$H:$H,\"<\"&$D12),SUMIFS(Breakdowns!M:M,Breakdowns!$H:$H,\">=\"&$B12))))","v":""},{"$f":"IF($P$1,IF($A12=\"\",\"\",IF($A12=\"between\",SUMIFS(Breakdowns!O:O,Breakdowns!$H:$H,\">=\"&$B12,Breakdowns!$H:$H,\"<\"&$D12,Breakdowns!$AA:$AA,\"=No\"),SUMIFS(Breakdowns!O:O,Breakdowns!$H:$H,\">=\"&$B12,Breakdowns!$AA:$AA,\"=No\"))),IF($A12=\"\",\"\",IF($A12=\"between\",SUMIFS(Breakdowns!O:O,Breakdowns!$H:$H,\">=\"&$B12,Breakdowns!$H:$H,\"<\"&$D12),SUMIFS(Breakdowns!O:O,Breakdowns!$H:$H,\">=\"&$B12))))","v":""},{"$f":"IF($P$1,IF($A12=\"\",\"\",IF($A12=\"between\",SUMIFS(Breakdowns!Q:Q,Breakdowns!$H:$H,\">=\"&$B12,Breakdowns!$H:$H,\"<\"&$D12,Breakdowns!$AA:$AA,\"=No\"),SUMIFS(Breakdowns!Q:Q,Breakdowns!$H:$H,\">=\"&$B12,Breakdowns!$AA:$AA,\"=No\"))),IF($A12=\"\",\"\",IF($A12=\"between\",SUMIFS(Breakdowns!Q:Q,Breakdowns!$H:$H,\">=\"&$B12,Breakdowns!$H:$H,\"<\"&$D12),SUMIFS(Breakdowns!Q:Q,Breakdowns!$H:$H,\">=\"&$B12))))","v":""},{"$f":"IF($P$1,IF($A12=\"\",\"\",IF($A12=\"between\",SUMIFS(Breakdowns!S:S,Breakdowns!$H:$H,\">=\"&$B12,Breakdowns!$H:$H,\"<\"&$D12,Breakdowns!$AA:$AA,\"=No\"),SUMIFS(Breakdowns!S:S,Breakdowns!$H:$H,\">=\"&$B12,Breakdowns!$AA:$AA,\"=No\"))),IF($A12=\"\",\"\",IF($A12=\"between\",SUMIFS(Breakdowns!S:S,Breakdowns!$H:$H,\">=\"&$B12,Breakdowns!$H:$H,\"<\"&$D12),SUMIFS(Breakdowns!S:S,Breakdowns!$H:$H,\">=\"&$B12))))","v":""},{"$f":"IF($P$1,IF($A12=\"\",\"\",IF($A12=\"between\",SUMIFS(Breakdowns!U:U,Breakdowns!$H:$H,\">=\"&$B12,Breakdowns!$H:$H,\"<\"&$D12,Breakdowns!$AA:$AA,\"=No\"),SUMIFS(Breakdowns!U:U,Breakdowns!$H:$H,\">=\"&$B12,Breakdowns!$AA:$AA,\"=No\"))),IF($A12=\"\",\"\",IF($A12=\"between\",SUMIFS(Breakdowns!U:U,Breakdowns!$H:$H,\">=\"&$B12,Breakdowns!$H:$H,\"<\"&$D12),SUMIFS(Breakdowns!U:U,Breakdowns!$H:$H,\">=\"&$B12))))","v":""},{"$f":"IF($P$1,IF($A12=\"\",\"\",IF($A12=\"between\",SUMIFS(Breakdowns!W:W,Breakdowns!$H:$H,\">=\"&$B12,Breakdowns!$H:$H,\"<\"&$D12,Breakdowns!$AA:$AA,\"=No\"),SUMIFS(Breakdowns!W:W,Breakdowns!$H:$H,\">=\"&$B12,Breakdowns!$AA:$AA,\"=No\"))),IF($A12=\"\",\"\",IF($A12=\"between\",SUMIFS(Breakdowns!W:W,Breakdowns!$H:$H,\">=\"&$B12,Breakdowns!$H:$H,\"<\"&$D12),SUMIFS(Breakdowns!W:W,Breakdowns!$H:$H,\">=\"&$B12))))","v":""},{"$f":"IF($P$1,IF($A12=\"\",\"\",IF($A12=\"between\",SUMIFS(Breakdowns!Y:Y,Breakdowns!$H:$H,\">=\"&$B12,Breakdowns!$H:$H,\"<\"&$D12,Breakdowns!$AA:$AA,\"=No\"),SUMIFS(Breakdowns!Y:Y,Breakdowns!$H:$H,\">=\"&$B12,Breakdowns!$AA:$AA,\"=No\"))),IF($A12=\"\",\"\",IF($A12=\"between\",SUMIFS(Breakdowns!Y:Y,Breakdowns!$H:$H,\">=\"&$B12,Breakdowns!$H:$H,\"<\"&$D12),SUMIFS(Breakdowns!Y:Y,Breakdowns!$H:$H,\">=\"&$B12))))","v":""},null,null,null,null,null,"",""]
["","","",null,"invalid bin",{"$f":"IF($P$1,IF($A13=\"\",\"\",IF($A13=\"between\",SUMIFS(Breakdowns!L:L,Breakdowns!$H:$H,\">=\"&$B13,Breakdowns!$H:$H,\"<\"&$D13,Breakdowns!$AA:$AA,\"=No\"),SUMIFS(Breakdowns!L:L,Breakdowns!$H:$H,\">=\"&$B13,Breakdowns!$AA:$AA,\"=No\"))),IF($A13=\"\",\"\",IF($A13=\"between\",SUMIFS(Breakdowns!L:L,Breakdowns!$H:$H,\">=\"&$B13,Breakdowns!$H:$H,\"<\"&$D13),SUMIFS(Breakdowns!L:L,Breakdowns!$H:$H,\">=\"&$B13))))","v":""},{"$f":"IF($P$1,IF($A13=\"\",\"\",IF($A13=\"between\",SUMIFS(Breakdowns!M:M,Breakdowns!$H:$H,\">=\"&$B13,Breakdowns!$H:$H,\"<\"&$D13,Breakdowns!$AA:$AA,\"=No\"),SUMIFS(Breakdowns!M:M,Breakdowns!$H:$H,\">=\"&$B13,Breakdowns!$AA:$AA,\"=No\"))),IF($A13=\"\",\"\",IF($A13=\"between\",SUMIFS(Breakdowns!M:M,Breakdowns!$H:$H,\">=\"&$B13,Breakdowns!$H:$H,\"<\"&$D13),SUMIFS(Breakdowns!M:M,Breakdowns!$H:$H,\">=\"&$B13))))","v":""},{"$f":"IF($P$1,IF($A13=\"\",\"\",IF($A13=\"between\",SUMIFS(Breakdowns!O:O,Breakdowns!$H:$H,\">=\"&$B13,Breakdowns!$H:$H,\"<\"&$D13,Breakdowns!$AA:$AA,\"=No\"),SUMIFS(Breakdowns!O:O,Breakdowns!$H:$H,\">=\"&$B13,Breakdowns!$AA:$AA,\"=No\"))),IF($A13=\"\",\"\",IF($A13=\"between\",SUMIFS(Breakdowns!O:O,Breakdowns!$H:$H,\">=\"&$B13,Breakdowns!$H:$H,\"<\"&$D13),SUMIFS(Breakdowns!O:O,Breakdowns!$H:$H,\">=\"&$B13))))","v":""},{"$f":"IF($P$1,IF($A13=\"\",\"\",IF($A13=\"between\",SUMIFS(Breakdowns!Q:Q,Breakdowns!$H:$H,\">=\"&$B13,Breakdowns!$H:$H,\"<\"&$D13,Breakdowns!$AA:$AA,\"=No\"),SUMIFS(Breakdowns!Q:Q,Breakdowns!$H:$H,\">=\"&$B13,Breakdowns!$AA:$AA,\"=No\"))),IF($A13=\"\",\"\",IF($A13=\"between\",SUMIFS(Breakdowns!Q:Q,Breakdowns!$H:$H,\">=\"&$B13,Breakdowns!$H:$H,\"<\"&$D13),SUMIFS(Breakdowns!Q:Q,Breakdowns!$H:$H,\">=\"&$B13))))","v":""},{"$f":"IF($P$1,IF($A13=\"\",\"\",IF($A13=\"between\",SUMIFS(Breakdowns!S:S,Breakdowns!$H:$H,\">=\"&$B13,Breakdowns!$H:$H,\"<\"&$D13,Breakdowns!$AA:$AA,\"=No\"),SUMIFS(Breakdowns!S:S,Breakdowns!$H:$H,\">=\"&$B13,Breakdowns!$AA:$AA,\"=No\"))),IF($A13=\"\",\"\",IF($A13=\"between\",SUMIFS(Breakdowns!S:S,Breakdowns!$H:$H,\">=\"&$B13,Breakdowns!$H:$H,\"<\"&$D13),SUMIFS(Breakdowns!S:S,Breakdowns!$H:$H,\">=\"&$B13))))","v":""},{"$f":"IF($P$1,IF($A13=\"\",\"\",IF($A13=\"between\",SUMIFS(Breakdowns!U:U,Breakdowns!$H:$H,\">=\"&$B13,Breakdowns!$H:$H,\"<\"&$D13,Breakdowns!$AA:$AA,\"=No\"),SUMIFS(Breakdowns!U:U,Breakdowns!$H:$H,\">=\"&$B13,Breakdowns!$AA:$AA,\"=No\"))),IF($A13=\"\",\"\",IF($A13=\"between\",SUMIFS(Breakdowns!U:U,Breakdowns!$H:$H,\">=\"&$B13,Breakdowns!$H:$H,\"<\"&$D13),SUMIFS(Breakdowns!U:U,Breakdowns!$H:$H,\">=\"&$B13))))","v":""},{"$f":"IF($P$1,IF($A13=\"\",\"\",IF($A13=\"between\",SUMIFS(Breakdowns!W:W,Breakdowns!$H:$H,\">=\"&$B13,Breakdowns!$H:$H,\"<\"&$D13,Breakdowns!$AA:$AA,\"=No\"),SUMIFS(Breakdowns!W:W,Breakdowns!$H:$H,\">=\"&$B13,Breakdowns!$AA:$AA,\"=No\"))),IF($A13=\"\",\"\",IF($A13=\"between\",SUMIFS(Breakdowns!W:W,Breakdowns!$H:$H,\">=\"&$B13,Breakdowns!$H:$H,\"<\"&$D13),SUMIFS(Breakdowns!W:W,Breakdowns!$H:$H,\">=\"&$B13))))","v":""},{"$f":"IF($P$1,IF($A13=\"\",\"\",IF($A13=\"between\",SUMIFS(Breakdowns!Y:Y,Breakdowns!$H:$H,\">=\"&$B13,Breakdowns!$H:$H,\"<\"&$D13,Breakdowns!$AA:$AA,\"=No\"),SUMIFS(Breakdowns!Y:Y,Breakdowns!$H:$H,\">=\"&$B13,Breakdowns!$AA:$AA,\"=No\"))),IF($A13=\"\",\"\",IF($A13=\"between\",SUMIFS(Breakdowns!Y:Y,Breakdowns!$H:$H,\">=\"&$B13,Breakdowns!$H:$H,\"<\"&$D13),SUMIFS(Breakdowns!Y:Y,Breakdowns!$H:$H,\">=\"&$B13))))","v":""},null,null,null,null,null,"",""]
["","","",null,"invalid bin",{"$f":"IF($P$1,IF($A14=\"\",\"\",IF($A14=\"between\",SUMIFS(Breakdowns!L:L,Breakdowns!$H:$H,\">=\"&$B14,Breakdowns!$H:$H,\"<\"&$D14,Breakdowns!$AA:$AA,\"=No\"),SUMIFS(Breakdowns!L:L,Breakdowns!$H:$H,\">=\"&$B14,Breakdowns!$AA:$AA,\"=No\"))),IF($A14=\"\",\"\",IF($A14=\"between\",SUMIFS(Breakdowns!L:L,Breakdowns!$H:$H,\">=\"&$B14,Breakdowns!$H:$H,\"<\"&$D14),SUMIFS(Breakdowns!L:L,Breakdowns!$H:$H,\">=\"&$B14))))","v":""},{"$f":"IF($P$1,IF($A14=\"\",\"\",IF($A14=\"between\",SUMIFS(Breakdowns!M:M,Breakdowns!$H:$H,\">=\"&$B14,Breakdowns!$H:$H,\"<\"&$D14,Breakdowns!$AA:$AA,\"=No\"),SUMIFS(Breakdowns!M:M,Breakdowns!$H:$H,\">=\"&$B14,Breakdowns!$AA:$AA,\"=No\"))),IF($A14=\"\",\"\",IF($A14=\"between\",SUMIFS(Breakdowns!M:M,Breakdowns!$H:$H,\">=\"&$B14,Breakdowns!$H:$H,\"<\"&$D14),SUMIFS(Breakdowns!M:M,Breakdowns!$H:$H,\">=\"&$B14))))","v":""},{"$f":"IF($P$1,IF($A14=\"\",\"\",IF($A14=\"between\",SUMIFS(Breakdowns!O:O,Breakdowns!$H:$H,\">=\"&$B14,Breakdowns!$H:$H,\"<\"&$D14,Breakdowns!$AA:$AA,\"=No\"),SUMIFS(Breakdowns!O:O,Breakdowns!$H:$H,\">=\"&$B14,Breakdowns!$AA:$AA,\"=No\"))),IF($A14=\"\",\"\",IF($A14=\"between\",SUMIFS(Breakdowns!O:O,Breakdowns!$H:$H,\">=\"&$B14,Breakdowns!$H:$H,\"<\"&$D14),SUMIFS(Breakdowns!O:O,Breakdowns!$H:$H,\">=\"&$B14))))","v":""},{"$f":"IF($P$1,IF($A14=\"\",\"\",IF($A14=\"between\",SUMIFS(Breakdowns!Q:Q,Breakdowns!$H:$H,\">=\"&$B14,Breakdowns!$H:$H,\"<\"&$D14,Breakdowns!$AA:$AA,\"=No\"),SUMIFS(Breakdowns!Q:Q,Breakdowns!$H:$H,\">=\"&$B14,Breakdowns!$AA:$AA,\"=No\"))),IF($A14=\"\",\"\",IF($A14=\"between\",SUMIFS(Breakdowns!Q:Q,Breakdowns!$H:$H,\">=\"&$B14,Breakdowns!$H:$H,\"<\"&$D14),SUMIFS(Breakdowns!Q:Q,Breakdowns!$H:$H,\">=\"&$B14))))","v":""},{"$f":"IF($P$1,IF($A14=\"\",\"\",IF($A14=\"between\",SUMIFS(Breakdowns!S:S,Breakdowns!$H:$H,\">=\"&$B14,Breakdowns!$H:$H,\"<\"&$D14,Breakdowns!$AA:$AA,\"=No\"),SUMIFS(Breakdowns!S:S,Breakdowns!$H:$H,\">=\"&$B14,Breakdowns!$AA:$AA,\"=No\"))),IF($A14=\"\",\"\",IF($A14=\"between\",SUMIFS(Breakdowns!S:S,Breakdowns!$H:$H,\">=\"&$B14,Breakdowns!$H:$H,\"<\"&$D14),SUMIFS(Breakdowns!S:S,Breakdowns!$H:$H,\">=\"&$B14))))","v":""},{"$f":"IF($P$1,IF($A14=\"\",\"\",IF($A14=\"between\",SUMIFS(Breakdowns!U:U,Breakdowns!$H:$H,\">=\"&$B14,Breakdowns!$H:$H,\"<\"&$D14,Breakdowns!$AA:$AA,\"=No\"),SUMIFS(Breakdowns!U:U,Breakdowns!$H:$H,\">=\"&$B14,Breakdowns!$AA:$AA,\"=No\"))),IF($A14=\"\",\"\",IF($A14=\"between\",SUMIFS(Breakdowns!U:U,Breakdowns!$H:$H,\">=\"&$B14,Breakdowns!$H:$H,\"<\"&$D14),SUMIFS(Breakdowns!U:U,Breakdowns!$H:$H,\">=\"&$B14))))","v":""},{"$f":"IF($P$1,IF($A14=\"\",\"\",IF($A14=\"between\",SUMIFS(Breakdowns!W:W,Breakdowns!$H:$H,\">=\"&$B14,Breakdowns!$H:$H,\"<\"&$D14,Breakdowns!$AA:$AA,\"=No\"),SUMIFS(Breakdowns!W:W,Breakdowns!$H:$H,\">=\"&$B14,Breakdowns!$AA:$AA,\"=No\"))),IF($A14=\"\",\"\",IF($A14=\"between\",SUMIFS(Breakdowns!W:W,Breakdowns!$H:$H,\">=\"&$B14,Breakdowns!$H:$H,\"<\"&$D14),SUMIFS(Breakdowns!W:W,Breakdowns!$H:$H,\">=\"&$B14))))","v":""},{"$f":"IF($P$1,IF($A14=\"\",\"\",IF($A14=\"between\",SUMIFS(Breakdowns!Y:Y,Breakdowns!$H:$H,\">=\"&$B14,Breakdowns!$H:$H,\"<\"&$D14,Breakdowns!$AA:$AA,\"=No\"),SUMIFS(Breakdowns!Y:Y,Breakdowns!$H:$H,\">=\"&$B14,Breakdowns!$AA:$AA,\"=No\"))),IF($A14=\"\",\"\",IF($A14=\"between\",SUMIFS(Breakdowns!Y:Y,Breakdowns!$H:$H,\">=\"&$B14,Breakdowns!$H:$H,\"<\"&$D14),SUMIFS(Breakdowns!Y:Y,Breakdowns!$H:$H,\">=\"&$B14))))","v":""},null,null,null,null,null,"",""]
["","","",null,"invalid bin",{"$f":"IF($P$1,IF($A15=\"\",\"\",IF($A15=\"between\",SUMIFS(Breakdowns!L:L,Breakdowns!$H:$H,\">=\"&$B15,Breakdowns!$H:$H,\"<\"&$D15,Breakdowns!$AA:$AA,\"=No\"),SUMIFS(Breakdowns!L:L,Breakdowns!$H:$H,\">=\"&$B15,Breakdowns!$AA:$AA,\"=No\"))),IF($A15=\"\",\"\",IF($A15=\"between\",SUMIFS(Breakdowns!L:L,Breakdowns!$H:$H,\">=\"&$B15,Breakdowns!$H:$H,\"<\"&$D15),SUMIFS(Breakdowns!L:L,Breakdowns!$H:$H,\">=\"&$B15))))","v":""},{"$f":"IF($P$1,IF($A15=\"\",\"\",IF($A15=\"between\",SUMIFS(Breakdowns!M:M,Breakdowns!$H:$H,\">=\"&$B15,Breakdowns!$H:$H,\"<\"&$D15,Breakdowns!$AA:$AA,\"=No\"),SUMIFS(Breakdowns!M:M,Breakdowns!$H:$H,\">=\"&$B15,Breakdowns!$AA:$AA,\"=No\"))),IF($A15=\"\",\"\",IF($A15=\"between\",SUMIFS(Breakdowns!M:M,Breakdowns!$H:$H,\">=\"&$B15,Breakdowns!$H:$H,\"<\"&$D15),SUMIFS(Breakdowns!M:M,Breakdowns!$H:$H,\">=\"&$B15))))","v":""},{"$f":"IF($P$1,IF($A15=\"\",\"\",IF($A15=\"between\",SUMIFS(Breakdowns!O:O,Breakdowns!$H:$H,\">=\"&$B15,Breakdowns!$H:$H,\"<\"&$D15,Breakdowns!$AA:$AA,\"=No\"),SUMIFS(Breakdowns!O:O,Breakdowns!$H:$H,\">=\"&$B15,Breakdowns!$AA:$AA,\"=No\"))),IF($A15=\"\",\"\",IF($A15=\"between\",SUMIFS(Breakdowns!O:O,Breakdowns!$H:$H,\">=\"&$B15,Breakdowns!$H:$H,\"<\"&$D15),SUMIFS(Breakdowns!O:O,Breakdowns!$H:$H,\">=\"&$B15))))","v":""},{"$f":"IF($P$1,IF($A15=\"\",\"\",IF($A15=\"between\",SUMIFS(Breakdowns!Q:Q,Breakdowns!$H:$H,\">=\"&$B15,Breakdowns!$H:$H,\"<\"&$D15,Breakdowns!$AA:$AA,\"=No\"),SUMIFS(Breakdowns!Q:Q,Breakdowns!$H:$H,\">=\"&$B15,Breakdowns!$AA:$AA,\"=No\"))),IF($A15=\"\",\"\",IF($A15=\"between\",SUMIFS(Breakdowns!Q:Q,Breakdowns!$H:$H,\">=\"&$B15,Breakdowns!$H:$H,\"<\"&$D15),SUMIFS(Breakdowns!Q:Q,Breakdowns!$H:$H,\">=\"&$B15))))","v":""},{"$f":"IF($P$1,IF($A15=\"\",\"\",IF($A15=\"between\",SUMIFS(Breakdowns!S:S,Breakdowns!$H:$H,\">=\"&$B15,Breakdowns!$H:$H,\"<\"&$D15,Breakdowns!$AA:$AA,\"=No\"),SUMIFS(Breakdowns!S:S,Breakdowns!$H:$H,\">=\"&$B15,Breakdowns!$AA:$AA,\"=No\"))),IF($A15=\"\",\"\",IF($A15=\"between\",SUMIFS(Breakdowns!S:S,Breakdowns!$H:$H,\">=\"&$B15,Breakdowns!$H:$H,\"<\"&$D15),SUMIFS(Breakdowns!S:S,Breakdowns!$H:$H,\">=\"&$B15))))","v":""},{"$f":"IF($P$1,IF($A15=\"\",\"\",IF($A15=\"between\",SUMIFS(Breakdowns!U:U,Breakdowns!$H:$H,\">=\"&$B15,Breakdowns!$H:$H,\"<\"&$D15,Breakdowns!$AA:$AA,\"=No\"),SUMIFS(Breakdowns!U:U,Breakdowns!$H:$H,\">=\"&$B15,Breakdowns!$AA:$AA,\"=No\"))),IF($A15=\"\",\"\",IF($A15=\"between\",SUMIFS(Breakdowns!U:U,Breakdowns!$H:$H,\">=\"&$B15,Breakdowns!$H:$H,\"<\"&$D15),SUMIFS(Breakdowns!U:U,Breakdowns!$H:$H,\">=\"&$B15))))","v":""},{"$f":"IF($P$1,IF($A15=\"\",\"\",IF($A15=\"between\",SUMIFS(Breakdowns!W:W,Breakdowns!$H:$H,\">=\"&$B15,Breakdowns!$H:$H,\"<\"&$D15,Breakdowns!$AA:$AA,\"=No\"),SUMIFS(Breakdowns!W:W,Breakdowns!$H:$H,\">=\"&$B15,Breakdowns!$AA:$AA,\"=No\"))),IF($A15=\"\",\"\",IF($A15=\"between\",SUMIFS(Breakdowns!W:W,Breakdowns!$H:$H,\">=\"&$B15,Breakdowns!$H:$H,\"<\"&$D15),SUMIFS(Breakdowns!W:W,Breakdowns!$H:$H,\">=\"&$B15))))","v":""},{"$f":"IF($P$1,IF($A15=\"\",\"\",IF($A15=\"between\",SUMIFS(Breakdowns!Y:Y,Breakdowns!$H:$H,\">=\"&$B15,Breakdowns!$H:$H,\"<\"&$D15,Breakdowns!$AA:$AA,\"=No\"),SUMIFS(Breakdowns!Y:Y,Breakdowns!$H:$H,\">=\"&$B15,Breakdowns!$AA:$AA,\"=No\"))),IF($A15=\"\",\"\",IF($A15=\"between\",SUMIFS(Breakdowns!Y:Y,Breakdowns!$H:$H,\">=\"&$B15,Breakdowns!$H:$H,\"<\"&$D15),SUMIFS(Breakdowns!Y:Y,Breakdowns!$H:$H,\">=\"&$B15))))","v":""},null,null,null,null,null,null,""]
[null,null,null,null,null,null,null,null,null,null,null,null,null,null,null,null,null,null,{"$f":"IFERROR(S6&\": \"&FIXED(T6,0,0)&CHAR(10),\"\")&IFERROR(S7&\": \"&FIXED(T7,0,0)&CHAR(10),\"\")&IFERROR(S8&\": \"&FIXED(T8,0,0)&CHAR(10),\"\")&IFERROR(S9&\": \"&FIXED(T9,0,0)&CHAR(10),\"\")&IFERROR(S10&\": \"&FIXED(T10,0,0)&CHAR(10),\"\")&IFERROR(S11&\": \"&FIXED(T11,0,0)&CHAR(10),\"\")&IFERROR(S12&\": \"&FIXED(T12,0,0)&CHAR(10),\"\")&IFERROR(S13&\": \"&FIXED(T13,0,0)&CHAR(10),\"\")&IFERROR(S14&\": \"&FIXED(T14,0,0),\"\")","v":"Under 200,000: 18,535\n200,000 to 1,000,000: 12,348\nOver 1,000,000: 16,845\n"}]
[]
[]
["By Mode/Type of Service"]
["Mode","Type","Description","Column1","Column2","VOMS","Major Mechanical Failures","Other Mechanical Failures","Total Mechanical Failures","Vehicle/Passenger Car Miles","Vehicle/Passenger Car Revenue Miles","Train Miles","Train Revenue Miles"]
["TR","PT","Aerial Tramway - Purchased Transportation",null,null,{"$f":"IF($P$1,SUMIFS(Breakdowns!L:L,Breakdowns!$J:$J,\"=\"&$A21,Breakdowns!$K:$K,\"=\"&$B21,Breakdowns!$AA:$AA,\"=No\"),SUMIFS(Breakdowns!L:L,Breakdowns!$J:$J,\"=\"&$A21,Breakdowns!$K:$K,\"=\"&$B21))","v":2},{"$f":"IF($P$1,SUMIFS(Breakdowns!M:M,Breakdowns!$J:$J,\"=\"&$A21,Breakdowns!$K:$K,\"=\"&$B21,Breakdowns!$AA:$AA,\"=No\"),SUMIFS(Breakdowns!M:M,Breakdowns!$J:$J,\"=\"&$A21,Breakdowns!$K:$K,\"=\"&$B21))","v":0},{"$f":"IF($P$1,SUMIFS(Breakdowns!O:O,Breakdowns!$J:$J,\"=\"&$A21,Breakdowns!$K:$K,\"=\"&$B21,Breakdowns!$AA:$AA,\"=No\"),SUMIFS(Breakdowns!O:O,Breakdowns!$J:$J,\"=\"&$A21,Breakdowns!$K:$K,\"=\"&$B21))","v":0},{"$f":"IF($P$1,SUMIFS(Breakdowns!Q:Q,Breakdowns!$J:$J,\"=\"&$A21,Breakdowns!$K:$K,\"=\"&$B21,Breakdowns!$AA:$AA,\"=No\"),SUMIFS(Breakdowns!Q:Q,Breakdowns!$J:$J,\"=\"&$A21,Breakdowns!$K:$K,\"=\"&$B21))","v":0},{"$f":"IF($P$1,SUMIFS(Breakdowns!S:S,Breakdowns!$J:$J,\"=\"&$A21,Breakdowns!$K:$K,\"=\"&$B21,Breakdowns!$AA:$AA,\"=No\"),SUMIFS(Breakdowns!S:S,Breakdowns!$J:$J,\"=\"&$A21,Breakdowns!$K:$K,\"=\"&$B21))","v":32729},{"$f":"IF($P$1,SUMIFS(Breakdowns!U:U,Breakdowns!$J:$J,\"=\"&$A21,Breakdowns!$K:$K,\"=\"&$B21,Breakdowns!$AA:$AA,\"=No\"),SUMIFS(Breakdowns!U:U,Breakdowns!$J:$J,\"=\"&$A21,Breakdowns!$K:$K,\"=\"&$B21))","v":32729},{"$f":"IF($P$1,SUMIFS(Breakdowns!W:W,Breakdowns!$J:$J,\"=\"&$A21,Breakdowns!$K:$K,\"=\"&$B21,Breakdowns!$AA:$AA,\"=No\"),SUMIFS(Breakdowns!W:W,Breakdowns!$J:$J,\"=\"&$A21,Breakdowns!$K:$K,\"=\"&$B21))","v":0},{"$f":"IF($P$1,SUMIFS(Breakdowns!Y:Y,Breakdowns!$J:$J,\"=\"&$A21,Breakdowns!$K:$K,\"=\"&$B21,Breakdowns!$AA:$AA,\"=No\"),SUMIFS(Breakdowns!Y:Y,Breakdowns!$J:$J,\"=\"&$A21,Breakdowns!$K:$K,\"=\"&$B21))","v":0}]
["AR","DO","Alaska Railroad - Directly Operated",null,null,{"$f":"IF($P$1,SUMIFS(Breakdowns!L:L,Breakdowns!$J:$J,\"=\"&$A22,Breakdowns!$K:$K,\"=\"&$B22,Breakdowns!$AA:$AA,\"=No\"),SUMIFS(Breakdowns!L:L,Breakdowns!$J:$J,\"=\"&$A22,Breakdowns!$K:$K,\"=\"&$B22))","v":39},{"$f":"IF($P$1,SUMIFS(Breakdowns!M:M,Breakdowns!$J:$J,\"=\"&$A22,Breakdowns!$K:$K,\"=\"&$B22,Breakdowns!$AA:$AA,\"=No\"),SUMIFS(Breakdowns!M:M,Breakdowns!$J:$J,\"=\"&$A22,Breakdowns!$K:$K,\"=\"&$B22))","v":3},{"$f":"IF($P$1,SUMIFS(Breakdowns!O:O,Breakdowns!$J:$J,\"=\"&$A22,Breakdowns!$K:$K,\"=\"&$B22,Breakdowns!$AA:$AA,\"=No\"),SUMIFS(Breakdowns!O:O,Breakdowns!$J:$J,\"=\"&$A22,Breakdowns!$K:$K,\"=\"&$B22))","v":2},{"$f":"IF($P$1,SUMIFS(Breakdowns!Q:Q,Breakdowns!$J:$J,\"=\"&$A22,Breakdowns!$K:$K,\"=\"&$B22,Breakdowns!$AA:$AA,\"=No\"),SUMIFS(Breakdowns!Q:Q,Breakdowns!$J:$J,\"=\"&$A22,Breakdowns!$K:$K,\"=\"&$B22))","v":5},{"$f":"IF($P$1,SUMIFS(Breakdowns!S:S,Breakdowns!$J:$J,\"=\"&$A22,Breakdowns!$K:$K,\"=\"&$B22,Breakdowns!$AA:$AA,\"=No\"),SUMIFS(Breakdowns!S:S,Breakdowns!$J:$J,\"=\"&$A22,Breakdowns!$K:$K,\"=\"&$B22))","v":1104192},{"$f":"IF($P$1,SUMIFS(Breakdowns!U:U,Breakdowns!$J:$J,\"=\"&$A22,Breakdowns!$K:$K,\"=\"&$B22,Breakdowns!$AA:$AA,\"=No\"),SUMIFS(Breakdowns!U:U,Breakdowns!$J:$J,\"=\"&$A22,Breakdowns!$K:$K,\"=\"&$B22))","v":1103518},{"$f":"IF($P$1,SUMIFS(Breakdowns!W:W,Breakdowns!$J:$J,\"=\"&$A22,Breakdowns!$K:$K,\"=\"&$B22,Breakdowns!$AA:$AA,\"=No\"),SUMIFS(Breakdowns!W:W,Breakdowns!$J:$J,\"=\"&$A22,Breakdowns!$K:$K,\"=\"&$B22))","v":187671},{"$f":"IF($P$1,SUMIFS(Breakdowns!Y:Y,Breakdowns!$J:$J,\"=\"&$A22,Breakdowns!$K:$K,\"=\"&$B22,Breakdowns!$AA:$AA,\"=No\"),SUMIFS(Breakdowns!Y:Y,Breakdowns!$J:$J,\"=\"&$A22,Breakdowns!$K:$K,\"=\"&$B22))","v":187447}]
["MB","DO","Bus - Directly Operated",null,null,{"$f":"IF($P$1,SUMIFS(Breakdowns!L:L,Breakdowns!$J:$J,\"=\"&$A23,Breakdowns!$K:$K,\"=\"&$B23,Breakdowns!$AA:$AA,\"=No\"),SUMIFS(Breakdowns!L:L,Breakdowns!$J:$J,\"=\"&$A23,Breakdowns!$K:$K,\"=\"&$B23))","v":38366},{"$f":"IF($P$1,SUMIFS(Breakdowns!M:M,Breakdowns!$J:$J,\"=\"&$A23,Breakdowns!$K:$K,\"=\"&$B23,Breakdowns!$AA:$AA,\"=No\"),SUMIFS(Breakdowns!M:M,Breakdowns!$J:$J,\"=\"&$A23,Breakdowns!$K:$K,\"=\"&$B23))","v":162740},{"$f":"IF($P$1,SUMIFS(Breakdowns!O:O,Breakdowns!$J:$J,\"=\"&$A23,Breakdowns!$K:$K,\"=\"&$B23,Breakdowns!$AA:$AA,\"=No\"),SUMIFS(Breakdowns!O:O,Breakdowns!$J:$J,\"=\"&$A23,Breakdowns!$K:$K,\"=\"&$B23))","v":153631},{"$f":"IF($P$1,SUMIFS(Breakdowns!Q:Q,Breakdowns!$J:$J,\"=\"&$A23,Breakdowns!$K:$K,\"=\"&$B23,Breakdowns!$AA:$AA,\"=No\"),SUMIFS(Breakdowns!Q:Q,Breakdowns!$J:$J,\"=\"&$A23,Breakdowns!$K:$K,\"=\"&$B23))","v":316371},{"$f":"IF($P$1,SUMIFS(Breakdowns!S:S,Breakdowns!$J:$J,\"=\"&$A23,Breakdowns!$K:$K,\"=\"&$B23,Breakdowns!$AA:$AA,\"=No\"),SUMIFS(Breakdowns!S:S,Breakdowns!$J:$J,\"=\"&$A23,Breakdowns!$K:$K,\"=\"&$B23))","v":1675858675},{"$f":"IF($P$1,SUMIFS(Breakdowns!U:U,Breakdowns!$J:$J,\"=\"&$A23,Breakdowns!$K:$K,\"=\"&$B23,Breakdowns!$AA:$AA,\"=No\"),SUMIFS(Breakdowns!U:U,Breakdowns!$J:$J,\"=\"&$A23,Breakdowns!$K:$K,\"=\"&$B23))","v":1449043183},{"$f":"IF($P$1,SUMIFS(Breakdowns!W:W,Breakdowns!$J:$J,\"=\"&$A23,Breakdowns!$K:$K,\"=\"&$B23,Breakdowns!$AA:$AA,\"=No\"),SUMIFS(Breakdowns!W:W,Breakdowns!$J:$J,\"=\"&$A23,Breakdowns!$K:$K,\"=\"&$B23))","v":0},{"$f":"IF($P$1,SUMIFS(Breakdowns!Y:Y,Breakdowns!$J:$J,\"=\"&$A23,Breakdowns!$K:$K,\"=\"&$B23,Breakdowns!$AA:$AA,\"=No\"),SUMIFS(Breakdowns!Y:Y,Breakdowns!$J:$J,\"=\"&$A23,Breakdowns!$K:$K,\"=\"&$B23))","v":0}]
["MB","PT","Bus - Purchased Transportation",null,null,{"$f":"IF($P$1,SUMIFS(Breakdowns!L:L,Breakdowns!$J:$J,\"=\"&$A24,Breakdowns!$K:$K,\"=\"&$B24,Breakdowns!$AA:$AA,\"=No\"),SUMIFS(Breakdowns!L:L,Breakdowns!$J:$J,\"=\"&$A24,Breakdowns!$K:$K,\"=\"&$B24))","v":8356},{"$f":"IF($P$1,SUMIFS(Breakdowns!M:M,Breakdowns!$J:$J,\"=\"&$A24,Breakdowns!$K:$K,\"=\"&$B24,Breakdowns!$AA:$AA,\"=No\"),SUMIFS(Breakdowns!M:M,Breakdowns!$J:$J,\"=\"&$A24,Breakdowns!$K:$K,\"=\"&$B24))","v":34681},{"$f":"IF($P$1,SUMIFS(Breakdowns!O:O,Breakdowns!$J:$J,\"=\"&$A24,Breakdowns!$K:$K,\"=\"&$B24,Breakdowns!$AA:$AA,\"=No\"),SUMIFS(Breakdowns!O:O,Breakdowns!$J:$J,\"=\"&$A24,Breakdowns!$K:$K,\"=\"&$B24))","v":31379},{"$f":"IF($P$1,SUMIFS(Breakdowns!Q:Q,Breakdowns!$J:$J,\"=\"&$A24,Breakdowns!$K:$K,\"=\"&$B24,Breakdowns!$AA:$AA,\"=No\"),SUMIFS(Breakdowns!Q:Q,Breakdowns!$J:$J,\"=\"&$A24,Breakdowns!$K:$K,\"=\"&$B24))","v":66060},{"$f":"IF($P$1,SUMIFS(Breakdowns!S:S,Breakdowns!$J:$J,\"=\"&$A24,Breakdowns!$K:$K,\"=\"&$B24,Breakdowns!$AA:$AA,\"=No\"),SUMIFS(Breakdowns!S:S,Breakdowns!$J:$J,\"=\"&$A24,Breakdowns!$K:$K,\"=\"&$B24))","v":392717107},{"$f":"IF($P$1,SUMIFS(Breakdowns!U:U,Breakdowns!$J:$J,\"=\"&$A24,Breakdowns!$K:$K,\"=\"&$B24,Breakdowns!$AA:$AA,\"=No\"),SUMIFS(Breakdowns!U:U,Breakdowns!$J:$J,\"=\"&$A24,Breakdowns!$K:$K,\"=\"&$B24))","v":334091089},{"$f":"IF($P$1,SUMIFS(Breakdowns!W:W,Breakdowns!$J:$J,\"=\"&$A24,Breakdowns!$K:$K,\"=\"&$B24,Breakdowns!$AA:$AA,\"=No\"),SUMIFS(Breakdowns!W:W,Breakdowns!$J:$J,\"=\"&$A24,Breakdowns!$K:$K,\"=\"&$B24))","v":0},{"$f":"IF($P$1,SUMIFS(Breakdowns!Y:Y,Breakdowns!$J:$J,\"=\"&$A24,Breakdowns!$K:$K,\"=\"&$B24,Breakdowns!$AA:$AA,\"=No\"),SUMIFS(Breakdowns!Y:Y,Breakdowns!$J:$J,\"=\"&$A24,Breakdowns!$K:$K,\"=\"&$B24))","v":0}]
["RB","DO","Bus Rapid Transit - Directly Operated",null,null,{"$f":"IF($P$1,SUMIFS(Breakdowns!L:L,Breakdowns!$J:$J,\"=\"&$A25,Breakdowns!$K:$K,\"=\"&$B25,Breakdowns!$AA:$AA,\"=No\"),SUMIFS(Breakdowns!L:L,Breakdowns!$J:$J,\"=\"&$A25,Breakdowns!$K:$K,\"=\"&$B25))","v":277},{"$f":"IF($P$1,SUMIFS(Breakdowns!M:M,Breakdowns!$J:$J,\"=\"&$A25,Breakdowns!$K:$K,\"=\"&$B25,Breakdowns!$AA:$AA,\"=No\"),SUMIFS(Breakdowns!M:M,Breakdowns!$J:$J,\"=\"&$A25,Breakdowns!$K:$K,\"=\"&$B25))","v":772},{"$f":"IF($P$1,SUMIFS(Breakdowns!O:O,Breakdowns!$J:$J,\"=\"&$A25,Breakdowns!$K:$K,\"=\"&$B25,Breakdowns!$AA:$AA,\"=No\"),SUMIFS(Breakdowns!O:O,Breakdowns!$J:$J,\"=\"&$A25,Breakdowns!$K:$K,\"=\"&$B25))","v":1219},{"$f":"IF($P$1,SUMIFS(Breakdowns!Q:Q,Breakdowns!$J:$J,\"=\"&$A25,Breakdowns!$K:$K,\"=\"&$B25,Breakdowns!$AA:$AA,\"=No\"),SUMIFS(Breakdowns!Q:Q,Breakdowns!$J:$J,\"=\"&$A25,Breakdowns!$K:$K,\"=\"&$B25))","v":1991},{"$f":"IF($P$1,SUMIFS(Breakdowns!S:S,Breakdowns!$J:$J,\"=\"&$A25,Breakdowns!$K:$K,\"=\"&$B25,Breakdowns!$AA:$AA,\"=No\"),SUMIFS(Breakdowns!S:S,Breakdowns!$J:$J,\"=\"&$A25,Breakdowns!$K:$K,\"=\"&$B25))","v":9749638},{"$f":"IF($P$1,SUMIFS(Breakdowns!U:U,Breakdowns!$J:$J,\"=\"&$A25,Breakdowns!$K:$K,\"=\"&$B25,Breakdowns!$AA:$AA,\"=No\"),SUMIFS(Breakdowns!U:U,Breakdowns!$J:$J,\"=\"&$A25,Breakdowns!$K:$K,\"=\"&$B25))","v":9233423},{"$f":"IF($P$1,SUMIFS(Breakdowns!W:W,Breakdowns!$J:$J,\"=\"&$A25,Breakdowns!$K:$K,\"=\"&$B25,Breakdowns!$AA:$AA,\"=No\"),SUMIFS(Breakdowns!W:W,Breakdowns!$J:$J,\"=\"&$A25,Breakdowns!$K:$K,\"=\"&$B25))","v":0},{"$f":"IF($P$1,SUMIFS(Breakdowns!Y:Y,Breakdowns!$J:$J,\"=\"&$A25,Breakdowns!$K:$K,\"=\"&$B25,Breakdowns!$AA:$AA,\"=No\"),SUMIFS(Breakdowns!Y:Y,Breakdowns!$J:$J,\"=\"&$A25,Breakdowns!$K:$K,\"=\"&$B25))","v":0}]
["RB","PT","Bus Rapid Transit - Purchased Transportation",null,null,{"$f":"IF($P$1,SUMIFS(Breakdowns!L:L,Breakdowns!$J:$J,\"=\"&$A26,Breakdowns!$K:$K,\"=\"&$B26,Breakdowns!$AA:$AA,\"=No\"),SUMIFS(Breakdowns!L:L,Breakdowns!$J:$J,\"=\"&$A26,Breakdowns!$K:$K,\"=\"&$B26))","v":23},{"$f":"IF($P$1,SUMIFS(Breakdowns!M:M,Breakdowns!$J:$J,\"=\"&$A26,Breakdowns!$K:$K,\"=\"&$B26,Breakdowns!$AA:$AA,\"=No\"),SUMIFS(Breakdowns!M:M,Breakdowns!$J:$J,\"=\"&$A26,Breakdowns!$K:$K,\"=\"&$B26))","v":53},{"$f":"IF($P$1,SUMIFS(Breakdowns!O:O,Breakdowns!$J:$J,\"=\"&$A26,Breakdowns!$K:$K,\"=\"&$B26,Breakdowns!$AA:$AA,\"=No\"),SUMIFS(Breakdowns!O:O,Breakdowns!$J:$J,\"=\"&$A26,Breakdowns!$K:$K,\"=\"&$B26))","v":28},{"$f":"IF($P$1,SUMIFS(Breakdowns!Q:Q,Breakdowns!$J:$J,\"=\"&$A26,Breakdowns!$K:$K,\"=\"&$B26,Breakdowns!$AA:$AA,\"=No\"),SUMIFS(Breakdowns!Q:Q,Breakdowns!$J:$J,\"=\"&$A26,Breakdowns!$K:$K,\"=\"&$B26))","v":81},{"$f":"IF($P$1,SUMIFS(Breakdowns!S:S,Breakdowns!$J:$J,\"=\"&$A26,Breakdowns!$K:$K,\"=\"&$B26,Breakdowns!$AA:$AA,\"=No\"),SUMIFS(Breakdowns!S:S,Breakdowns!$J:$J,\"=\"&$A26,Breakdowns!$K:$K,\"=\"&$B26))","v":1325851},{"$f":"IF($P$1,SUMIFS(Breakdowns!U:U,Breakdowns!$J:$J,\"=\"&$A26,Breakdowns!$K:$K,\"=\"&$B26,Breakdowns!$AA:$AA,\"=No\"),SUMIFS(Breakdowns!U:U,Breakdowns!$J:$J,\"=\"&$A26,Breakdowns!$K:$K,\"=\"&$B26))","v":1062129},{"$f":"IF($P$1,SUMIFS(Breakdowns!W:W,Breakdowns!$J:$J,\"=\"&$A26,Breakdowns!$K:$K,\"=\"&$B26,Breakdowns!$AA:$AA,\"=No\"),SUMIFS(Breakdowns!W:W,Breakdowns!$J:$J,\"=\"&$A26,Breakdowns!$K:$K,\"=\"&$B26))","v":0},{"$f":"IF($P$1,SUMIFS(Breakdowns!Y:Y,Breakdowns!$J:$J,\"=\"&$A26,Breakdowns!$K:$K,\"=\"&$B26,Breakdowns!$AA:$AA,\"=No\"),SUMIFS(Breakdowns!Y:Y,Breakdowns!$J:$J,\"=\"&$A26,Breakdowns!$K:$K,\"=\"&$B26))","v":0}]
["CC","DO","Cable Car - Directly Operated",null,null,{"$f":"IF($P$1,SUMIFS(Breakdowns!L:L,Breakdowns!$J:$J,\"=\"&$A27,Breakdowns!$K:$K,\"=\"&$B27,Breakdowns!$AA:$AA,\"=No\"),SUMIFS(Breakdowns!L:L,Breakdowns!$J:$J,\"=\"&$A27,Breakdowns!$K:$K,\"=\"&$B27))","v":27},{"$f":"IF($P$1,SUMIFS(Breakdowns!M:M,Breakdowns!$J:$J,\"=\"&$A27,Breakdowns!$K:$K,\"=\"&$B27,Breakdowns!$AA:$AA,\"=No\"),SUMIFS(Breakdowns!M:M,Breakdowns!$J:$J,\"=\"&$A27,Breakdowns!$K:$K,\"=\"&$B27))","v":57},{"$f":"IF($P$1,SUMIFS(Breakdowns!O:O,Breakdowns!$J:$J,\"=\"&$A27,Breakdowns!$K:$K,\"=\"&$B27,Breakdowns!$AA:$AA,\"=No\"),SUMIFS(Breakdowns!O:O,Breakdowns!$J:$J,\"=\"&$A27,Breakdowns!$K:$K,\"=\"&$B27))","v":1977},{"$f":"IF($P$1,SUMIFS(Breakdowns!Q:Q,Breakdowns!$J:$J,\"=\"&$A27,Breakdowns!$K:$K,\"=\"&$B27,Breakdowns!$AA:$AA,\"=No\"),SUMIFS(Breakdowns!Q:Q,Breakdowns!$J:$J,\"=\"&$A27,Breakdowns!$K:$K,\"=\"&$B27))","v":2034},{"$f":"IF($P$1,SUMIFS(Breakdowns!S:S,Breakdowns!$J:$J,\"=\"&$A27,Breakdowns!$K:$K,\"=\"&$B27,Breakdowns!$AA:$AA,\"=No\"),SUMIFS(Breakdowns!S:S,Breakdowns!$J:$J,\"=\"&$A27,Breakdowns!$K:$K,\"=\"&$B27))","v":264929},{"$f":"IF($P$1,SUMIFS(Breakdowns!U:U,Breakdowns!$J:$J,\"=\"&$A27,Breakdowns!$K:$K,\"=\"&$B27,Breakdowns!$AA:$AA,\"=No\"),SUMIFS(Breakdowns!U:U,Breakdowns!$J:$J,\"=\"&$A27,Breakdowns!$K:$K,\"=\"&$B27))","v":258452},{"$f":"IF($P$1,SUMIFS(Breakdowns!W:W,Breakdowns!$J:$J,\"=\"&$A27,Breakdowns!$K:$K,\"=\"&$B27,Breakdowns!$AA:$AA,\"=No\"),SUMIFS(Breakdowns!W:W,Breakdowns!$J:$J,\"=\"&$A27,Breakdowns!$K:$K,\"=\"&$B27))","v":264929},{"$f":"IF($P$1,SUMIFS(Breakdowns!Y:Y,Breakdowns!$J:$J,\"=\"&$A27,Breakdowns!$K:$K,\"=\"&$B27,Breakdowns!$AA:$AA,\"=No\"),SUMIFS(Breakdowns!Y:Y,Breakdowns!$J:$J,\"=\"&$A27,Breakdowns!$K:$K,\"=\"&$B27))","v":258452}]
["CB","DO","Commuter Bus - Directly Operated",null,null,{"$f":"IF($P$1,SUMIFS(Breakdowns!L:L,Breakdowns!$J:$J,\"=\"&$A28,Breakdowns!$K:$K,\"=\"&$B28,Breakdowns!$AA:$AA,\"=No\"),SUMIFS(Breakdowns!L:L,Breakdowns!$J:$J,\"=\"&$A28,Breakdowns!$K:$K,\"=\"&$B28))","v":2344},{"$f":"IF($P$1,SUMIFS(Breakdowns!M:M,Breakdowns!$J:$J,\"=\"&$A28,Breakdowns!$K:$K,\"=\"&$B28,Breakdowns!$AA:$AA,\"=No\"),SUMIFS(Breakdowns!M:M,Breakdowns!$J:$J,\"=\"&$A28,Breakdowns!$K:$K,\"=\"&$B28))","v":3588},{"$f":"IF($P$1,SUMIFS(Breakdowns!O:O,Breakdowns!$J:$J,\"=\"&$A28,Breakdowns!$K:$K,\"=\"&$B28,Breakdowns!$AA:$AA,\"=No\"),SUMIFS(Breakdowns!O:O,Breakdowns!$J:$J,\"=\"&$A28,Breakdowns!$K:$K,\"=\"&$B28))","v":3513},{"$f":"IF($P$1,SUMIFS(Breakdowns!Q:Q,Breakdowns!$J:$J,\"=\"&$A28,Breakdowns!$K:$K,\"=\"&$B28,Breakdowns!$AA:$AA,\"=No\"),SUMIFS(Breakdowns!Q:Q,Breakdowns!$J:$J,\"=\"&$A28,Breakdowns!$K:$K,\"=\"&$B28))","v":7101},{"$f":"IF($P$1,SUMIFS(Breakdowns!S:S,Breakdowns!$J:$J,\"=\"&$A28,Breakdowns!$K:$K,\"=\"&$B28,Breakdowns!$AA:$AA,\"=No\"),SUMIFS(Breakdowns!S:S,Breakdowns!$J:$J,\"=\"&$A28,Breakdowns!$K:$K,\"=\"&$B28))","v":106157768},{"$f":"IF($P$1,SUMIFS(Breakdowns!U:U,Breakdowns!$J:$J,\"=\"&$A28,Breakdowns!$K:$K,\"=\"&$B28,Breakdowns!$AA:$AA,\"=No\"),SUMIFS(Breakdowns!U:U,Breakdowns!$J:$J,\"=\"&$A28,Breakdowns!$K:$K,\"=\"&$B28))","v":82407579},{"$f":"IF($P$1,SUMIFS(Breakdowns!W:W,Breakdowns!$J:$J,\"=\"&$A28,Breakdowns!$K:$K,\"=\"&$B28,Breakdowns!$AA:$AA,\"=No\"),SUMIFS(Breakdowns!W:W,Breakdowns!$J:$J,\"=\"&$A28,Breakdowns!$K:$K,\"=\"&$B28))","v":0},{"$f":"IF($P$1,SUMIFS(Breakdowns!Y:Y,Breakdowns!$J:$J,\"=\"&$A28,Breakdowns!$K:$K,\"=\"&$B28,Breakdowns!$AA:$AA,\"=No\"),SUMIFS(Breakdowns!Y:Y,Breakdowns!$J:$J,\"=\"&$A28,Breakdowns!$K:$K,\"=\"&$B28))","v":0}]
["CB","PT","Commuter Bus - Purchased Transportation",null,null,{"$f":"IF($P$1,SUMIFS(Breakdowns!L:L,Breakdowns!$J:$J,\"=\"&$A29,Breakdowns!$K:$K,\"=\"&$B29,Breakdowns!$AA:$AA,\"=No\"),SUMIFS(Breakdowns!L:L,Breakdowns!$J:$J,\"=\"&$A29,Breakdowns!$K:$K,\"=\"&$B29))","v":1382},{"$f":"IF($P$1,SUMIFS(Breakdowns!M:M,Breakdowns!$J:$J,\"=\"&$A29,Breakdowns!$K:$K,\"=\"&$B29,Breakdowns!$AA:$AA,\"=No\"),SUMIFS(Breakdowns!M:M,Breakdowns!$J:$J,\"=\"&$A29,Breakdowns!$K:$K,\"=\"&$B29))","v":2431},{"$f":"IF($P$1,SUMIFS(Breakdowns!O:O,Breakdowns!$J:$J,\"=\"&$A29,Breakdowns!$K:$K,\"=\"&$B29,Breakdowns!$AA:$AA,\"=No\"),SUMIFS(Breakdowns!O:O,Breakdowns!$J:$J,\"=\"&$A29,Breakdowns!$K:$K,\"=\"&$B29))","v":2092},{"$f":"IF($P$1,SUMIFS(Breakdowns!Q:Q,Breakdowns!$J:$J,\"=\"&$A29,Breakdowns!$K:$K,\"=\"&$B29,Breakdowns!$AA:$AA,\"=No\"),SUMIFS(Breakdowns!Q:Q,Breakdowns!$J:$J,\"=\"&$A29,Breakdowns!$K:$K,\"=\"&$B29))","v":4523},{"$f":"IF($P$1,SUMIFS(Breakdowns!S:S,Breakdowns!$J:$J,\"=\"&$A29,Breakdowns!$K:$K,\"=\"&$B29,Breakdowns!$AA:$AA,\"=No\"),SUMIFS(Breakdowns!S:S,Breakdowns!$J:$J,\"=\"&$A29,Breakdowns!$K:$K,\"=\"&$B29))","v":57656119},{"$f":"IF($P$1,SUMIFS(Breakdowns!U:U,Breakdowns!$J:$J,\"=\"&$A29,Breakdowns!$K:$K,\"=\"&$B29,Breakdowns!$AA:$AA,\"=No\"),SUMIFS(Breakdowns!U:U,Breakdowns!$J:$J,\"=\"&$A29,Breakdowns!$K:$K,\"=\"&$B29))","v":40646172},{"$f":"IF($P$1,SUMIFS(Breakdowns!W:W,Breakdowns!$J:$J,\"=\"&$A29,Breakdowns!$K:$K,\"=\"&$B29,Breakdowns!$AA:$AA,\"=No\"),SUMIFS(Breakdowns!W:W,Breakdowns!$J:$J,\"=\"&$A29,Breakdowns!$K:$K,\"=\"&$B29))","v":0},{"$f":"IF($P$1,SUMIFS(Breakdowns!Y:Y,Breakdowns!$J:$J,\"=\"&$A29,Breakdowns!$K:$K,\"=\"&$B29,Breakdowns!$AA:$AA,\"=No\"),SUMIFS(Breakdowns!Y:Y,Breakdowns!$J:$J,\"=\"&$A29,Breakdowns!$K:$K,\"=\"&$B29))","v":0}]
["CR","DO","Commuter Rail - Directly Operated",null,null,{"$f":"IF($P$1,SUMIFS(Breakdowns!L:L,Breakdowns!$J:$J,\"=\"&$A30,Breakdowns!$K:$K,\"=\"&$B30,Breakdowns!$AA:$AA,\"=No\"),SUMIFS(Breakdowns!L:L,Breakdowns!$J:$J,\"=\"&$A30,Breakdowns!$K:$K,\"=\"&$B30))","v":4966},{"$f":"IF($P$1,SUMIFS(Breakdowns!M:M,Breakdowns!$J:$J,\"=\"&$A30,Breakdowns!$K:$K,\"=\"&$B30,Breakdowns!$AA:$AA,\"=No\"),SUMIFS(Breakdowns!M:M,Breakdowns!$J:$J,\"=\"&$A30,Breakdowns!$K:$K,\"=\"&$B30))","v":602},{"$f":"IF($P$1,SUMIFS(Breakdowns!O:O,Breakdowns!$J:$J,\"=\"&$A30,Breakdowns!$K:$K,\"=\"&$B30,Breakdowns!$AA:$AA,\"=No\"),SUMIFS(Breakdowns!O:O,Breakdowns!$J:$J,\"=\"&$A30,Breakdowns!$K:$K,\"=\"&$B30))","v":147},{"$f":"IF($P$1,SUMIFS(Breakdowns!Q:Q,Breakdowns!$J:$J,\"=\"&$A30,Breakdowns!$K:$K,\"=\"&$B30,Breakdowns!$AA:$AA,\"=No\"),SUMIFS(Breakdowns!Q:Q,Breakdowns!$J:$J,\"=\"&$A30,Breakdowns!$K:$K,\"=\"&$B30))","v":749},{"$f":"IF($P$1,SUMIFS(Breakdowns!S:S,Breakdowns!$J:$J,\"=\"&$A30,Breakdowns!$K:$K,\"=\"&$B30,Breakdowns!$AA:$AA,\"=No\"),SUMIFS(Breakdowns!S:S,Breakdowns!$J:$J,\"=\"&$A30,Breakdowns!$K:$K,\"=\"&$B30))","v":294588316},{"$f":"IF($P$1,SUMIFS(Breakdowns!U:U,Breakdowns!$J:$J,\"=\"&$A30,Breakdowns!$K:$K,\"=\"&$B30,Breakdowns!$AA:$AA,\"=No\"),SUMIFS(Breakdowns!U:U,Breakdowns!$J:$J,\"=\"&$A30,Breakdowns!$K:$K,\"=\"&$B30))","v":270227376},{"$f":"IF($P$1,SUMIFS(Breakdowns!W:W,Breakdowns!$J:$J,\"=\"&$A30,Breakdowns!$K:$K,\"=\"&$B30,Breakdowns!$AA:$AA,\"=No\"),SUMIFS(Breakdowns!W:W,Breakdowns!$J:$J,\"=\"&$A30,Breakdowns!$K:$K,\"=\"&$B30))","v":43622294},{"$f":"IF($P$1,SUMIFS(Breakdowns!Y:Y,Breakdowns!$J:$J,\"=\"&$A30,Breakdowns!$K:$K,\"=\"&$B30,Breakdowns!$AA:$AA,\"=No\"),SUMIFS(Breakdowns!Y:Y,Breakdowns!$J:$J,\"=\"&$A30,Breakdowns!$K:$K,\"=\"&$B30))","v":40287448}]
["CR","PT","Commuter Rail - Purchased Transportation",null,null,{"$f":"IF($P$1,SUMIFS(Breakdowns!L:L,Breakdowns!$J:$J,\"=\"&$A31,Breakdowns!$K:$K,\"=\"&$B31,Breakdowns!$AA:$AA,\"=No\"),SUMIFS(Breakdowns!L:L,Breakdowns!$J:$J,\"=\"&$A31,Breakdowns!$K:$K,\"=\"&$B31))","v":1318},{"$f":"IF($P$1,SUMIFS(Breakdowns!M:M,Breakdowns!$J:$J,\"=\"&$A31,Breakdowns!$K:$K,\"=\"&$B31,Breakdowns!$AA:$AA,\"=No\"),SUMIFS(Breakdowns!M:M,Breakdowns!$J:$J,\"=\"&$A31,Breakdowns!$K:$K,\"=\"&$B31))","v":810},{"$f":"IF($P$1,SUMIFS(Breakdowns!O:O,Breakdowns!$J:$J,\"=\"&$A31,Breakdowns!$K:$K,\"=\"&$B31,Breakdowns!$AA:$AA,\"=No\"),SUMIFS(Breakdowns!O:O,Breakdowns!$J:$J,\"=\"&$A31,Breakdowns!$K:$K,\"=\"&$B31))","v":113},{"$f":"IF($P$1,SUMIFS(Breakdowns!Q:Q,Breakdowns!$J:$J,\"=\"&$A31,Breakdowns!$K:$K,\"=\"&$B31,Breakdowns!$AA:$AA,\"=No\"),SUMIFS(Breakdowns!Q:Q,Breakdowns!$J:$J,\"=\"&$A31,Breakdowns!$K:$K,\"=\"&$B31))","v":923},{"$f":"IF($P$1,SUMIFS(Breakdowns!S:S,Breakdowns!$J:$J,\"=\"&$A31,Breakdowns!$K:$K,\"=\"&$B31,Breakdowns!$AA:$AA,\"=No\"),SUMIFS(Breakdowns!S:S,Breakdowns!$J:$J,\"=\"&$A31,Breakdowns!$K:$K,\"=\"&$B31))","v":77088934},{"$f":"IF($P$1,SUMIFS(Breakdowns!U:U,Breakdowns!$J:$J,\"=\"&$A31,Breakdowns!$K:$K,\"=\"&$B31,Breakdowns!$AA:$AA,\"=No\"),SUMIFS(Breakdowns!U:U,Breakdowns!$J:$J,\"=\"&$A31,Breakdowns!$K:$K,\"=\"&$B31))","v":74161544},{"$f":"IF($P$1,SUMIFS(Breakdowns!W:W,Breakdowns!$J:$J,\"=\"&$A31,Breakdowns!$K:$K,\"=\"&$B31,Breakdowns!$AA:$AA,\"=No\"),SUMIFS(Breakdowns!W:W,Breakdowns!$J:$J,\"=\"&$A31,Breakdowns!$K:$K,\"=\"&$B31))","v":16673701},{"$f":"IF($P$1,SUMIFS(Breakdowns!Y:Y,Breakdowns!$J:$J,\"=\"&$A31,Breakdowns!$K:$K,\"=\"&$B31,Breakdowns!$AA:$AA,\"=No\"),SUMIFS(Breakdowns!Y:Y,Breakdowns!$J:$J,\"=\"&$A31,Breakdowns!$K:$K,\"=\"&$B31))","v":16002676}]
["DR","DO","Demand Response - Directly Operated",null,null,{"$f":"IF($P$1,SUMIFS(Breakdowns!L:L,Breakdowns!$J:$J,\"=\"&$A32,Breakdowns!$K:$K,\"=\"&$B32,Breakdowns!$AA:$AA,\"=No\"),SUMIFS(Breakdowns!L:L,Breakdowns!$J:$J,\"=\"&$A32,Breakdowns!$K:$K,\"=\"&$B32))","v":6087},{"$f":"IF($P$1,SUMIFS(Breakdowns!M:M,Breakdowns!$J:$J,\"=\"&$A32,Breakdowns!$K:$K,\"=\"&$B32,Breakdowns!$AA:$AA,\"=No\"),SUMIFS(Breakdowns!M:M,Breakdowns!$J:$J,\"=\"&$A32,Breakdowns!$K:$K,\"=\"&$B32))","v":7211},{"$f":"IF($P$1,SUMIFS(Breakdowns!O:O,Breakdowns!$J:$J,\"=\"&$A32,Breakdowns!$K:$K,\"=\"&$B32,Breakdowns!$AA:$AA,\"=No\"),SUMIFS(Breakdowns!O:O,Breakdowns!$J:$J,\"=\"&$A32,Breakdowns!$K:$K,\"=\"&$B32))","v":8000},{"$f":"IF($P$1,SUMIFS(Breakdowns!Q:Q,Breakdowns!$J:$J,\"=\"&$A32,Breakdowns!$K:$K,\"=\"&$B32,Breakdowns!$AA:$AA,\"=No\"),SUMIFS(Breakdowns!Q:Q,Breakdowns!$J:$J,\"=\"&$A32,Breakdowns!$K:$K,\"=\"&$B32))","v":15211},{"$f":"IF($P$1,SUMIFS(Breakdowns!S:S,Breakdowns!$J:$J,\"=\"&$A32,Breakdowns!$K:$K,\"=\"&$B32,Breakdowns!$AA:$AA,\"=No\"),SUMIFS(Breakdowns!S:S,Breakdowns!$J:$J,\"=\"&$A32,Breakdowns!$K:$K,\"=\"&$B32))","v":188523366},{"$f":"IF($P$1,SUMIFS(Breakdowns!U:U,Breakdowns!$J:$J,\"=\"&$A32,Breakdowns!$K:$K,\"=\"&$B32,Breakdowns!$AA:$AA,\"=No\"),SUMIFS(Breakdowns!U:U,Breakdowns!$J:$J,\"=\"&$A32,Breakdowns!$K:$K,\"=\"&$B32))","v":160923133},{"$f":"IF($P$1,SUMIFS(Breakdowns!W:W,Breakdowns!$J:$J,\"=\"&$A32,Breakdowns!$K:$K,\"=\"&$B32,Breakdowns!$AA:$AA,\"=No\"),SUMIFS(Breakdowns!W:W,Breakdowns!$J:$J,\"=\"&$A32,Breakdowns!$K:$K,\"=\"&$B32))","v":0},{"$f":"IF($P$1,SUMIFS(Breakdowns!Y:Y,Breakdowns!$J:$J,\"=\"&$A32,Breakdowns!$K:$K,\"=\"&$B32,Breakdowns!$AA:$AA,\"=No\"),SUMIFS(Breakdowns!Y:Y,Breakdowns!$J:$J,\"=\"&$A32,Breakdowns!$K:$K,\"=\"&$B32))","v":0}]
["DR","PT","Demand Response - Purchased Transportation",null,null,{"$f":"IF($P$1,SUMIFS(Breakdowns!L:L,Breakdowns!$J:$J,\"=\"&$A33,Breakdowns!$K:$K,\"=\"&$B33,Breakdowns!$AA:$AA,\"=No\"),SUMIFS(Breakdowns!L:L,Breakdowns!$J:$J,\"=\"&$A33,Breakdowns!$K:$K,\"=\"&$B33))","v":18195},{"$f":"IF($P$1,SUMIFS(Breakdowns!M:M,Breakdowns!$J:$J,\"=\"&$A33,Breakdowns!$K:$K,\"=\"&$B33,Breakdowns!$AA:$AA,\"=No\"),SUMIFS(Breakdowns!M:M,Breakdowns!$J:$J,\"=\"&$A33,Breakdowns!$K:$K,\"=\"&$B33))","v":15253},{"$f":"IF($P$1,SUMIFS(Breakdowns!O:O,Breakdowns!$J:$J,\"=\"&$A33,Breakdowns!$K:$K,\"=\"&$B33,Breakdowns!$AA:$AA,\"=No\"),SUMIFS(Breakdowns!O:O,Breakdowns!$J:$J,\"=\"&$A33,Breakdowns!$K:$K,\"=\"&$B33))","v":19597},{"$f":"IF($P$1,SUMIFS(Breakdowns!Q:Q,Breakdowns!$J:$J,\"=\"&$A33,Breakdowns!$K:$K,\"=\"&$B33,Breakdowns!$AA:$AA,\"=No\"),SUMIFS(Breakdowns!Q:Q,Breakdowns!$J:$J,\"=\"&$A33,Breakdowns!$K:$K,\"=\"&$B33))","v":34850},{"$f":"IF($P$1,SUMIFS(Breakdowns!S:S,Breakdowns!$J:$J,\"=\"&$A33,Breakdowns!$K:$K,\"=\"&$B33,Breakdowns!$AA:$AA,\"=No\"),SUMIFS(Breakdowns!S:S,Breakdowns!$J:$J,\"=\"&$A33,Breakdowns!$K:$K,\"=\"&$B33))","v":649721443},{"$f":"IF($P$1,SUMIFS(Breakdowns!U:U,Breakdowns!$J:$J,\"=\"&$A33,Breakdowns!$K:$K,\"=\"&$B33,Breakdowns!$AA:$AA,\"=No\"),SUMIFS(Breakdowns!U:U,Breakdowns!$J:$J,\"=\"&$A33,Breakdowns!$K:$K,\"=\"&$B33))","v":549544567},{"$f":"IF($P$1,SUMIFS(Breakdowns!W:W,Breakdowns!$J:$J,\"=\"&$A33,Breakdowns!$K:$K,\"=\"&$B33,Breakdowns!$AA:$AA,\"=No\"),SUMIFS(Breakdowns!W:W,Breakdowns!$J:$J,\"=\"&$A33,Breakdowns!$K:$K,\"=\"&$B33))","v":0},{"$f":"IF($P$1,SUMIFS(Breakdowns!Y:Y,Breakdowns!$J:$J,\"=\"&$A33,Breakdowns!$K:$K,\"=\"&$B33,Breakdowns!$AA:$AA,\"=No\"),SUMIFS(Breakdowns!Y:Y,Breakdowns!$J:$J,\"=\"&$A33,Breakdowns!$K:$K,\"=\"&$B33))","v":0}]
["FB","DO","Ferryboat - Directly Operated",null,null,{"$f":"IF($P$1,SUMIFS(Breakdowns!L:L,Breakdowns!$J:$J,\"=\"&$A34,Breakdowns!$K:$K,\"=\"&$B34,Breakdowns!$AA:$AA,\"=No\"),SUMIFS(Breakdowns!L:L,Breakdowns!$J:$J,\"=\"&$A34,Breakdowns!$K:$K,\"=\"&$B34))","v":77},{"$f":"IF($P$1,SUMIFS(Breakdowns!M:M,Breakdowns!$J:$J,\"=\"&$A34,Breakdowns!$K:$K,\"=\"&$B34,Breakdowns!$AA:$AA,\"=No\"),SUMIFS(Breakdowns!M:M,Breakdowns!$J:$J,\"=\"&$A34,Breakdowns!$K:$K,\"=\"&$B34))","v":104},{"$f":"IF($P$1,SUMIFS(Breakdowns!O:O,Breakdowns!$J:$J,\"=\"&$A34,Breakdowns!$K:$K,\"=\"&$B34,Breakdowns!$AA:$AA,\"=No\"),SUMIFS(Breakdowns!O:O,Breakdowns!$J:$J,\"=\"&$A34,Breakdowns!$K:$K,\"=\"&$B34))","v":53},{"$f":"IF($P$1,SUMIFS(Breakdowns!Q:Q,Breakdowns!$J:$J,\"=\"&$A34,Breakdowns!$K:$K,\"=\"&$B34,Breakdowns!$AA:$AA,\"=No\"),SUMIFS(Breakdowns!Q:Q,Breakdowns!$J:$J,\"=\"&$A34,Breakdowns!$K:$K,\"=\"&$B34))","v":157},{"$f":"IF($P$1,SUMIFS(Breakdowns!S:S,Breakdowns!$J:$J,\"=\"&$A34,Breakdowns!$K:$K,\"=\"&$B34,Breakdowns!$AA:$AA,\"=No\"),SUMIFS(Breakdowns!S:S,Breakdowns!$J:$J,\"=\"&$A34,Breakdowns!$K:$K,\"=\"&$B34))","v":2709252},{"$f":"IF($P$1,SUMIFS(Breakdowns!U:U,Breakdowns!$J:$J,\"=\"&$A34,Breakdowns!$K:$K,\"=\"&$B34,Breakdowns!$AA:$AA,\"=No\"),SUMIFS(Breakdowns!U:U,Breakdowns!$J:$J,\"=\"&$A34,Breakdowns!$K:$K,\"=\"&$B34))","v":2663268},{"$f":"IF($P$1,SUMIFS(Breakdowns!W:W,Breakdowns!$J:$J,\"=\"&$A34,Breakdowns!$K:$K,\"=\"&$B34,Breakdowns!$AA:$AA,\"=No\"),SUMIFS(Breakdowns!W:W,Breakdowns!$J:$J,\"=\"&$A34,Breakdowns!$K:$K,\"=\"&$B34))","v":0},{"$f":"IF($P$1,SUMIFS(Breakdowns!Y:Y,Breakdowns!$J:$J,\"=\"&$A34,Breakdowns!$K:$K,\"=\"&$B34,Breakdowns!$AA:$AA,\"=No\"),SUMIFS(Breakdowns!Y:Y,Breakdowns!$J:$J,\"=\"&$A34,Breakdowns!$K:$K,\"=\"&$B34))","v":0}]
["FB","PT","Ferryboat - Purchased Transportation",null,null,{"$f":"IF($P$1,SUMIFS(Breakdowns!L:L,Breakdowns!$J:$J,\"=\"&$A35,Breakdowns!$K:$K,\"=\"&$B35,Breakdowns!$AA:$AA,\"=No\"),SUMIFS(Breakdowns!L:L,Breakdowns!$J:$J,\"=\"&$A35,Breakdowns!$K:$K,\"=\"&$B35))","v":48},{"$f":"IF($P$1,SUMIFS(Breakdowns!M:M,Breakdowns!$J:$J,\"=\"&$A35,Breakdowns!$K:$K,\"=\"&$B35,Breakdowns!$AA:$AA,\"=No\"),SUMIFS(Breakdowns!M:M,Breakdowns!$J:$J,\"=\"&$A35,Breakdowns!$K:$K,\"=\"&$B35))","v":62},{"$f":"IF($P$1,SUMIFS(Breakdowns!O:O,Breakdowns!$J:$J,\"=\"&$A35,Breakdowns!$K:$K,\"=\"&$B35,Breakdowns!$AA:$AA,\"=No\"),SUMIFS(Breakdowns!O:O,Breakdowns!$J:$J,\"=\"&$A35,Breakdowns!$K:$K,\"=\"&$B35))","v":60},{"$f":"IF($P$1,SUMIFS(Breakdowns!Q:Q,Breakdowns!$J:$J,\"=\"&$A35,Breakdowns!$K:$K,\"=\"&$B35,Breakdowns!$AA:$AA,\"=No\"),SUMIFS(Breakdowns!Q:Q,Breakdowns!$J:$J,\"=\"&$A35,Breakdowns!$K:$K,\"=\"&$B35))","v":122},{"$f":"IF($P$1,SUMIFS(Breakdowns!S:S,Breakdowns!$J:$J,\"=\"&$A35,Breakdowns!$K:$K,\"=\"&$B35,Breakdowns!$AA:$AA,\"=No\"),SUMIFS(Breakdowns!S:S,Breakdowns!$J:$J,\"=\"&$A35,Breakdowns!$K:$K,\"=\"&$B35))","v":1065985},{"$f":"IF($P$1,SUMIFS(Breakdowns!U:U,Breakdowns!$J:$J,\"=\"&$A35,Breakdowns!$K:$K,\"=\"&$B35,Breakdowns!$AA:$AA,\"=No\"),SUMIFS(Breakdowns!U:U,Breakdowns!$J:$J,\"=\"&$A35,Breakdowns!$K:$K,\"=\"&$B35))","v":1004330},{"$f":"IF($P$1,SUMIFS(Breakdowns!W:W,Breakdowns!$J:$J,\"=\"&$A35,Breakdowns!$K:$K,\"=\"&$B35,Breakdowns!$AA:$AA,\"=No\"),SUMIFS(Breakdowns!W:W,Breakdowns!$J:$J,\"=\"&$A35,Breakdowns!$K:$K,\"=\"&$B35))","v":0},{"$f":"IF($P$1,SUMIFS(Breakdowns!Y:Y,Breakdowns!$J:$J,\"=\"&$A35,Breakdowns!$K:$K,\"=\"&$B35,Breakdowns!$AA:$AA,\"=No\"),SUMIFS(Breakdowns!Y:Y,Breakdowns!$J:$J,\"=\"&$A35,Breakdowns!$K:$K,\"=\"&$B35))","v":0}]
["HR","DO","Heavy Rail - Directly Operated",null,null,{"$f":"IF($P$1,SUMIFS(Breakdowns!L:L,Breakdowns!$J:$J,\"=\"&$A36,Breakdowns!$K:$K,\"=\"&$B36,Breakdowns!$AA:$AA,\"=No\"),SUMIFS(Breakdowns!L:L,Breakdowns!$J:$J,\"=\"&$A36,Breakdowns!$K:$K,\"=\"&$B36))","v":9435},{"$f":"IF($P$1,SUMIFS(Breakdowns!M:M,Breakdowns!$J:$J,\"=\"&$A36,Breakdowns!$K:$K,\"=\"&$B36,Breakdowns!$AA:$AA,\"=No\"),SUMIFS(Breakdowns!M:M,Breakdowns!$J:$J,\"=\"&$A36,Breakdowns!$K:$K,\"=\"&$B36))","v":7607},{"$f":"IF($P$1,SUMIFS(Breakdowns!O:O,Breakdowns!$J:$J,\"=\"&$A36,Breakdowns!$K:$K,\"=\"&$B36,Breakdowns!$AA:$AA,\"=No\"),SUMIFS(Breakdowns!O:O,Breakdowns!$J:$J,\"=\"&$A36,Breakdowns!$K:$K,\"=\"&$B36))","v":29876},{"$f":"IF($P$1,SUMIFS(Breakdowns!Q:Q,Breakdowns!$J:$J,\"=\"&$A36,Breakdowns!$K:$K,\"=\"&$B36,Breakdowns!$AA:$AA,\"=No\"),SUMIFS(Breakdowns!Q:Q,Breakdowns!$J:$J,\"=\"&$A36,Breakdowns!$K:$K,\"=\"&$B36))","v":37483},{"$f":"IF($P$1,SUMIFS(Breakdowns!S:S,Breakdowns!$J:$J,\"=\"&$A36,Breakdowns!$K:$K,\"=\"&$B36,Breakdowns!$AA:$AA,\"=No\"),SUMIFS(Breakdowns!S:S,Breakdowns!$J:$J,\"=\"&$A36,Breakdowns!$K:$K,\"=\"&$B36))","v":694336504},{"$f":"IF($P$1,SUMIFS(Breakdowns!U:U,Breakdowns!$J:$J,\"=\"&$A36,Breakdowns!$K:$K,\"=\"&$B36,Breakdowns!$AA:$AA,\"=No\"),SUMIFS(Breakdowns!U:U,Breakdowns!$J:$J,\"=\"&$A36,Breakdowns!$K:$K,\"=\"&$B36))","v":673977895},{"$f":"IF($P$1,SUMIFS(Breakdowns!W:W,Breakdowns!$J:$J,\"=\"&$A36,Breakdowns!$K:$K,\"=\"&$B36,Breakdowns!$AA:$AA,\"=No\"),SUMIFS(Breakdowns!W:W,Breakdowns!$J:$J,\"=\"&$A36,Breakdowns!$K:$K,\"=\"&$B36))","v":94628386},{"$f":"IF($P$1,SUMIFS(Breakdowns!Y:Y,Breakdowns!$J:$J,\"=\"&$A36,Breakdowns!$K:$K,\"=\"&$B36,Breakdowns!$AA:$AA,\"=No\"),SUMIFS(Breakdowns!Y:Y,Breakdowns!$J:$J,\"=\"&$A36,Breakdowns!$K:$K,\"=\"&$B36))","v":91974392}]
["HR","PT","Heavy Rail - Purchased Transportation",null,null,{"$f":"IF($P$1,SUMIFS(Breakdowns!L:L,Breakdowns!$J:$J,\"=\"&$A37,Breakdowns!$K:$K,\"=\"&$B37,Breakdowns!$AA:$AA,\"=No\"),SUMIFS(Breakdowns!L:L,Breakdowns!$J:$J,\"=\"&$A37,Breakdowns!$K:$K,\"=\"&$B37))","v":32},{"$f":"IF($P$1,SUMIFS(Breakdowns!M:M,Breakdowns!$J:$J,\"=\"&$A37,Breakdowns!$K:$K,\"=\"&$B37,Breakdowns!$AA:$AA,\"=No\"),SUMIFS(Breakdowns!M:M,Breakdowns!$J:$J,\"=\"&$A37,Breakdowns!$K:$K,\"=\"&$B37))","v":42},{"$f":"IF($P$1,SUMIFS(Breakdowns!O:O,Breakdowns!$J:$J,\"=\"&$A37,Breakdowns!$K:$K,\"=\"&$B37,Breakdowns!$AA:$AA,\"=No\"),SUMIFS(Breakdowns!O:O,Breakdowns!$J:$J,\"=\"&$A37,Breakdowns!$K:$K,\"=\"&$B37))","v":491},{"$f":"IF($P$1,SUMIFS(Breakdowns!Q:Q,Breakdowns!$J:$J,\"=\"&$A37,Breakdowns!$K:$K,\"=\"&$B37,Breakdowns!$AA:$AA,\"=No\"),SUMIFS(Breakdowns!Q:Q,Breakdowns!$J:$J,\"=\"&$A37,Breakdowns!$K:$K,\"=\"&$B37))","v":533},{"$f":"IF($P$1,SUMIFS(Breakdowns!S:S,Breakdowns!$J:$J,\"=\"&$A37,Breakdowns!$K:$K,\"=\"&$B37,Breakdowns!$AA:$AA,\"=No\"),SUMIFS(Breakdowns!S:S,Breakdowns!$J:$J,\"=\"&$A37,Breakdowns!$K:$K,\"=\"&$B37))","v":2033342},{"$f":"IF($P$1,SUMIFS(Breakdowns!U:U,Breakdowns!$J:$J,\"=\"&$A37,Breakdowns!$K:$K,\"=\"&$B37,Breakdowns!$AA:$AA,\"=No\"),SUMIFS(Breakdowns!U:U,Breakdowns!$J:$J,\"=\"&$A37,Breakdowns!$K:$K,\"=\"&$B37))","v":1910657},{"$f":"IF($P$1,SUMIFS(Breakdowns!W:W,Breakdowns!$J:$J,\"=\"&$A37,Breakdowns!$K:$K,\"=\"&$B37,Breakdowns!$AA:$AA,\"=No\"),SUMIFS(Breakdowns!W:W,Breakdowns!$J:$J,\"=\"&$A37,Breakdowns!$K:$K,\"=\"&$B37))","v":625384},{"$f":"IF($P$1,SUMIFS(Breakdowns!Y:Y,Breakdowns!$J:$J,\"=\"&$A37,Breakdowns!$K:$K,\"=\"&$B37,Breakdowns!$AA:$AA,\"=No\"),SUMIFS(Breakdowns!Y:Y,Breakdowns!$J:$J,\"=\"&$A37,Breakdowns!$K:$K,\"=\"&$B37))","v":592614}]
["YR","PT","Hybrid Rail - Purchased Transportation",null,null,{"$f":"IF($P$1,SUMIFS(Breakdowns!L:L,Breakdowns!$J:$J,\"=\"&$A38,Breakdowns!$K:$K,\"=\"&$B38,Breakdowns!$AA:$AA,\"=No\"),SUMIFS(Breakdowns!L:L,Breakdowns!$J:$J,\"=\"&$A38,Breakdowns!$K:$K,\"=\"&$B38))","v":40},{"$f":"IF($P$1,SUMIFS(Breakdowns!M:M,Breakdowns!$J:$J,\"=\"&$A38,Breakdowns!$K:$K,\"=\"&$B38,Breakdowns!$AA:$AA,\"=No\"),SUMIFS(Breakdowns!M:M,Breakdowns!$J:$J,\"=\"&$A38,Breakdowns!$K:$K,\"=\"&$B38))","v":92},{"$f":"IF($P$1,SUMIFS(Breakdowns!O:O,Breakdowns!$J:$J,\"=\"&$A38,Breakdowns!$K:$K,\"=\"&$B38,Breakdowns!$AA:$AA,\"=No\"),SUMIFS(Breakdowns!O:O,Breakdowns!$J:$J,\"=\"&$A38,Breakdowns!$K:$K,\"=\"&$B38))","v":22},{"$f":"IF($P$1,SUMIFS(Breakdowns!Q:Q,Breakdowns!$J:$J,\"=\"&$A38,Breakdowns!$K:$K,\"=\"&$B38,Breakdowns!$AA:$AA,\"=No\"),SUMIFS(Breakdowns!Q:Q,Breakdowns!$J:$J,\"=\"&$A38,Breakdowns!$K:$K,\"=\"&$B38))","v":114},{"$f":"IF($P$1,SUMIFS(Breakdowns!S:S,Breakdowns!$J:$J,\"=\"&$A38,Breakdowns!$K:$K,\"=\"&$B38,Breakdowns!$AA:$AA,\"=No\"),SUMIFS(Breakdowns!S:S,Breakdowns!$J:$J,\"=\"&$A38,Breakdowns!$K:$K,\"=\"&$B38))","v":3193599},{"$f":"IF($P$1,SUMIFS(Breakdowns!U:U,Breakdowns!$J:$J,\"=\"&$A38,Breakdowns!$K:$K,\"=\"&$B38,Breakdowns!$AA:$AA,\"=No\"),SUMIFS(Breakdowns!U:U,Breakdowns!$J:$J,\"=\"&$A38,Breakdowns!$K:$K,\"=\"&$B38))","v":3090763},{"$f":"IF($P$1,SUMIFS(Breakdowns!W:W,Breakdowns!$J:$J,\"=\"&$A38,Breakdowns!$K:$K,\"=\"&$B38,Breakdowns!$AA:$AA,\"=No\"),SUMIFS(Breakdowns!W:W,Breakdowns!$J:$J,\"=\"&$A38,Breakdowns!$K:$K,\"=\"&$B38))","v":2353654},{"$f":"IF($P$1,SUMIFS(Breakdowns!Y:Y,Breakdowns!$J:$J,\"=\"&$A38,Breakdowns!$K:$K,\"=\"&$B38,Breakdowns!$AA:$AA,\"=No\"),SUMIFS(Breakdowns!Y:Y,Breakdowns!$J:$J,\"=\"&$A38,Breakdowns!$K:$K,\"=\"&$B38))","v":2296724}]
["IP","DO","Inclined Plane - Directly Operated",null,null,{"$f":"IF($P$1,SUMIFS(Breakdowns!L:L,Breakdowns!$J:$J,\"=\"&$A39,Breakdowns!$K:$K,\"=\"&$B39,Breakdowns!$AA:$AA,\"=No\"),SUMIFS(Breakdowns!L:L,Breakdowns!$J:$J,\"=\"&$A39,Breakdowns!$K:$K,\"=\"&$B39))","v":6},{"$f":"IF($P$1,SUMIFS(Breakdowns!M:M,Breakdowns!$J:$J,\"=\"&$A39,Breakdowns!$K:$K,\"=\"&$B39,Breakdowns!$AA:$AA,\"=No\"),SUMIFS(Breakdowns!M:M,Breakdowns!$J:$J,\"=\"&$A39,Breakdowns!$K:$K,\"=\"&$B39))","v":53},{"$f":"IF($P$1,SUMIFS(Breakdowns!O:O,Breakdowns!$J:$J,\"=\"&$A39,Breakdowns!$K:$K,\"=\"&$B39,Breakdowns!$AA:$AA,\"=No\"),SUMIFS(Breakdowns!O:O,Breakdowns!$J:$J,\"=\"&$A39,Breakdowns!$K:$K,\"=\"&$B39))","v":0},{"$f":"IF($P$1,SUMIFS(Breakdowns!Q:Q,Breakdowns!$J:$J,\"=\"&$A39,Breakdowns!$K:$K,\"=\"&$B39,Breakdowns!$AA:$AA,\"=No\"),SUMIFS(Breakdowns!Q:Q,Breakdowns!$J:$J,\"=\"&$A39,Breakdowns!$K:$K,\"=\"&$B39))","v":53},{"$f":"IF($P$1,SUMIFS(Breakdowns!S:S,Breakdowns!$J:$J,\"=\"&$A39,Breakdowns!$K:$K,\"=\"&$B39,Breakdowns!$AA:$AA,\"=No\"),SUMIFS(Breakdowns!S:S,Breakdowns!$J:$J,\"=\"&$A39,Breakdowns!$K:$K,\"=\"&$B39))","v":32116},{"$f":"IF($P$1,SUMIFS(Breakdowns!U:U,Breakdowns!$J:$J,\"=\"&$A39,Breakdowns!$K:$K,\"=\"&$B39,Breakdowns!$AA:$AA,\"=No\"),SUMIFS(Breakdowns!U:U,Breakdowns!$J:$J,\"=\"&$A39,Breakdowns!$K:$K,\"=\"&$B39))","v":32116},{"$f":"IF($P$1,SUMIFS(Breakdowns!W:W,Breakdowns!$J:$J,\"=\"&$A39,Breakdowns!$K:$K,\"=\"&$B39,Breakdowns!$AA:$AA,\"=No\"),SUMIFS(Breakdowns!W:W,Breakdowns!$J:$J,\"=\"&$A39,Breakdowns!$K:$K,\"=\"&$B39))","v":32116},{"$f":"IF($P$1,SUMIFS(Breakdowns!Y:Y,Breakdowns!$J:$J,\"=\"&$A39,Breakdowns!$K:$K,\"=\"&$B39,Breakdowns!$AA:$AA,\"=No\"),SUMIFS(Breakdowns!Y:Y,Breakdowns!$J:$J,\"=\"&$A39,Breakdowns!$K:$K,\"=\"&$B39))","v":32116}]
["LR","DO","Light Rail - Directly Operated",null,null,{"$f":"IF($P$1,SUMIFS(Breakdowns!L:L,Breakdowns!$J:$J,\"=\"&$A40,Breakdowns!$K:$K,\"=\"&$B40,Breakdowns!$AA:$AA,\"=No\"),SUMIFS(Breakdowns!L:L,Breakdowns!$J:$J,\"=\"&$A40,Breakdowns!$K:$K,\"=\"&$B40))","v":1522},{"$f":"IF($P$1,SUMIFS(Breakdowns!M:M,Breakdowns!$J:$J,\"=\"&$A40,Breakdowns!$K:$K,\"=\"&$B40,Breakdowns!$AA:$AA,\"=No\"),SUMIFS(Breakdowns!M:M,Breakdowns!$J:$J,\"=\"&$A40,Breakdowns!$K:$K,\"=\"&$B40))","v":5965},{"$f":"IF($P$1,SUMIFS(Breakdowns!O:O,Breakdowns!$J:$J,\"=\"&$A40,Breakdowns!$K:$K,\"=\"&$B40,Breakdowns!$AA:$AA,\"=No\"),SUMIFS(Breakdowns!O:O,Breakdowns!$J:$J,\"=\"&$A40,Breakdowns!$K:$K,\"=\"&$B40))","v":8384},{"$f":"IF($P$1,SUMIFS(Breakdowns!Q:Q,Breakdowns!$J:$J,\"=\"&$A40,Breakdowns!$K:$K,\"=\"&$B40,Breakdowns!$AA:$AA,\"=No\"),SUMIFS(Breakdowns!Q:Q,Breakdowns!$J:$J,\"=\"&$A40,Breakdowns!$K:$K,\"=\"&$B40))","v":14349},{"$f":"IF($P$1,SUMIFS(Breakdowns!S:S,Breakdowns!$J:$J,\"=\"&$A40,Breakdowns!$K:$K,\"=\"&$B40,Breakdowns!$AA:$AA,\"=No\"),SUMIFS(Breakdowns!S:S,Breakdowns!$J:$J,\"=\"&$A40,Breakdowns!$K:$K,\"=\"&$B40))","v":108900391},{"$f":"IF($P$1,SUMIFS(Breakdowns!U:U,Breakdowns!$J:$J,\"=\"&$A40,Breakdowns!$K:$K,\"=\"&$B40,Breakdowns!$AA:$AA,\"=No\"),SUMIFS(Breakdowns!U:U,Breakdowns!$J:$J,\"=\"&$A40,Breakdowns!$K:$K,\"=\"&$B40))","v":106583745},{"$f":"IF($P$1,SUMIFS(Breakdowns!W:W,Breakdowns!$J:$J,\"=\"&$A40,Breakdowns!$K:$K,\"=\"&$B40,Breakdowns!$AA:$AA,\"=No\"),SUMIFS(Breakdowns!W:W,Breakdowns!$J:$J,\"=\"&$A40,Breakdowns!$K:$K,\"=\"&$B40))","v":52878465},{"$f":"IF($P$1,SUMIFS(Breakdowns!Y:Y,Breakdowns!$J:$J,\"=\"&$A40,Breakdowns!$K:$K,\"=\"&$B40,Breakdowns!$AA:$AA,\"=No\"),SUMIFS(Breakdowns!Y:Y,Breakdowns!$J:$J,\"=\"&$A40,Breakdowns!$K:$K,\"=\"&$B40))","v":51686023}]
["LR","PT","Light Rail - Purchased Transportation",null,null,{"$f":"IF($P$1,SUMIFS(Breakdowns!L:L,Breakdowns!$J:$J,\"=\"&$A41,Breakdowns!$K:$K,\"=\"&$B41,Breakdowns!$AA:$AA,\"=No\"),SUMIFS(Breakdowns!L:L,Breakdowns!$J:$J,\"=\"&$A41,Breakdowns!$K:$K,\"=\"&$B41))","v":80},{"$f":"IF($P$1,SUMIFS(Breakdowns!M:M,Breakdowns!$J:$J,\"=\"&$A41,Breakdowns!$K:$K,\"=\"&$B41,Breakdowns!$AA:$AA,\"=No\"),SUMIFS(Breakdowns!M:M,Breakdowns!$J:$J,\"=\"&$A41,Breakdowns!$K:$K,\"=\"&$B41))","v":119},{"$f":"IF($P$1,SUMIFS(Breakdowns!O:O,Breakdowns!$J:$J,\"=\"&$A41,Breakdowns!$K:$K,\"=\"&$B41,Breakdowns!$AA:$AA,\"=No\"),SUMIFS(Breakdowns!O:O,Breakdowns!$J:$J,\"=\"&$A41,Breakdowns!$K:$K,\"=\"&$B41))","v":158},{"$f":"IF($P$1,SUMIFS(Breakdowns!Q:Q,Breakdowns!$J:$J,\"=\"&$A41,Breakdowns!$K:$K,\"=\"&$B41,Breakdowns!$AA:$AA,\"=No\"),SUMIFS(Breakdowns!Q:Q,Breakdowns!$J:$J,\"=\"&$A41,Breakdowns!$K:$K,\"=\"&$B41))","v":277},{"$f":"IF($P$1,SUMIFS(Breakdowns!S:S,Breakdowns!$J:$J,\"=\"&$A41,Breakdowns!$K:$K,\"=\"&$B41,Breakdowns!$AA:$AA,\"=No\"),SUMIFS(Breakdowns!S:S,Breakdowns!$J:$J,\"=\"&$A41,Breakdowns!$K:$K,\"=\"&$B41))","v":4952472},{"$f":"IF($P$1,SUMIFS(Breakdowns!U:U,Breakdowns!$J:$J,\"=\"&$A41,Breakdowns!$K:$K,\"=\"&$B41,Breakdowns!$AA:$AA,\"=No\"),SUMIFS(Breakdowns!U:U,Breakdowns!$J:$J,\"=\"&$A41,Breakdowns!$K:$K,\"=\"&$B41))","v":4863301},{"$f":"IF($P$1,SUMIFS(Breakdowns!W:W,Breakdowns!$J:$J,\"=\"&$A41,Breakdowns!$K:$K,\"=\"&$B41,Breakdowns!$AA:$AA,\"=No\"),SUMIFS(Breakdowns!W:W,Breakdowns!$J:$J,\"=\"&$A41,Breakdowns!$K:$K,\"=\"&$B41))","v":2764715},{"$f":"IF($P$1,SUMIFS(Breakdowns!Y:Y,Breakdowns!$J:$J,\"=\"&$A41,Breakdowns!$K:$K,\"=\"&$B41,Breakdowns!$AA:$AA,\"=No\"),SUMIFS(Breakdowns!Y:Y,Breakdowns!$J:$J,\"=\"&$A41,Breakdowns!$K:$K,\"=\"&$B41))","v":2718204}]
["MG","DO","Monorail/Automated Guideway - Directly Operated",null,null,{"$f":"IF($P$1,SUMIFS(Breakdowns!L:L,Breakdowns!$J:$J,\"=\"&$A42,Breakdowns!$K:$K,\"=\"&$B42,Breakdowns!$AA:$AA,\"=No\"),SUMIFS(Breakdowns!L:L,Breakdowns!$J:$J,\"=\"&$A42,Breakdowns!$K:$K,\"=\"&$B42))","v":110},{"$f":"IF($P$1,SUMIFS(Breakdowns!M:M,Breakdowns!$J:$J,\"=\"&$A42,Breakdowns!$K:$K,\"=\"&$B42,Breakdowns!$AA:$AA,\"=No\"),SUMIFS(Breakdowns!M:M,Breakdowns!$J:$J,\"=\"&$A42,Breakdowns!$K:$K,\"=\"&$B42))","v":473},{"$f":"IF($P$1,SUMIFS(Breakdowns!O:O,Breakdowns!$J:$J,\"=\"&$A42,Breakdowns!$K:$K,\"=\"&$B42,Breakdowns!$AA:$AA,\"=No\"),SUMIFS(Breakdowns!O:O,Breakdowns!$J:$J,\"=\"&$A42,Breakdowns!$K:$K,\"=\"&$B42))","v":943},{"$f":"IF($P$1,SUMIFS(Breakdowns!Q:Q,Breakdowns!$J:$J,\"=\"&$A42,Breakdowns!$K:$K,\"=\"&$B42,Breakdowns!$AA:$AA,\"=No\"),SUMIFS(Breakdowns!Q:Q,Breakdowns!$J:$J,\"=\"&$A42,Breakdowns!$K:$K,\"=\"&$B42))","v":1416},{"$f":"IF($P$1,SUMIFS(Breakdowns!S:S,Breakdowns!$J:$J,\"=\"&$A42,Breakdowns!$K:$K,\"=\"&$B42,Breakdowns!$AA:$AA,\"=No\"),SUMIFS(Breakdowns!S:S,Breakdowns!$J:$J,\"=\"&$A42,Breakdowns!$K:$K,\"=\"&$B42))","v":4490240},{"$f":"IF($P$1,SUMIFS(Breakdowns!U:U,Breakdowns!$J:$J,\"=\"&$A42,Breakdowns!$K:$K,\"=\"&$B42,Breakdowns!$AA:$AA,\"=No\"),SUMIFS(Breakdowns!U:U,Breakdowns!$J:$J,\"=\"&$A42,Breakdowns!$K:$K,\"=\"&$B42))","v":4434322},{"$f":"IF($P$1,SUMIFS(Breakdowns!W:W,Breakdowns!$J:$J,\"=\"&$A42,Breakdowns!$K:$K,\"=\"&$B42,Breakdowns!$AA:$AA,\"=No\"),SUMIFS(Breakdowns!W:W,Breakdowns!$J:$J,\"=\"&$A42,Breakdowns!$K:$K,\"=\"&$B42))","v":2440932},{"$f":"IF($P$1,SUMIFS(Breakdowns!Y:Y,Breakdowns!$J:$J,\"=\"&$A42,Breakdowns!$K:$K,\"=\"&$B42,Breakdowns!$AA:$AA,\"=No\"),SUMIFS(Breakdowns!Y:Y,Breakdowns!$J:$J,\"=\"&$A42,Breakdowns!$K:$K,\"=\"&$B42))","v":2405330}]
["MG","PT","Monorail/Automated Guideway - Purchased Transportation",null,null,{"$f":"IF($P$1,SUMIFS(Breakdowns!L:L,Breakdowns!$J:$J,\"=\"&$A43,Breakdowns!$K:$K,\"=\"&$B43,Breakdowns!$AA:$AA,\"=No\"),SUMIFS(Breakdowns!L:L,Breakdowns!$J:$J,\"=\"&$A43,Breakdowns!$K:$K,\"=\"&$B43))","v":12},{"$f":"IF($P$1,SUMIFS(Breakdowns!M:M,Breakdowns!$J:$J,\"=\"&$A43,Breakdowns!$K:$K,\"=\"&$B43,Breakdowns!$AA:$AA,\"=No\"),SUMIFS(Breakdowns!M:M,Breakdowns!$J:$J,\"=\"&$A43,Breakdowns!$K:$K,\"=\"&$B43))","v":4},{"$f":"IF($P$1,SUMIFS(Breakdowns!O:O,Breakdowns!$J:$J,\"=\"&$A43,Breakdowns!$K:$K,\"=\"&$B43,Breakdowns!$AA:$AA,\"=No\"),SUMIFS(Breakdowns!O:O,Breakdowns!$J:$J,\"=\"&$A43,Breakdowns!$K:$K,\"=\"&$B43))","v":39},{"$f":"IF($P$1,SUMIFS(Breakdowns!Q:Q,Breakdowns!$J:$J,\"=\"&$A43,Breakdowns!$K:$K,\"=\"&$B43,Breakdowns!$AA:$AA,\"=No\"),SUMIFS(Breakdowns!Q:Q,Breakdowns!$J:$J,\"=\"&$A43,Breakdowns!$K:$K,\"=\"&$B43))","v":43},{"$f":"IF($P$1,SUMIFS(Breakdowns!S:S,Breakdowns!$J:$J,\"=\"&$A43,Breakdowns!$K:$K,\"=\"&$B43,Breakdowns!$AA:$AA,\"=No\"),SUMIFS(Breakdowns!S:S,Breakdowns!$J:$J,\"=\"&$A43,Breakdowns!$K:$K,\"=\"&$B43))","v":646393},{"$f":"IF($P$1,SUMIFS(Breakdowns!U:U,Breakdowns!$J:$J,\"=\"&$A43,Breakdowns!$K:$K,\"=\"&$B43,Breakdowns!$AA:$AA,\"=No\"),SUMIFS(Breakdowns!U:U,Breakdowns!$J:$J,\"=\"&$A43,Breakdowns!$K:$K,\"=\"&$B43))","v":644052},{"$f":"IF($P$1,SUMIFS(Breakdowns!W:W,Breakdowns!$J:$J,\"=\"&$A43,Breakdowns!$K:$K,\"=\"&$B43,Breakdowns!$AA:$AA,\"=No\"),SUMIFS(Breakdowns!W:W,Breakdowns!$J:$J,\"=\"&$A43,Breakdowns!$K:$K,\"=\"&$B43))","v":474055},{"$f":"IF($P$1,SUMIFS(Breakdowns!Y:Y,Breakdowns!$J:$J,\"=\"&$A43,Breakdowns!$K:$K,\"=\"&$B43,Breakdowns!$AA:$AA,\"=No\"),SUMIFS(Breakdowns!Y:Y,Breakdowns!$J:$J,\"=\"&$A43,Breakdowns!$K:$K,\"=\"&$B43))","v":471714}]
["SR","DO","Street Car Rail - Directly Operated",null,null,{"$f":"IF($P$1,SUMIFS(Breakdowns!L:L,Breakdowns!$J:$J,\"=\"&$A44,Breakdowns!$K:$K,\"=\"&$B44,Breakdowns!$AA:$AA,\"=No\"),SUMIFS(Breakdowns!L:L,Breakdowns!$J:$J,\"=\"&$A44,Breakdowns!$K:$K,\"=\"&$B44))","v":180},{"$f":"IF($P$1,SUMIFS(Breakdowns!M:M,Breakdowns!$J:$J,\"=\"&$A44,Breakdowns!$K:$K,\"=\"&$B44,Breakdowns!$AA:$AA,\"=No\"),SUMIFS(Breakdowns!M:M,Breakdowns!$J:$J,\"=\"&$A44,Breakdowns!$K:$K,\"=\"&$B44))","v":647},{"$f":"IF($P$1,SUMIFS(Breakdowns!O:O,Breakdowns!$J:$J,\"=\"&$A44,Breakdowns!$K:$K,\"=\"&$B44,Breakdowns!$AA:$AA,\"=No\"),SUMIFS(Breakdowns!O:O,Breakdowns!$J:$J,\"=\"&$A44,Breakdowns!$K:$K,\"=\"&$B44))","v":1797},{"$f":"IF($P$1,SUMIFS(Breakdowns!Q:Q,Breakdowns!$J:$J,\"=\"&$A44,Breakdowns!$K:$K,\"=\"&$B44,Breakdowns!$AA:$AA,\"=No\"),SUMIFS(Breakdowns!Q:Q,Breakdowns!$J:$J,\"=\"&$A44,Breakdowns!$K:$K,\"=\"&$B44))","v":2444},{"$f":"IF($P$1,SUMIFS(Breakdowns!S:S,Breakdowns!$J:$J,\"=\"&$A44,Breakdowns!$K:$K,\"=\"&$B44,Breakdowns!$AA:$AA,\"=No\"),SUMIFS(Breakdowns!S:S,Breakdowns!$J:$J,\"=\"&$A44,Breakdowns!$K:$K,\"=\"&$B44))","v":4782563},{"$f":"IF($P$1,SUMIFS(Breakdowns!U:U,Breakdowns!$J:$J,\"=\"&$A44,Breakdowns!$K:$K,\"=\"&$B44,Breakdowns!$AA:$AA,\"=No\"),SUMIFS(Breakdowns!U:U,Breakdowns!$J:$J,\"=\"&$A44,Breakdowns!$K:$K,\"=\"&$B44))","v":4633061},{"$f":"IF($P$1,SUMIFS(Breakdowns!W:W,Breakdowns!$J:$J,\"=\"&$A44,Breakdowns!$K:$K,\"=\"&$B44,Breakdowns!$AA:$AA,\"=No\"),SUMIFS(Breakdowns!W:W,Breakdowns!$J:$J,\"=\"&$A44,Breakdowns!$K:$K,\"=\"&$B44))","v":4782563},{"$f":"IF($P$1,SUMIFS(Breakdowns!Y:Y,Breakdowns!$J:$J,\"=\"&$A44,Breakdowns!$K:$K,\"=\"&$B44,Breakdowns!$AA:$AA,\"=No\"),SUMIFS(Breakdowns!Y:Y,Breakdowns!$J:$J,\"=\"&$A44,Breakdowns!$K:$K,\"=\"&$B44))","v":4633061}]
["SR","PT","Street Car Rail - Purchased Transportation",null,null,{"$f":"IF($P$1,SUMIFS(Breakdowns!L:L,Breakdowns!$J:$J,\"=\"&$A45,Breakdowns!$K:$K,\"=\"&$B45,Breakdowns!$AA:$AA,\"=No\"),SUMIFS(Breakdowns!L:L,Breakdowns!$J:$J,\"=\"&$A45,Breakdowns!$K:$K,\"=\"&$B45))","v":53},{"$f":"IF($P$1,SUMIFS(Breakdowns!M:M,Breakdowns!$J:$J,\"=\"&$A45,Breakdowns!$K:$K,\"=\"&$B45,Breakdowns!$AA:$AA,\"=No\"),SUMIFS(Breakdowns!M:M,Breakdowns!$J:$J,\"=\"&$A45,Breakdowns!$K:$K,\"=\"&$B45))","v":186},{"$f":"IF($P$1,SUMIFS(Breakdowns!O:O,Breakdowns!$J:$J,\"=\"&$A45,Breakdowns!$K:$K,\"=\"&$B45,Breakdowns!$AA:$AA,\"=No\"),SUMIFS(Breakdowns!O:O,Breakdowns!$J:$J,\"=\"&$A45,Breakdowns!$K:$K,\"=\"&$B45))","v":205},{"$f":"IF($P$1,SUMIFS(Breakdowns!Q:Q,Breakdowns!$J:$J,\"=\"&$A45,Breakdowns!$K:$K,\"=\"&$B45,Breakdowns!$AA:$AA,\"=No\"),SUMIFS(Breakdowns!Q:Q,Breakdowns!$J:$J,\"=\"&$A45,Breakdowns!$K:$K,\"=\"&$B45))","v":391},{"$f":"IF($P$1,SUMIFS(Breakdowns!S:S,Breakdowns!$J:$J,\"=\"&$A45,Breakdowns!$K:$K,\"=\"&$B45,Breakdowns!$AA:$AA,\"=No\"),SUMIFS(Breakdowns!S:S,Breakdowns!$J:$J,\"=\"&$A45,Breakdowns!$K:$K,\"=\"&$B45))","v":1697667},{"$f":"IF($P$1,SUMIFS(Breakdowns!U:U,Breakdowns!$J:$J,\"=\"&$A45,Breakdowns!$K:$K,\"=\"&$B45,Breakdowns!$AA:$AA,\"=No\"),SUMIFS(Breakdowns!U:U,Breakdowns!$J:$J,\"=\"&$A45,Breakdowns!$K:$K,\"=\"&$B45))","v":1685395},{"$f":"IF($P$1,SUMIFS(Breakdowns!W:W,Breakdowns!$J:$J,\"=\"&$A45,Breakdowns!$K:$K,\"=\"&$B45,Breakdowns!$AA:$AA,\"=No\"),SUMIFS(Breakdowns!W:W,Breakdowns!$J:$J,\"=\"&$A45,Breakdowns!$K:$K,\"=\"&$B45))","v":1697667},{"$f":"IF($P$1,SUMIFS(Breakdowns!Y:Y,Breakdowns!$J:$J,\"=\"&$A45,Breakdowns!$K:$K,\"=\"&$B45,Breakdowns!$AA:$AA,\"=No\"),SUMIFS(Breakdowns!Y:Y,Breakdowns!$J:$J,\"=\"&$A45,Breakdowns!$K:$K,\"=\"&$B45))","v":1685395}]
["TB","DO","Trolleybus - Directly Operated",null,null,{"$f":"IF($P$1,SUMIFS(Breakdowns!L:L,Breakdowns!$J:$J,\"=\"&$A46,Breakdowns!$K:$K,\"=\"&$B46,Breakdowns!$AA:$AA,\"=No\"),SUMIFS(Breakdowns!L:L,Breakdowns!$J:$J,\"=\"&$A46,Breakdowns!$K:$K,\"=\"&$B46))","v":412},{"$f":"IF($P$1,SUMIFS(Breakdowns!M:M,Breakdowns!$J:$J,\"=\"&$A46,Breakdowns!$K:$K,\"=\"&$B46,Breakdowns!$AA:$AA,\"=No\"),SUMIFS(Breakdowns!M:M,Breakdowns!$J:$J,\"=\"&$A46,Breakdowns!$K:$K,\"=\"&$B46))","v":5425},{"$f":"IF($P$1,SUMIFS(Breakdowns!O:O,Breakdowns!$J:$J,\"=\"&$A46,Breakdowns!$K:$K,\"=\"&$B46,Breakdowns!$AA:$AA,\"=No\"),SUMIFS(Breakdowns!O:O,Breakdowns!$J:$J,\"=\"&$A46,Breakdowns!$K:$K,\"=\"&$B46))","v":2461},{"$f":"IF($P$1,SUMIFS(Breakdowns!Q:Q,Breakdowns!$J:$J,\"=\"&$A46,Breakdowns!$K:$K,\"=\"&$B46,Breakdowns!$AA:$AA,\"=No\"),SUMIFS(Breakdowns!Q:Q,Breakdowns!$J:$J,\"=\"&$A46,Breakdowns!$K:$K,\"=\"&$B46))","v":7886},{"$f":"IF($P$1,SUMIFS(Breakdowns!S:S,Breakdowns!$J:$J,\"=\"&$A46,Breakdowns!$K:$K,\"=\"&$B46,Breakdowns!$AA:$AA,\"=No\"),SUMIFS(Breakdowns!S:S,Breakdowns!$J:$J,\"=\"&$A46,Breakdowns!$K:$K,\"=\"&$B46))","v":11771818},{"$f":"IF($P$1,SUMIFS(Breakdowns!U:U,Breakdowns!$J:$J,\"=\"&$A46,Breakdowns!$K:$K,\"=\"&$B46,Breakdowns!$AA:$AA,\"=No\"),SUMIFS(Breakdowns!U:U,Breakdowns!$J:$J,\"=\"&$A46,Breakdowns!$K:$K,\"=\"&$B46))","v":11308748},{"$f":"IF($P$1,SUMIFS(Breakdowns!W:W,Breakdowns!$J:$J,\"=\"&$A46,Breakdowns!$K:$K,\"=\"&$B46,Breakdowns!$AA:$AA,\"=No\"),SUMIFS(Breakdowns!W:W,Breakdowns!$J:$J,\"=\"&$A46,Breakdowns!$K:$K,\"=\"&$B46))","v":0},{"$f":"IF($P$1,SUMIFS(Breakdowns!Y:Y,Breakdowns!$J:$J,\"=\"&$A46,Breakdowns!$K:$K,\"=\"&$B46,Breakdowns!$AA:$AA,\"=No\"),SUMIFS(Breakdowns!Y:Y,Breakdowns!$J:$J,\"=\"&$A46,Breakdowns!$K:$K,\"=\"&$B46))","v":0}]
["VP","DO","Vanpool - Directly Operated",null,null,{"$f":"IF($P$1,SUMIFS(Breakdowns!L:L,Breakdowns!$J:$J,\"=\"&$A47,Breakdowns!$K:$K,\"=\"&$B47,Breakdowns!$AA:$AA,\"=No\"),SUMIFS(Breakdowns!L:L,Breakdowns!$J:$J,\"=\"&$A47,Breakdowns!$K:$K,\"=\"&$B47))","v":6987},{"$f":"IF($P$1,SUMIFS(Breakdowns!M:M,Breakdowns!$J:$J,\"=\"&$A47,Breakdowns!$K:$K,\"=\"&$B47,Breakdowns!$AA:$AA,\"=No\"),SUMIFS(Breakdowns!M:M,Breakdowns!$J:$J,\"=\"&$A47,Breakdowns!$K:$K,\"=\"&$B47))","v":332},{"$f":"IF($P$1,SUMIFS(Breakdowns!O:O,Breakdowns!$J:$J,\"=\"&$A47,Breakdowns!$K:$K,\"=\"&$B47,Breakdowns!$AA:$AA,\"=No\"),SUMIFS(Breakdowns!O:O,Breakdowns!$J:$J,\"=\"&$A47,Breakdowns!$K:$K,\"=\"&$B47))","v":256},{"$f":"IF($P$1,SUMIFS(Breakdowns!Q:Q,Breakdowns!$J:$J,\"=\"&$A47,Breakdowns!$K:$K,\"=\"&$B47,Breakdowns!$AA:$AA,\"=No\"),SUMIFS(Breakdowns!Q:Q,Breakdowns!$J:$J,\"=\"&$A47,Breakdowns!$K:$K,\"=\"&$B47))","v":588},{"$f":"IF($P$1,SUMIFS(Breakdowns!S:S,Breakdowns!$J:$J,\"=\"&$A47,Breakdowns!$K:$K,\"=\"&$B47,Breakdowns!$AA:$AA,\"=No\"),SUMIFS(Breakdowns!S:S,Breakdowns!$J:$J,\"=\"&$A47,Breakdowns!$K:$K,\"=\"&$B47))","v":104590409},{"$f":"IF($P$1,SUMIFS(Breakdowns!U:U,Breakdowns!$J:$J,\"=\"&$A47,Breakdowns!$K:$K,\"=\"&$B47,Breakdowns!$AA:$AA,\"=No\"),SUMIFS(Breakdowns!U:U,Breakdowns!$J:$J,\"=\"&$A47,Breakdowns!$K:$K,\"=\"&$B47))","v":104590409},{"$f":"IF($P$1,SUMIFS(Breakdowns!W:W,Breakdowns!$J:$J,\"=\"&$A47,Breakdowns!$K:$K,\"=\"&$B47,Breakdowns!$AA:$AA,\"=No\"),SUMIFS(Breakdowns!W:W,Breakdowns!$J:$J,\"=\"&$A47,Breakdowns!$K:$K,\"=\"&$B47))","v":0},{"$f":"IF($P$1,SUMIFS(Breakdowns!Y:Y,Breakdowns!$J:$J,\"=\"&$A47,Breakdowns!$K:$K,\"=\"&$B47,Breakdowns!$AA:$AA,\"=No\"),SUMIFS(Breakdowns!Y:Y,Breakdowns!$J:$J,\"=\"&$A47,Breakdowns!$K:$K,\"=\"&$B47))","v":0}]
["VP","PT","Vanpool - Purchased Transportation",null,null,{"$f":"IF($P$1,SUMIFS(Breakdowns!L:L,Breakdowns!$J:$J,\"=\"&$A48,Breakdowns!$K:$K,\"=\"&$B48,Breakdowns!$AA:$AA,\"=No\"),SUMIFS(Breakdowns!L:L,Breakdowns!$J:$J,\"=\"&$A48,Breakdowns!$K:$K,\"=\"&$B48))","v":5923},{"$f":"IF($P$1,SUMIFS(Breakdowns!M:M,Breakdowns!$J:$J,\"=\"&$A48,Breakdowns!$K:$K,\"=\"&$B48,Breakdowns!$AA:$AA,\"=No\"),SUMIFS(Breakdowns!M:M,Breakdowns!$J:$J,\"=\"&$A48,Breakdowns!$K:$K,\"=\"&$B48))","v":92},{"$f":"IF($P$1,SUMIFS(Breakdowns!O:O,Breakdowns!$J:$J,\"=\"&$A48,Breakdowns!$K:$K,\"=\"&$B48,Breakdowns!$AA:$AA,\"=No\"),SUMIFS(Breakdowns!O:O,Breakdowns!$J:$J,\"=\"&$A48,Breakdowns!$K:$K,\"=\"&$B48))","v":294},{"$f":"IF($P$1,SUMIFS(Breakdowns!Q:Q,Breakdowns!$J:$J,\"=\"&$A48,Breakdowns!$K:$K,\"=\"&$B48,Breakdowns!$AA:$AA,\"=No\"),SUMIFS(Breakdowns!Q:Q,Breakdowns!$J:$J,\"=\"&$A48,Breakdowns!$K:$K,\"=\"&$B48))","v":386},{"$f":"IF($P$1,SUMIFS(Breakdowns!S:S,Breakdowns!$J:$J,\"=\"&$A48,Breakdowns!$K:$K,\"=\"&$B48,Breakdowns!$AA:$AA,\"=No\"),SUMIFS(Breakdowns!S:S,Breakdowns!$J:$J,\"=\"&$A48,Breakdowns!$K:$K,\"=\"&$B48))","v":122036049},{"$f":"IF($P$1,SUMIFS(Breakdowns!U:U,Breakdowns!$J:$J,\"=\"&$A48,Breakdowns!$K:$K,\"=\"&$B48,Breakdowns!$AA:$AA,\"=No\"),SUMIFS(Breakdowns!U:U,Breakdowns!$J:$J,\"=\"&$A48,Breakdowns!$K:$K,\"=\"&$B48))","v":122036049},{"$f":"IF($P$1,SUMIFS(Breakdowns!W:W,Breakdowns!$J:$J,\"=\"&$A48,Breakdowns!$K:$K,\"=\"&$B48,Breakdowns!$AA:$AA,\"=No\"),SUMIFS(Breakdowns!W:W,Breakdowns!$J:$J,\"=\"&$A48,Breakdowns!$K:$K,\"=\"&$B48))","v":0},{"$f":"IF($P$1,SUMIFS(Breakdowns!Y:Y,Breakdowns!$J:$J,\"=\"&$A48,Breakdowns!$K:$K,\"=\"&$B48,Breakdowns!$AA:$AA,\"=No\"),SUMIFS(Breakdowns!Y:Y,Breakdowns!$J:$J,\"=\"&$A48,Breakdowns!$K:$K,\"=\"&$B48))","v":0}]
[]
["By Agency Size (Vehicles)"]
[null,null,null,"edit bins below","Column1","VOMS","Major Mechanical Failures","Other Mechanical Failures","Total Mechanical Failures","Vehicle/Passenger Car Miles","Vehicle/Passenger Car Revenue Miles","Train Miles","Train Revenue Miles",null,null,null,null,null,null,null,{"$f":"\"under \"&FIXED(B52,0,0)","v":"under 10"},{"$f":"IFERROR($K52/$G52,\"\")","v":18922.199203187251}]
["under",{"$f":"D52","v":10},null,10,{"$f":"A52&\" \"&FIXED(B52,0,0)","v":"under 10"},{"$f":"IF($P$1,SUMIFS(Breakdowns!L:L,Breakdowns!$I:$I,\"<\"&$D52,Breakdowns!$AA:$AA,\"=No\"),SUMIFS(Breakdowns!L:L,Breakdowns!$I:$I,\"<\"&$D52))","v":145},{"$f":"IF($P$1,SUMIFS(Breakdowns!M:M,Breakdowns!$I:$I,\"<\"&$D52,Breakdowns!$AA:$AA,\"=No\"),SUMIFS(Breakdowns!M:M,Breakdowns!$I:$I,\"<\"&$D52))","v":251},{"$f":"IF($P$1,SUMIFS(Breakdowns!O:O,Breakdowns!$I:$I,\"<\"&$D52,Breakdowns!$AA:$AA,\"=No\"),SUMIFS(Breakdowns!O:O,Breakdowns!$I:$I,\"<\"&$D52))","v":550},{"$f":"IF($P$1,SUMIFS(Breakdowns!Q:Q,Breakdowns!$I:$I,\"<\"&$D52,Breakdowns!$AA:$AA,\"=No\"),SUMIFS(Breakdowns!Q:Q,Breakdowns!$I:$I,\"<\"&$D52))","v":801},{"$f":"IF($P$1,SUMIFS(Breakdowns!S:S,Breakdowns!$I:$I,\"<\"&$D52,Breakdowns!$AA:$AA,\"=No\"),SUMIFS(Breakdowns!S:S,Breakdowns!$I:$I,\"<\"&$D52))","v":5070000},{"$f":"IF($P$1,SUMIFS(Breakdowns!U:U,Breakdowns!$I:$I,\"<\"&$D52,Breakdowns!$AA:$AA,\"=No\"),SUMIFS(Breakdowns!U:U,Breakdowns!$I:$I,\"<\"&$D52))","v":4749472},{"$f":"IF($P$1,SUMIFS(Breakdowns!W:W,Breakdowns!$I:$I,\"<\"&$D52,Breakdowns!$AA:$AA,\"=No\"),SUMIFS(Breakdowns!W:W,Breakdowns!$I:$I,\"<\"&$D52))","v":175103},{"$f":"IF($P$1,SUMIFS(Breakdowns!Y:Y,Breakdowns!$I:$I,\"<\"&$D52,Breakdowns!$AA:$AA,\"=No\"),SUMIFS(Breakdowns!Y:Y,Breakdowns!$I:$I,\"<\"&$D52))","v":173202},null,null,null,null,null,null,null,{"$f":"IFERROR(IF(A53=\"over\",\"over \"&FIXED(B53,0,0),FIXED(B53,0,0)&\" to \"&FIXED(D53,0,0)),\"\")","v":"10 to 25"},{"$f":"IFERROR($K53/$G53,\"\")","v":13422.269272237198}]
[{"$f":"IF(D53<>\"\",\"between\",\"over\")","v":"between"},{"$f":"D52","v":10},{"$f":"IF(D53<>\"\",\"and\",\"\")","v":"and"},25,{"$f":"IFERROR(IF(A53=\"between\",A53&\" \"&FIXED(B53,0,0)&\" \"&C53&\" \"&FIXED(D53,0,0),A53&\" \"&FIXED(B53,0,0)),\"invalid bin\")","v":"between 10 and 25"},{"$f":"IF($P$1,IF($A53=\"between\",SUMIFS(Breakdowns!L:L,Breakdowns!$I:$I,\">=\"&$B53,Breakdowns!$I:$I,\"<\"&$D53,Breakdowns!$AA:$AA,\"=No\"),SUMIFS(Breakdowns!L:L,Breakdowns!$I:$I,\">=\"&$B53,Breakdowns!$AA:$AA,\"=No\")),IF($A53=\"between\",SUMIFS(Breakdowns!L:L,Breakdowns!$I:$I,\">=\"&$B53,Breakdowns!$I:$I,\"<\"&$D53),SUMIFS(Breakdowns!L:L,Breakdowns!$I:$I,\">=\"&$B53)))","v":1330},{"$f":"IF($P$1,IF($A53=\"between\",SUMIFS(Breakdowns!M:M,Breakdowns!$I:$I,\">=\"&$B53,Breakdowns!$I:$I,\"<\"&$D53,Breakdowns!$AA:$AA,\"=No\"),SUMIFS(Breakdowns!M:M,Breakdowns!$I:$I,\">=\"&$B53,Breakdowns!$AA:$AA,\"=No\")),IF($A53=\"between\",SUMIFS(Breakdowns!M:M,Breakdowns!$I:$I,\">=\"&$B53,Breakdowns!$I:$I,\"<\"&$D53),SUMIFS(Breakdowns!M:M,Breakdowns!$I:$I,\">=\"&$B53)))","v":3710},{"$f":"IF($P$1,IF($A53=\"between\",SUMIFS(Breakdowns!O:O,Breakdowns!$I:$I,\">=\"&$B53,Breakdowns!$I:$I,\"<\"&$D53,Breakdowns!$AA:$AA,\"=No\"),SUMIFS(Breakdowns!O:O,Breakdowns!$I:$I,\">=\"&$B53,Breakdowns!$AA:$AA,\"=No\")),IF($A53=\"between\",SUMIFS(Breakdowns!O:O,Breakdowns!$I:$I,\">=\"&$B53,Breakdowns!$I:$I,\"<\"&$D53),SUMIFS(Breakdowns!O:O,Breakdowns!$I:$I,\">=\"&$B53)))","v":6819},{"$f":"IF($P$1,IF($A53=\"between\",SUMIFS(Breakdowns!Q:Q,Breakdowns!$I:$I,\">=\"&$B53,Breakdowns!$I:$I,\"<\"&$D53,Breakdowns!$AA:$AA,\"=No\"),SUMIFS(Breakdowns!Q:Q,Breakdowns!$I:$I,\">=\"&$B53,Breakdowns!$AA:$AA,\"=No\")),IF($A53=\"between\",SUMIFS(Breakdowns!Q:Q,Breakdowns!$I:$I,\">=\"&$B53,Breakdowns!$I:$I,\"<\"&$D53),SUMIFS(Breakdowns!Q:Q,Breakdowns!$I:$I,\">=\"&$B53)))","v":10529},{"$f":"IF($P$1,IF($A53=\"between\",SUMIFS(Breakdowns!S:S,Breakdowns!$I:$I,\">=\"&$B53,Breakdowns!$I:$I,\"<\"&$D53,Breakdowns!$AA:$AA,\"=No\"),SUMIFS(Breakdowns!S:S,Breakdowns!$I:$I,\">=\"&$B53,Breakdowns!$AA:$AA,\"=No\")),IF($A53=\"between\",SUMIFS(Breakdowns!S:S,Breakdowns!$I:$I,\">=\"&$B53,Breakdowns!$I:$I,\"<\"&$D53),SUMIFS(Breakdowns!S:S,Breakdowns!$I:$I,\">=\"&$B53)))","v":53416989},{"$f":"IF($P$1,IF($A53=\"between\",SUMIFS(Breakdowns!U:U,Breakdowns!$I:$I,\">=\"&$B53,Breakdowns!$I:$I,\"<\"&$D53,Breakdowns!$AA:$AA,\"=No\"),SUMIFS(Breakdowns!U:U,Breakdowns!$I:$I,\">=\"&$B53,Breakdowns!$AA:$AA,\"=No\")),IF($A53=\"between\",SUMIFS(Breakdowns!U:U,Breakdowns!$I:$I,\">=\"&$B53,Breakdowns!$I:$I,\"<\"&$D53),SUMIFS(Breakdowns!U:U,Breakdowns!$I:$I,\">=\"&$B53)))","v":49796619},{"$f":"IF($P$1,IF($A53=\"between\",SUMIFS(Breakdowns!W:W,Breakdowns!$I:$I,\">=\"&$B53,Breakdowns!$I:$I,\"<\"&$D53,Breakdowns!$AA:$AA,\"=No\"),SUMIFS(Breakdowns!W:W,Breakdowns!$I:$I,\">=\"&$B53,Breakdowns!$AA:$AA,\"=No\")),IF($A53=\"between\",SUMIFS(Breakdowns!W:W,Breakdowns!$I:$I,\">=\"&$B53,Breakdowns!$I:$I,\"<\"&$D53),SUMIFS(Breakdowns!W:W,Breakdowns!$I:$I,\">=\"&$B53)))","v":1915515},{"$f":"IF($P$1,IF($A53=\"between\",SUMIFS(Breakdowns!Y:Y,Breakdowns!$I:$I,\">=\"&$B53,Breakdowns!$I:$I,\"<\"&$D53,Breakdowns!$AA:$AA,\"=No\"),SUMIFS(Breakdowns!Y:Y,Breakdowns!$I:$I,\">=\"&$B53,Breakdowns!$AA:$AA,\"=No\")),IF($A53=\"between\",SUMIFS(Breakdowns!Y:Y,Breakdowns!$I:$I,\">=\"&$B53,Breakdowns!$I:$I,\"<\"&$D53),SUMIFS(Breakdowns!Y:Y,Breakdowns!$I:$I,\">=\"&$B53)))","v":1882857},null,null,null,null,null,null,null,{"$f":"IFERROR(IF(A54=\"over\",\"over \"&FIXED(B54,0,0),FIXED(B54,0,0)&\" to \"&FIXED(D54,0,0)),\"\")","v":"25 to 50"},17533.344265514534]
[{"$f":"IF(OR(A53=\"over\",A53=\"\"),\"\",IF(D54=\"\",\"over\",\"between\"))","v":"between"},{"$f":"IF(D53=\"\",\"\",D53)","v":25},{"$f":"IF(D54<>\"\",\"and\",\"\")","v":"and"},50,{"$f":"IFERROR(IF(A54=\"between\",A54&\" \"&FIXED(B54,0,0)&\" \"&C54&\" \"&FIXED(D54,0,0),A54&\" \"&FIXED(B54,0,0)),\"invalid bin\")","v":"between 25 and 50"},{"$f":"IF($P$1,IF($A54=\"\",\"\",IF($A54=\"between\",SUMIFS(Breakdowns!L:L,Breakdowns!$I:$I,\">=\"&$B54,Breakdowns!$I:$I,\"<\"&$D54,Breakdowns!$AA:$AA,\"=No\"),SUMIFS(Breakdowns!L:L,Breakdowns!$I:$I,\">=\"&$B54,Breakdowns!$AA:$AA,\"=No\"))),IF($A54=\"\",\"\",IF($A54=\"between\",SUMIFS(Breakdowns!L:L,Breakdowns!$I:$I,\">=\"&$B54,Breakdowns!$I:$I,\"<\"&$D54),SUMIFS(Breakdowns!L:L,Breakdowns!$I:$I,\">=\"&$B54))))","v":5152},{"$f":"IF($P$1,IF($A54=\"\",\"\",IF($A54=\"between\",SUMIFS(Breakdowns!M:M,Breakdowns!$I:$I,\">=\"&$B54,Breakdowns!$I:$I,\"<\"&$D54,Breakdowns!$AA:$AA,\"=No\"),SUMIFS(Breakdowns!M:M,Breakdowns!$I:$I,\">=\"&$B54,Breakdowns!$AA:$AA,\"=No\"))),IF($A54=\"\",\"\",IF($A54=\"between\",SUMIFS(Breakdowns!M:M,Breakdowns!$I:$I,\">=\"&$B54,Breakdowns!$I:$I,\"<\"&$D54),SUMIFS(Breakdowns!M:M,Breakdowns!$I:$I,\">=\"&$B54))))","v":10184},{"$f":"IF($P$1,IF($A54=\"\",\"\",IF($A54=\"between\",SUMIFS(Breakdowns!O:O,Breakdowns!$I:$I,\">=\"&$B54,Breakdowns!$I:$I,\"<\"&$D54,Breakdowns!$AA:$AA,\"=No\"),SUMIFS(Breakdowns!O:O,Breakdowns!$I:$I,\">=\"&$B54,Breakdowns!$AA:$AA,\"=No\"))),IF($A54=\"\",\"\",IF($A54=\"between\",SUMIFS(Breakdowns!O:O,Breakdowns!$I:$I,\">=\"&$B54,Breakdowns!$I:$I,\"<\"&$D54),SUMIFS(Breakdowns!O:O,Breakdowns!$I:$I,\">=\"&$B54))))","v":13289},{"$f":"IF($P$1,IF($A54=\"\",\"\",IF($A54=\"between\",SUMIFS(Breakdowns!Q:Q,Breakdowns!$I:$I,\">=\"&$B54,Breakdowns!$I:$I,\"<\"&$D54,Breakdowns!$AA:$AA,\"=No\"),SUMIFS(Breakdowns!Q:Q,Breakdowns!$I:$I,\">=\"&$B54,Breakdowns!$AA:$AA,\"=No\"))),IF($A54=\"\",\"\",IF($A54=\"between\",SUMIFS(Breakdowns!Q:Q,Breakdowns!$I:$I,\">=\"&$B54,Breakdowns!$I:$I,\"<\"&$D54),SUMIFS(Breakdowns!Q:Q,Breakdowns!$I:$I,\">=\"&$B54))))","v":23473},{"$f":"IF($P$1,IF($A54=\"\",\"\",IF($A54=\"between\",SUMIFS(Breakdowns!S:S,Breakdowns!$I:$I,\">=\"&$B54,Breakdowns!$I:$I,\"<\"&$D54,Breakdowns!$AA:$AA,\"=No\"),SUMIFS(Breakdowns!S:S,Breakdowns!$I:$I,\">=\"&$B54,Breakdowns!$AA:$AA,\"=No\"))),IF($A54=\"\",\"\",IF($A54=\"between\",SUMIFS(Breakdowns!S:S,Breakdowns!$I:$I,\">=\"&$B54,Breakdowns!$I:$I,\"<\"&$D54),SUMIFS(Breakdowns!S:S,Breakdowns!$I:$I,\">=\"&$B54))))","v":198287390},{"$f":"IF($P$1,IF($A54=\"\",\"\",IF($A54=\"between\",SUMIFS(Breakdowns!U:U,Breakdowns!$I:$I,\">=\"&$B54,Breakdowns!$I:$I,\"<\"&$D54,Breakdowns!$AA:$AA,\"=No\"),SUMIFS(Breakdowns!U:U,Breakdowns!$I:$I,\">=\"&$B54,Breakdowns!$AA:$AA,\"=No\"))),IF($A54=\"\",\"\",IF($A54=\"between\",SUMIFS(Breakdowns!U:U,Breakdowns!$I:$I,\">=\"&$B54,Breakdowns!$I:$I,\"<\"&$D54),SUMIFS(Breakdowns!U:U,Breakdowns!$I:$I,\">=\"&$B54))))","v":178559578},{"$f":"IF($P$1,IF($A54=\"\",\"\",IF($A54=\"between\",SUMIFS(Breakdowns!W:W,Breakdowns!$I:$I,\">=\"&$B54,Breakdowns!$I:$I,\"<\"&$D54,Breakdowns!$AA:$AA,\"=No\"),SUMIFS(Breakdowns!W:W,Breakdowns!$I:$I,\">=\"&$B54,Breakdowns!$AA:$AA,\"=No\"))),IF($A54=\"\",\"\",IF($A54=\"between\",SUMIFS(Breakdowns!W:W,Breakdowns!$I:$I,\">=\"&$B54,Breakdowns!$I:$I,\"<\"&$D54),SUMIFS(Breakdowns!W:W,Breakdowns!$I:$I,\">=\"&$B54))))","v":4696636},{"$f":"IF($P$1,IF($A54=\"\",\"\",IF($A54=\"between\",SUMIFS(Breakdowns!Y:Y,Breakdowns!$I:$I,\">=\"&$B54,Breakdowns!$I:$I,\"<\"&$D54,Breakdowns!$AA:$AA,\"=No\"),SUMIFS(Breakdowns!Y:Y,Breakdowns!$I:$I,\">=\"&$B54,Breakdowns!$AA:$AA,\"=No\"))),IF($A54=\"\",\"\",IF($A54=\"between\",SUMIFS(Breakdowns!Y:Y,Breakdowns!$I:$I,\">=\"&$B54,Breakdowns!$I:$I,\"<\"&$D54),SUMIFS(Breakdowns!Y:Y,Breakdowns!$I:$I,\">=\"&$B54))))","v":4492214},null,null,null,null,null,null,null,"50 to 100",17292.63803909401]
["between",50,{"$f":"IF(D55<>\"\",\"and\",\"\")","v":"and"},100,"between 50 and 100",{"$f":"IF($P$1,IF($A55=\"\",\"\",IF($A55=\"between\",SUMIFS(Breakdowns!L:L,Breakdowns!$I:$I,\">=\"&$B55,Breakdowns!$I:$I,\"<\"&$D55,Breakdowns!$AA:$AA,\"=No\"),SUMIFS(Breakdowns!L:L,Breakdowns!$I:$I,\">=\"&$B55,Breakdowns!$AA:$AA,\"=No\"))),IF($A55=\"\",\"\",IF($A55=\"between\",SUMIFS(Breakdowns!L:L,Breakdowns!$I:$I,\">=\"&$B55,Breakdowns!$I:$I,\"<\"&$D55),SUMIFS(Breakdowns!L:L,Breakdowns!$I:$I,\">=\"&$B55))))","v":8482},{"$f":"IF($P$1,IF($A55=\"\",\"\",IF($A55=\"between\",SUMIFS(Breakdowns!M:M,Breakdowns!$I:$I,\">=\"&$B55,Breakdowns!$I:$I,\"<\"&$D55,Breakdowns!$AA:$AA,\"=No\"),SUMIFS(Breakdowns!M:M,Breakdowns!$I:$I,\">=\"&$B55,Breakdowns!$AA:$AA,\"=No\"))),IF($A55=\"\",\"\",IF($A55=\"between\",SUMIFS(Breakdowns!M:M,Breakdowns!$I:$I,\">=\"&$B55,Breakdowns!$I:$I,\"<\"&$D55),SUMIFS(Breakdowns!M:M,Breakdowns!$I:$I,\">=\"&$B55))))","v":16115},{"$f":"IF($P$1,IF($A55=\"\",\"\",IF($A55=\"between\",SUMIFS(Breakdowns!O:O,Breakdowns!$I:$I,\">=\"&$B55,Breakdowns!$I:$I,\"<\"&$D55,Breakdowns!$AA:$AA,\"=No\"),SUMIFS(Breakdowns!O:O,Breakdowns!$I:$I,\">=\"&$B55,Breakdowns!$AA:$AA,\"=No\"))),IF($A55=\"\",\"\",IF($A55=\"between\",SUMIFS(Breakdowns!O:O,Breakdowns!$I:$I,\">=\"&$B55,Breakdowns!$I:$I,\"<\"&$D55),SUMIFS(Breakdowns!O:O,Breakdowns!$I:$I,\">=\"&$B55))))","v":23713},{"$f":"IF($P$1,IF($A55=\"\",\"\",IF($A55=\"between\",SUMIFS(Breakdowns!Q:Q,Breakdowns!$I:$I,\">=\"&$B55,Breakdowns!$I:$I,\"<\"&$D55,Breakdowns!$AA:$AA,\"=No\"),SUMIFS(Breakdowns!Q:Q,Breakdowns!$I:$I,\">=\"&$B55,Breakdowns!$AA:$AA,\"=No\"))),IF($A55=\"\",\"\",IF($A55=\"between\",SUMIFS(Breakdowns!Q:Q,Breakdowns!$I:$I,\">=\"&$B55,Breakdowns!$I:$I,\"<\"&$D55),SUMIFS(Breakdowns!Q:Q,Breakdowns!$I:$I,\">=\"&$B55))))","v":39828},{"$f":"IF($P$1,IF($A55=\"\",\"\",IF($A55=\"between\",SUMIFS(Breakdowns!S:S,Breakdowns!$I:$I,\">=\"&$B55,Breakdowns!$I:$I,\"<\"&$D55,Breakdowns!$AA:$AA,\"=No\"),SUMIFS(Breakdowns!S:S,Breakdowns!$I:$I,\">=\"&$B55,Breakdowns!$AA:$AA,\"=No\"))),IF($A55=\"\",\"\",IF($A55=\"between\",SUMIFS(Breakdowns!S:S,Breakdowns!$I:$I,\">=\"&$B55,Breakdowns!$I:$I,\"<\"&$D55),SUMIFS(Breakdowns!S:S,Breakdowns!$I:$I,\">=\"&$B55))))","v":310601257},{"$f":"IF($P$1,IF($A55=\"\",\"\",IF($A55=\"between\",SUMIFS(Breakdowns!U:U,Breakdowns!$I:$I,\">=\"&$B55,Breakdowns!$I:$I,\"<\"&$D55,Breakdowns!$AA:$AA,\"=No\"),SUMIFS(Breakdowns!U:U,Breakdowns!$I:$I,\">=\"&$B55,Breakdowns!$AA:$AA,\"=No\"))),IF($A55=\"\",\"\",IF($A55=\"between\",SUMIFS(Breakdowns!U:U,Breakdowns!$I:$I,\">=\"&$B55,Breakdowns!$I:$I,\"<\"&$D55),SUMIFS(Breakdowns!U:U,Breakdowns!$I:$I,\">=\"&$B55))))","v":278670862},{"$f":"IF($P$1,IF($A55=\"\",\"\",IF($A55=\"between\",SUMIFS(Breakdowns!W:W,Breakdowns!$I:$I,\">=\"&$B55,Breakdowns!$I:$I,\"<\"&$D55,Breakdowns!$AA:$AA,\"=No\"),SUMIFS(Breakdowns!W:W,Breakdowns!$I:$I,\">=\"&$B55,Breakdowns!$AA:$AA,\"=No\"))),IF($A55=\"\",\"\",IF($A55=\"between\",SUMIFS(Breakdowns!W:W,Breakdowns!$I:$I,\">=\"&$B55,Breakdowns!$I:$I,\"<\"&$D55),SUMIFS(Breakdowns!W:W,Breakdowns!$I:$I,\">=\"&$B55))))","v":4741498},{"$f":"IF($P$1,IF($A55=\"\",\"\",IF($A55=\"between\",SUMIFS(Breakdowns!Y:Y,Breakdowns!$I:$I,\">=\"&$B55,Breakdowns!$I:$I,\"<\"&$D55,Breakdowns!$AA:$AA,\"=No\"),SUMIFS(Breakdowns!Y:Y,Breakdowns!$I:$I,\">=\"&$B55,Breakdowns!$AA:$AA,\"=No\"))),IF($A55=\"\",\"\",IF($A55=\"between\",SUMIFS(Breakdowns!Y:Y,Breakdowns!$I:$I,\">=\"&$B55,Breakdowns!$I:$I,\"<\"&$D55),SUMIFS(Breakdowns!Y:Y,Breakdowns!$I:$I,\">=\"&$B55))))","v":4576847},null,null,null,null,null,null,null,"100 to 250",11845.792461210471]
["between",100,"and",250,"between 100 and 250",{"$f":"IF($P$1,IF($A56=\"\",\"\",IF($A56=\"between\",SUMIFS(Breakdowns!L:L,Breakdowns!$I:$I,\">=\"&$B56,Breakdowns!$I:$I,\"<\"&$D56,Breakdowns!$AA:$AA,\"=No\"),SUMIFS(Breakdowns!L:L,Breakdowns!$I:$I,\">=\"&$B56,Breakdowns!$AA:$AA,\"=No\"))),IF($A56=\"\",\"\",IF($A56=\"between\",SUMIFS(Breakdowns!L:L,Breakdowns!$I:$I,\">=\"&$B56,Breakdowns!$I:$I,\"<\"&$D56),SUMIFS(Breakdowns!L:L,Breakdowns!$I:$I,\">=\"&$B56))))","v":11376},{"$f":"IF($P$1,IF($A56=\"\",\"\",IF($A56=\"between\",SUMIFS(Breakdowns!M:M,Breakdowns!$I:$I,\">=\"&$B56,Breakdowns!$I:$I,\"<\"&$D56,Breakdowns!$AA:$AA,\"=No\"),SUMIFS(Breakdowns!M:M,Breakdowns!$I:$I,\">=\"&$B56,Breakdowns!$AA:$AA,\"=No\"))),IF($A56=\"\",\"\",IF($A56=\"between\",SUMIFS(Breakdowns!M:M,Breakdowns!$I:$I,\">=\"&$B56,Breakdowns!$I:$I,\"<\"&$D56),SUMIFS(Breakdowns!M:M,Breakdowns!$I:$I,\">=\"&$B56))))","v":33772},{"$f":"IF($P$1,IF($A56=\"\",\"\",IF($A56=\"between\",SUMIFS(Breakdowns!O:O,Breakdowns!$I:$I,\">=\"&$B56,Breakdowns!$I:$I,\"<\"&$D56,Breakdowns!$AA:$AA,\"=No\"),SUMIFS(Breakdowns!O:O,Breakdowns!$I:$I,\">=\"&$B56,Breakdowns!$AA:$AA,\"=No\"))),IF($A56=\"\",\"\",IF($A56=\"between\",SUMIFS(Breakdowns!O:O,Breakdowns!$I:$I,\">=\"&$B56,Breakdowns!$I:$I,\"<\"&$D56),SUMIFS(Breakdowns!O:O,Breakdowns!$I:$I,\">=\"&$B56))))","v":33347},{"$f":"IF($P$1,IF($A56=\"\",\"\",IF($A56=\"between\",SUMIFS(Breakdowns!Q:Q,Breakdowns!$I:$I,\">=\"&$B56,Breakdowns!$I:$I,\"<\"&$D56,Breakdowns!$AA:$AA,\"=No\"),SUMIFS(Breakdowns!Q:Q,Breakdowns!$I:$I,\">=\"&$B56,Breakdowns!$AA:$AA,\"=No\"))),IF($A56=\"\",\"\",IF($A56=\"between\",SUMIFS(Breakdowns!Q:Q,Breakdowns!$I:$I,\">=\"&$B56,Breakdowns!$I:$I,\"<\"&$D56),SUMIFS(Breakdowns!Q:Q,Breakdowns!$I:$I,\">=\"&$B56))))","v":67119},{"$f":"IF($P$1,IF($A56=\"\",\"\",IF($A56=\"between\",SUMIFS(Breakdowns!S:S,Breakdowns!$I:$I,\">=\"&$B56,Breakdowns!$I:$I,\"<\"&$D56,Breakdowns!$AA:$AA,\"=No\"),SUMIFS(Breakdowns!S:S,Breakdowns!$I:$I,\">=\"&$B56,Breakdowns!$AA:$AA,\"=No\"))),IF($A56=\"\",\"\",IF($A56=\"between\",SUMIFS(Breakdowns!S:S,Breakdowns!$I:$I,\">=\"&$B56,Breakdowns!$I:$I,\"<\"&$D56),SUMIFS(Breakdowns!S:S,Breakdowns!$I:$I,\">=\"&$B56))))","v":453884771},{"$f":"IF($P$1,IF($A56=\"\",\"\",IF($A56=\"between\",SUMIFS(Breakdowns!U:U,Breakdowns!$I:$I,\">=\"&$B56,Breakdowns!$I:$I,\"<\"&$D56,Breakdowns!$AA:$AA,\"=No\"),SUMIFS(Breakdowns!U:U,Breakdowns!$I:$I,\">=\"&$B56,Breakdowns!$AA:$AA,\"=No\"))),IF($A56=\"\",\"\",IF($A56=\"between\",SUMIFS(Breakdowns!U:U,Breakdowns!$I:$I,\">=\"&$B56,Breakdowns!$I:$I,\"<\"&$D56),SUMIFS(Breakdowns!U:U,Breakdowns!$I:$I,\">=\"&$B56))))","v":400056103},{"$f":"IF($P$1,IF($A56=\"\",\"\",IF($A56=\"between\",SUMIFS(Breakdowns!W:W,Breakdowns!$I:$I,\">=\"&$B56,Breakdowns!$I:$I,\"<\"&$D56,Breakdowns!$AA:$AA,\"=No\"),SUMIFS(Breakdowns!W:W,Breakdowns!$I:$I,\">=\"&$B56,Breakdowns!$AA:$AA,\"=No\"))),IF($A56=\"\",\"\",IF($A56=\"between\",SUMIFS(Breakdowns!W:W,Breakdowns!$I:$I,\">=\"&$B56,Breakdowns!$I:$I,\"<\"&$D56),SUMIFS(Breakdowns!W:W,Breakdowns!$I:$I,\">=\"&$B56))))","v":8469963},{"$f":"IF($P$1,IF($A56=\"\",\"\",IF($A56=\"between\",SUMIFS(Breakdowns!Y:Y,Breakdowns!$I:$I,\">=\"&$B56,Breakdowns!$I:$I,\"<\"&$D56,Breakdowns!$AA:$AA,\"=No\"),SUMIFS(Breakdowns!Y:Y,Breakdowns!$I:$I,\">=\"&$B56,Breakdowns!$AA:$AA,\"=No\"))),IF($A56=\"\",\"\",IF($A56=\"between\",SUMIFS(Breakdowns!Y:Y,Breakdowns!$I:$I,\">=\"&$B56,Breakdowns!$I:$I,\"<\"&$D56),SUMIFS(Breakdowns!Y:Y,Breakdowns!$I:$I,\">=\"&$B56))))","v":8239654},null,null,null,null,null,null,null,"250 to 500",12232.257894971272]
["between",250,"and",500,"between 250 and 500",{"$f":"IF($P$1,IF($A57=\"\",\"\",IF($A57=\"between\",SUMIFS(Breakdowns!L:L,Breakdowns!$I:$I,\">=\"&$B57,Breakdowns!$I:$I,\"<\"&$D57,Breakdowns!$AA:$AA,\"=No\"),SUMIFS(Breakdowns!L:L,Breakdowns!$I:$I,\">=\"&$B57,Breakdowns!$AA:$AA,\"=No\"))),IF($A57=\"\",\"\",IF($A57=\"between\",SUMIFS(Breakdowns!L:L,Breakdowns!$I:$I,\">=\"&$B57,Breakdowns!$I:$I,\"<\"&$D57),SUMIFS(Breakdowns!L:L,Breakdowns!$I:$I,\">=\"&$B57))))","v":15345},{"$f":"IF($P$1,IF($A57=\"\",\"\",IF($A57=\"between\",SUMIFS(Breakdowns!M:M,Breakdowns!$I:$I,\">=\"&$B57,Breakdowns!$I:$I,\"<\"&$D57,Breakdowns!$AA:$AA,\"=No\"),SUMIFS(Breakdowns!M:M,Breakdowns!$I:$I,\">=\"&$B57,Breakdowns!$AA:$AA,\"=No\"))),IF($A57=\"\",\"\",IF($A57=\"between\",SUMIFS(Breakdowns!M:M,Breakdowns!$I:$I,\">=\"&$B57,Breakdowns!$I:$I,\"<\"&$D57),SUMIFS(Breakdowns!M:M,Breakdowns!$I:$I,\">=\"&$B57))))","v":44902},{"$f":"IF($P$1,IF($A57=\"\",\"\",IF($A57=\"between\",SUMIFS(Breakdowns!O:O,Breakdowns!$I:$I,\">=\"&$B57,Breakdowns!$I:$I,\"<\"&$D57,Breakdowns!$AA:$AA,\"=No\"),SUMIFS(Breakdowns!O:O,Breakdowns!$I:$I,\">=\"&$B57,Breakdowns!$AA:$AA,\"=No\"))),IF($A57=\"\",\"\",IF($A57=\"between\",SUMIFS(Breakdowns!O:O,Breakdowns!$I:$I,\">=\"&$B57,Breakdowns!$I:$I,\"<\"&$D57),SUMIFS(Breakdowns!O:O,Breakdowns!$I:$I,\">=\"&$B57))))","v":39848},{"$f":"IF($P$1,IF($A57=\"\",\"\",IF($A57=\"between\",SUMIFS(Breakdowns!Q:Q,Breakdowns!$I:$I,\">=\"&$B57,Breakdowns!$I:$I,\"<\"&$D57,Breakdowns!$AA:$AA,\"=No\"),SUMIFS(Breakdowns!Q:Q,Breakdowns!$I:$I,\">=\"&$B57,Breakdowns!$AA:$AA,\"=No\"))),IF($A57=\"\",\"\",IF($A57=\"between\",SUMIFS(Breakdowns!Q:Q,Breakdowns!$I:$I,\">=\"&$B57,Breakdowns!$I:$I,\"<\"&$D57),SUMIFS(Breakdowns!Q:Q,Breakdowns!$I:$I,\">=\"&$B57))))","v":84750},{"$f":"IF($P$1,IF($A57=\"\",\"\",IF($A57=\"between\",SUMIFS(Breakdowns!S:S,Breakdowns!$I:$I,\">=\"&$B57,Breakdowns!$I:$I,\"<\"&$D57,Breakdowns!$AA:$AA,\"=No\"),SUMIFS(Breakdowns!S:S,Breakdowns!$I:$I,\">=\"&$B57,Breakdowns!$AA:$AA,\"=No\"))),IF($A57=\"\",\"\",IF($A57=\"between\",SUMIFS(Breakdowns!S:S,Breakdowns!$I:$I,\">=\"&$B57,Breakdowns!$I:$I,\"<\"&$D57),SUMIFS(Breakdowns!S:S,Breakdowns!$I:$I,\">=\"&$B57))))","v":635766692},{"$f":"IF($P$1,IF($A57=\"\",\"\",IF($A57=\"between\",SUMIFS(Breakdowns!U:U,Breakdowns!$I:$I,\">=\"&$B57,Breakdowns!$I:$I,\"<\"&$D57,Breakdowns!$AA:$AA,\"=No\"),SUMIFS(Breakdowns!U:U,Breakdowns!$I:$I,\">=\"&$B57,Breakdowns!$AA:$AA,\"=No\"))),IF($A57=\"\",\"\",IF($A57=\"between\",SUMIFS(Breakdowns!U:U,Breakdowns!$I:$I,\">=\"&$B57,Breakdowns!$I:$I,\"<\"&$D57),SUMIFS(Breakdowns!U:U,Breakdowns!$I:$I,\">=\"&$B57))))","v":549252844},{"$f":"IF($P$1,IF($A57=\"\",\"\",IF($A57=\"between\",SUMIFS(Breakdowns!W:W,Breakdowns!$I:$I,\">=\"&$B57,Breakdowns!$I:$I,\"<\"&$D57,Breakdowns!$AA:$AA,\"=No\"),SUMIFS(Breakdowns!W:W,Breakdowns!$I:$I,\">=\"&$B57,Breakdowns!$AA:$AA,\"=No\"))),IF($A57=\"\",\"\",IF($A57=\"between\",SUMIFS(Breakdowns!W:W,Breakdowns!$I:$I,\">=\"&$B57,Breakdowns!$I:$I,\"<\"&$D57),SUMIFS(Breakdowns!W:W,Breakdowns!$I:$I,\">=\"&$B57))))","v":8845520},{"$f":"IF($P$1,IF($A57=\"\",\"\",IF($A57=\"between\",SUMIFS(Breakdowns!Y:Y,Breakdowns!$I:$I,\">=\"&$B57,Breakdowns!$I:$I,\"<\"&$D57,Breakdowns!$AA:$AA,\"=No\"),SUMIFS(Breakdowns!Y:Y,Breakdowns!$I:$I,\">=\"&$B57,Breakdowns!$AA:$AA,\"=No\"))),IF($A57=\"\",\"\",IF($A57=\"between\",SUMIFS(Breakdowns!Y:Y,Breakdowns!$I:$I,\">=\"&$B57,Breakdowns!$I:$I,\"<\"&$D57),SUMIFS(Breakdowns!Y:Y,Breakdowns!$I:$I,\">=\"&$B57))))","v":8568391},null,null,null,null,null,null,null,"500 to 1,000",15511.91726101695]
["between",500,"and",1000,"between 500 and 1,000",{"$f":"IF($P$1,IF($A58=\"\",\"\",IF($A58=\"between\",SUMIFS(Breakdowns!L:L,Breakdowns!$I:$I,\">=\"&$B58,Breakdowns!$I:$I,\"<\"&$D58,Breakdowns!$AA:$AA,\"=No\"),SUMIFS(Breakdowns!L:L,Breakdowns!$I:$I,\">=\"&$B58,Breakdowns!$AA:$AA,\"=No\"))),IF($A58=\"\",\"\",IF($A58=\"between\",SUMIFS(Breakdowns!L:L,Breakdowns!$I:$I,\">=\"&$B58,Breakdowns!$I:$I,\"<\"&$D58),SUMIFS(Breakdowns!L:L,Breakdowns!$I:$I,\">=\"&$B58))))","v":15252},{"$f":"IF($P$1,IF($A58=\"\",\"\",IF($A58=\"between\",SUMIFS(Breakdowns!M:M,Breakdowns!$I:$I,\">=\"&$B58,Breakdowns!$I:$I,\"<\"&$D58,Breakdowns!$AA:$AA,\"=No\"),SUMIFS(Breakdowns!M:M,Breakdowns!$I:$I,\">=\"&$B58,Breakdowns!$AA:$AA,\"=No\"))),IF($A58=\"\",\"\",IF($A58=\"between\",SUMIFS(Breakdowns!M:M,Breakdowns!$I:$I,\">=\"&$B58,Breakdowns!$I:$I,\"<\"&$D58),SUMIFS(Breakdowns!M:M,Breakdowns!$I:$I,\">=\"&$B58))))","v":36875},{"$f":"IF($P$1,IF($A58=\"\",\"\",IF($A58=\"between\",SUMIFS(Breakdowns!O:O,Breakdowns!$I:$I,\">=\"&$B58,Breakdowns!$I:$I,\"<\"&$D58,Breakdowns!$AA:$AA,\"=No\"),SUMIFS(Breakdowns!O:O,Breakdowns!$I:$I,\">=\"&$B58,Breakdowns!$AA:$AA,\"=No\"))),IF($A58=\"\",\"\",IF($A58=\"between\",SUMIFS(Breakdowns!O:O,Breakdowns!$I:$I,\">=\"&$B58,Breakdowns!$I:$I,\"<\"&$D58),SUMIFS(Breakdowns!O:O,Breakdowns!$I:$I,\">=\"&$B58))))","v":44017},{"$f":"IF($P$1,IF($A58=\"\",\"\",IF($A58=\"between\",SUMIFS(Breakdowns!Q:Q,Breakdowns!$I:$I,\">=\"&$B58,Breakdowns!$I:$I,\"<\"&$D58,Breakdowns!$AA:$AA,\"=No\"),SUMIFS(Breakdowns!Q:Q,Breakdowns!$I:$I,\">=\"&$B58,Breakdowns!$AA:$AA,\"=No\"))),IF($A58=\"\",\"\",IF($A58=\"between\",SUMIFS(Breakdowns!Q:Q,Breakdowns!$I:$I,\">=\"&$B58,Breakdowns!$I:$I,\"<\"&$D58),SUMIFS(Breakdowns!Q:Q,Breakdowns!$I:$I,\">=\"&$B58))))","v":80892},{"$f":"IF($P$1,IF($A58=\"\",\"\",IF($A58=\"between\",SUMIFS(Breakdowns!S:S,Breakdowns!$I:$I,\">=\"&$B58,Breakdowns!$I:$I,\"<\"&$D58,Breakdowns!$AA:$AA,\"=No\"),SUMIFS(Breakdowns!S:S,Breakdowns!$I:$I,\">=\"&$B58,Breakdowns!$AA:$AA,\"=No\"))),IF($A58=\"\",\"\",IF($A58=\"between\",SUMIFS(Breakdowns!S:S,Breakdowns!$I:$I,\">=\"&$B58,Breakdowns!$I:$I,\"<\"&$D58),SUMIFS(Breakdowns!S:S,Breakdowns!$I:$I,\">=\"&$B58))))","v":647719322},{"$f":"IF($P$1,IF($A58=\"\",\"\",IF($A58=\"between\",SUMIFS(Breakdowns!U:U,Breakdowns!$I:$I,\">=\"&$B58,Breakdowns!$I:$I,\"<\"&$D58,Breakdowns!$AA:$AA,\"=No\"),SUMIFS(Breakdowns!U:U,Breakdowns!$I:$I,\">=\"&$B58,Breakdowns!$AA:$AA,\"=No\"))),IF($A58=\"\",\"\",IF($A58=\"between\",SUMIFS(Breakdowns!U:U,Breakdowns!$I:$I,\">=\"&$B58,Breakdowns!$I:$I,\"<\"&$D58),SUMIFS(Breakdowns!U:U,Breakdowns!$I:$I,\">=\"&$B58))))","v":572001949},{"$f":"IF($P$1,IF($A58=\"\",\"\",IF($A58=\"between\",SUMIFS(Breakdowns!W:W,Breakdowns!$I:$I,\">=\"&$B58,Breakdowns!$I:$I,\"<\"&$D58,Breakdowns!$AA:$AA,\"=No\"),SUMIFS(Breakdowns!W:W,Breakdowns!$I:$I,\">=\"&$B58,Breakdowns!$AA:$AA,\"=No\"))),IF($A58=\"\",\"\",IF($A58=\"between\",SUMIFS(Breakdowns!W:W,Breakdowns!$I:$I,\">=\"&$B58,Breakdowns!$I:$I,\"<\"&$D58),SUMIFS(Breakdowns!W:W,Breakdowns!$I:$I,\">=\"&$B58))))","v":30184823},{"$f":"IF($P$1,IF($A58=\"\",\"\",IF($A58=\"between\",SUMIFS(Breakdowns!Y:Y,Breakdowns!$I:$I,\">=\"&$B58,Breakdowns!$I:$I,\"<\"&$D58,Breakdowns!$AA:$AA,\"=No\"),SUMIFS(Breakdowns!Y:Y,Breakdowns!$I:$I,\">=\"&$B58,Breakdowns!$AA:$AA,\"=No\"))),IF($A58=\"\",\"\",IF($A58=\"between\",SUMIFS(Breakdowns!Y:Y,Breakdowns!$I:$I,\">=\"&$B58,Breakdowns!$I:$I,\"<\"&$D58),SUMIFS(Breakdowns!Y:Y,Breakdowns!$I:$I,\">=\"&$B58))))","v":29516701},null,null,null,null,null,null,null,"1,000 to 2,000",17365.832297961257]
["between",1000,"and",2000,"between 1,000 and 2,000",{"$f":"IF($P$1,IF($A59=\"\",\"\",IF($A59=\"between\",SUMIFS(Breakdowns!L:L,Breakdowns!$I:$I,\">=\"&$B59,Breakdowns!$I:$I,\"<\"&$D59,Breakdowns!$AA:$AA,\"=No\"),SUMIFS(Breakdowns!L:L,Breakdowns!$I:$I,\">=\"&$B59,Breakdowns!$AA:$AA,\"=No\"))),IF($A59=\"\",\"\",IF($A59=\"between\",SUMIFS(Breakdowns!L:L,Breakdowns!$I:$I,\">=\"&$B59,Breakdowns!$I:$I,\"<\"&$D59),SUMIFS(Breakdowns!L:L,Breakdowns!$I:$I,\">=\"&$B59))))","v":15440},{"$f":"IF($P$1,IF($A59=\"\",\"\",IF($A59=\"between\",SUMIFS(Breakdowns!M:M,Breakdowns!$I:$I,\">=\"&$B59,Breakdowns!$I:$I,\"<\"&$D59,Breakdowns!$AA:$AA,\"=No\"),SUMIFS(Breakdowns!M:M,Breakdowns!$I:$I,\">=\"&$B59,Breakdowns!$AA:$AA,\"=No\"))),IF($A59=\"\",\"\",IF($A59=\"between\",SUMIFS(Breakdowns!M:M,Breakdowns!$I:$I,\">=\"&$B59,Breakdowns!$I:$I,\"<\"&$D59),SUMIFS(Breakdowns!M:M,Breakdowns!$I:$I,\">=\"&$B59))))","v":35414},{"$f":"IF($P$1,IF($A59=\"\",\"\",IF($A59=\"between\",SUMIFS(Breakdowns!O:O,Breakdowns!$I:$I,\">=\"&$B59,Breakdowns!$I:$I,\"<\"&$D59,Breakdowns!$AA:$AA,\"=No\"),SUMIFS(Breakdowns!O:O,Breakdowns!$I:$I,\">=\"&$B59,Breakdowns!$AA:$AA,\"=No\"))),IF($A59=\"\",\"\",IF($A59=\"between\",SUMIFS(Breakdowns!O:O,Breakdowns!$I:$I,\">=\"&$B59,Breakdowns!$I:$I,\"<\"&$D59),SUMIFS(Breakdowns!O:O,Breakdowns!$I:$I,\">=\"&$B59))))","v":30379},{"$f":"IF($P$1,IF($A59=\"\",\"\",IF($A59=\"between\",SUMIFS(Breakdowns!Q:Q,Breakdowns!$I:$I,\">=\"&$B59,Breakdowns!$I:$I,\"<\"&$D59,Breakdowns!$AA:$AA,\"=No\"),SUMIFS(Breakdowns!Q:Q,Breakdowns!$I:$I,\">=\"&$B59,Breakdowns!$AA:$AA,\"=No\"))),IF($A59=\"\",\"\",IF($A59=\"between\",SUMIFS(Breakdowns!Q:Q,Breakdowns!$I:$I,\">=\"&$B59,Breakdowns!$I:$I,\"<\"&$D59),SUMIFS(Breakdowns!Q:Q,Breakdowns!$I:$I,\">=\"&$B59))))","v":65793},{"$f":"IF($P$1,IF($A59=\"\",\"\",IF($A59=\"between\",SUMIFS(Breakdowns!S:S,Breakdowns!$I:$I,\">=\"&$B59,Breakdowns!$I:$I,\"<\"&$D59,Breakdowns!$AA:$AA,\"=No\"),SUMIFS(Breakdowns!S:S,Breakdowns!$I:$I,\">=\"&$B59,Breakdowns!$AA:$AA,\"=No\"))),IF($A59=\"\",\"\",IF($A59=\"between\",SUMIFS(Breakdowns!S:S,Breakdowns!$I:$I,\">=\"&$B59,Breakdowns!$I:$I,\"<\"&$D59),SUMIFS(Breakdowns!S:S,Breakdowns!$I:$I,\">=\"&$B59))))","v":701856352},{"$f":"IF($P$1,IF($A59=\"\",\"\",IF($A59=\"between\",SUMIFS(Breakdowns!U:U,Breakdowns!$I:$I,\">=\"&$B59,Breakdowns!$I:$I,\"<\"&$D59,Breakdowns!$AA:$AA,\"=No\"),SUMIFS(Breakdowns!U:U,Breakdowns!$I:$I,\">=\"&$B59,Breakdowns!$AA:$AA,\"=No\"))),IF($A59=\"\",\"\",IF($A59=\"between\",SUMIFS(Breakdowns!U:U,Breakdowns!$I:$I,\">=\"&$B59,Breakdowns!$I:$I,\"<\"&$D59),SUMIFS(Breakdowns!U:U,Breakdowns!$I:$I,\">=\"&$B59))))","v":614993585},{"$f":"IF($P$1,IF($A59=\"\",\"\",IF($A59=\"between\",SUMIFS(Breakdowns!W:W,Breakdowns!$I:$I,\">=\"&$B59,Breakdowns!$I:$I,\"<\"&$D59,Breakdowns!$AA:$AA,\"=No\"),SUMIFS(Breakdowns!W:W,Breakdowns!$I:$I,\">=\"&$B59,Breakdowns!$AA:$AA,\"=No\"))),IF($A59=\"\",\"\",IF($A59=\"between\",SUMIFS(Breakdowns!W:W,Breakdowns!$I:$I,\">=\"&$B59,Breakdowns!$I:$I,\"<\"&$D59),SUMIFS(Breakdowns!W:W,Breakdowns!$I:$I,\">=\"&$B59))))","v":53164871},{"$f":"IF($P$1,IF($A59=\"\",\"\",IF($A59=\"between\",SUMIFS(Breakdowns!Y:Y,Breakdowns!$I:$I,\">=\"&$B59,Breakdowns!$I:$I,\"<\"&$D59,Breakdowns!$AA:$AA,\"=No\"),SUMIFS(Breakdowns!Y:Y,Breakdowns!$I:$I,\">=\"&$B59,Breakdowns!$AA:$AA,\"=No\"))),IF($A59=\"\",\"\",IF($A59=\"between\",SUMIFS(Breakdowns!Y:Y,Breakdowns!$I:$I,\">=\"&$B59,Breakdowns!$I:$I,\"<\"&$D59),SUMIFS(Breakdowns!Y:Y,Breakdowns!$I:$I,\">=\"&$B59))))","v":49838846},null,null,null,null,null,null,null,"over 2,000",20065.883354600257]
["over",2000,"",null,"over 2,000",{"$f":"IF($P$1,IF($A60=\"\",\"\",IF($A60=\"between\",SUMIFS(Breakdowns!L:L,Breakdowns!$I:$I,\">=\"&$B60,Breakdowns!$I:$I,\"<\"&$D60,Breakdowns!$AA:$AA,\"=No\"),SUMIFS(Breakdowns!L:L,Breakdowns!$I:$I,\">=\"&$B60,Breakdowns!$AA:$AA,\"=No\"))),IF($A60=\"\",\"\",IF($A60=\"between\",SUMIFS(Breakdowns!L:L,Breakdowns!$I:$I,\">=\"&$B60,Breakdowns!$I:$I,\"<\"&$D60),SUMIFS(Breakdowns!L:L,Breakdowns!$I:$I,\">=\"&$B60))))","v":33777},{"$f":"IF($P$1,IF($A60=\"\",\"\",IF($A60=\"between\",SUMIFS(Breakdowns!M:M,Breakdowns!$I:$I,\">=\"&$B60,Breakdowns!$I:$I,\"<\"&$D60,Breakdowns!$AA:$AA,\"=No\"),SUMIFS(Breakdowns!M:M,Breakdowns!$I:$I,\">=\"&$B60,Breakdowns!$AA:$AA,\"=No\"))),IF($A60=\"\",\"\",IF($A60=\"between\",SUMIFS(Breakdowns!M:M,Breakdowns!$I:$I,\">=\"&$B60,Breakdowns!$I:$I,\"<\"&$D60),SUMIFS(Breakdowns!M:M,Breakdowns!$I:$I,\">=\"&$B60))))","v":68181},{"$f":"IF($P$1,IF($A60=\"\",\"\",IF($A60=\"between\",SUMIFS(Breakdowns!O:O,Breakdowns!$I:$I,\">=\"&$B60,Breakdowns!$I:$I,\"<\"&$D60,Breakdowns!$AA:$AA,\"=No\"),SUMIFS(Breakdowns!O:O,Breakdowns!$I:$I,\">=\"&$B60,Breakdowns!$AA:$AA,\"=No\"))),IF($A60=\"\",\"\",IF($A60=\"between\",SUMIFS(Breakdowns!O:O,Breakdowns!$I:$I,\">=\"&$B60,Breakdowns!$I:$I,\"<\"&$D60),SUMIFS(Breakdowns!O:O,Breakdowns!$I:$I,\">=\"&$B60))))","v":74775},{"$f":"IF($P$1,IF($A60=\"\",\"\",IF($A60=\"between\",SUMIFS(Breakdowns!Q:Q,Breakdowns!$I:$I,\">=\"&$B60,Breakdowns!$I:$I,\"<\"&$D60,Breakdowns!$AA:$AA,\"=No\"),SUMIFS(Breakdowns!Q:Q,Breakdowns!$I:$I,\">=\"&$B60,Breakdowns!$AA:$AA,\"=No\"))),IF($A60=\"\",\"\",IF($A60=\"between\",SUMIFS(Breakdowns!Q:Q,Breakdowns!$I:$I,\">=\"&$B60,Breakdowns!$I:$I,\"<\"&$D60),SUMIFS(Breakdowns!Q:Q,Breakdowns!$I:$I,\">=\"&$B60))))","v":142956},{"$f":"IF($P$1,IF($A60=\"\",\"\",IF($A60=\"between\",SUMIFS(Breakdowns!S:S,Breakdowns!$I:$I,\">=\"&$B60,Breakdowns!$I:$I,\"<\"&$D60,Breakdowns!$AA:$AA,\"=No\"),SUMIFS(Breakdowns!S:S,Breakdowns!$I:$I,\">=\"&$B60,Breakdowns!$AA:$AA,\"=No\"))),IF($A60=\"\",\"\",IF($A60=\"between\",SUMIFS(Breakdowns!S:S,Breakdowns!$I:$I,\">=\"&$B60,Breakdowns!$I:$I,\"<\"&$D60),SUMIFS(Breakdowns!S:S,Breakdowns!$I:$I,\">=\"&$B60))))","v":1515425094},{"$f":"IF($P$1,IF($A60=\"\",\"\",IF($A60=\"between\",SUMIFS(Breakdowns!U:U,Breakdowns!$I:$I,\">=\"&$B60,Breakdowns!$I:$I,\"<\"&$D60,Breakdowns!$AA:$AA,\"=No\"),SUMIFS(Breakdowns!U:U,Breakdowns!$I:$I,\">=\"&$B60,Breakdowns!$AA:$AA,\"=No\"))),IF($A60=\"\",\"\",IF($A60=\"between\",SUMIFS(Breakdowns!U:U,Breakdowns!$I:$I,\">=\"&$B60,Breakdowns!$I:$I,\"<\"&$D60),SUMIFS(Breakdowns!U:U,Breakdowns!$I:$I,\">=\"&$B60))))","v":1368111993},{"$f":"IF($P$1,IF($A60=\"\",\"\",IF($A60=\"between\",SUMIFS(Breakdowns!W:W,Breakdowns!$I:$I,\">=\"&$B60,Breakdowns!$I:$I,\"<\"&$D60,Breakdowns!$AA:$AA,\"=No\"),SUMIFS(Breakdowns!W:W,Breakdowns!$I:$I,\">=\"&$B60,Breakdowns!$AA:$AA,\"=No\"))),IF($A60=\"\",\"\",IF($A60=\"between\",SUMIFS(Breakdowns!W:W,Breakdowns!$I:$I,\">=\"&$B60,Breakdowns!$I:$I,\"<\"&$D60),SUMIFS(Breakdowns!W:W,Breakdowns!$I:$I,\">=\"&$B60))))","v":111232603},{"$f":"IF($P$1,IF($A60=\"\",\"\",IF($A60=\"between\",SUMIFS(Breakdowns!Y:Y,Breakdowns!$I:$I,\">=\"&$B60,Breakdowns!$I:$I,\"<\"&$D60,Breakdowns!$AA:$AA,\"=No\"),SUMIFS(Breakdowns!Y:Y,Breakdowns!$I:$I,\">=\"&$B60,Breakdowns!$AA:$AA,\"=No\"))),IF($A60=\"\",\"\",IF($A60=\"between\",SUMIFS(Breakdowns!Y:Y,Breakdowns!$I:$I,\">=\"&$B60,Breakdowns!$I:$I,\"<\"&$D60),SUMIFS(Breakdowns!Y:Y,Breakdowns!$I:$I,\">=\"&$B60))))","v":107942884}]
[null,null,null,null,null,null,null,null,null,null,null,null,null,null,null,null,null,null,null,null,{"$f":"IFERROR(U51&\": \"&FIXED(V51,0,0)&CHAR(10),\"\")&IFERROR(U52&\": \"&FIXED(V52,0,0)&CHAR(10),\"\")&IFERROR(U53&\": \"&FIXED(V53,0,0)&CHAR(10),\"\")&IFERROR(U54&\": \"&FIXED(V54,0,0)&CHAR(10),\"\")&IFERROR(U55&\": \"&FIXED(V55,0,0)&CHAR(10),\"\")&IFERROR(U56&\": \"&FIXED(V56,0,0)&CHAR(10),\"\")&IFERROR(U57&\": \"&FIXED(V57,0,0)&CHAR(10),\"\")&IFERROR(U58&\": \"&FIXED(V58,0,0)&CHAR(10),\"\")&IFERROR(U59&\": \"&FIXED(V59,0,0),\"\")","v":"under 10: 18,922\n10 to 25: 13,422\n25 to 50: 17,533\n50 to 100: 17,293\n100 to 250: 11,846\n250 to 500: 12,232\n500 to 1,000: 15,512\n1,000 to 2,000: 17,366\nover 2,000: 20,066"}]
[]
[]
["By State"]
["Abbreviation","State","Column1","Column2","Column3","VOMS","Major Mechanical Failures","Other Mechanical Failures","Total Mechanical Failures","Vehicle/Passenger Car Miles","Vehicle/Passenger Car Revenue Miles","Train Miles","Train Revenue Miles"]
["AK","Alaska",null,null,null,{"$f":"IF($P$1,SUMIFS(Breakdowns!L:L,Breakdowns!$C:$C,\"=\"&$A66,Breakdowns!$AA:$AA,\"=No\"),SUMIFS(Breakdowns!L:L,Breakdowns!$C:$C,\"=\"&$A66))","v":191},{"$f":"IF($P$1,SUMIFS(Breakdowns!M:M,Breakdowns!$C:$C,\"=\"&$A66,Breakdowns!$AA:$AA,\"=No\"),SUMIFS(Breakdowns!M:M,Breakdowns!$C:$C,\"=\"&$A66))","v":536},{"$f":"IF($P$1,SUMIFS(Breakdowns!O:O,Breakdowns!$C:$C,\"=\"&$A66,Breakdowns!$AA:$AA,\"=No\"),SUMIFS(Breakdowns!O:O,Breakdowns!$C:$C,\"=\"&$A66))","v":319},{"$f":"IF($P$1,SUMIFS(Breakdowns!Q:Q,Breakdowns!$C:$C,\"=\"&$A66,Breakdowns!$AA:$AA,\"=No\"),SUMIFS(Breakdowns!Q:Q,Breakdowns!$C:$C,\"=\"&$A66))","v":855},{"$f":"IF($P$1,SUMIFS(Breakdowns!S:S,Breakdowns!$C:$C,\"=\"&$A66,Breakdowns!$AA:$AA,\"=No\"),SUMIFS(Breakdowns!S:S,Breakdowns!$C:$C,\"=\"&$A66))","v":5650467},{"$f":"IF($P$1,SUMIFS(Breakdowns!U:U,Breakdowns!$C:$C,\"=\"&$A66,Breakdowns!$AA:$AA,\"=No\"),SUMIFS(Breakdowns!U:U,Breakdowns!$C:$C,\"=\"&$A66))","v":5288797},{"$f":"IF($P$1,SUMIFS(Breakdowns!W:W,Breakdowns!$C:$C,\"=\"&$A66,Breakdowns!$AA:$AA,\"=No\"),SUMIFS(Breakdowns!W:W,Breakdowns!$C:$C,\"=\"&$A66))","v":187671},{"$f":"IF($P$1,SUMIFS(Breakdowns!Y:Y,Breakdowns!$C:$C,\"=\"&$A66,Breakdowns!$AA:$AA,\"=No\"),SUMIFS(Breakdowns!Y:Y,Breakdowns!$C:$C,\"=\"&$A66))","v":187447}]
["AL","Alabama",null,null,null,{"$f":"IF($P$1,SUMIFS(Breakdowns!L:L,Breakdowns!$C:$C,\"=\"&$A67,Breakdowns!$AA:$AA,\"=No\"),SUMIFS(Breakdowns!L:L,Breakdowns!$C:$C,\"=\"&$A67))","v":353},{"$f":"IF($P$1,SUMIFS(Breakdowns!M:M,Breakdowns!$C:$C,\"=\"&$A67,Breakdowns!$AA:$AA,\"=No\"),SUMIFS(Breakdowns!M:M,Breakdowns!$C:$C,\"=\"&$A67))","v":1574},{"$f":"IF($P$1,SUMIFS(Breakdowns!O:O,Breakdowns!$C:$C,\"=\"&$A67,Breakdowns!$AA:$AA,\"=No\"),SUMIFS(Breakdowns!O:O,Breakdowns!$C:$C,\"=\"&$A67))","v":1566},{"$f":"IF($P$1,SUMIFS(Breakdowns!Q:Q,Breakdowns!$C:$C,\"=\"&$A67,Breakdowns!$AA:$AA,\"=No\"),SUMIFS(Breakdowns!Q:Q,Breakdowns!$C:$C,\"=\"&$A67))","v":3140},{"$f":"IF($P$1,SUMIFS(Breakdowns!S:S,Breakdowns!$C:$C,\"=\"&$A67,Breakdowns!$AA:$AA,\"=No\"),SUMIFS(Breakdowns!S:S,Breakdowns!$C:$C,\"=\"&$A67))","v":12201443},{"$f":"IF($P$1,SUMIFS(Breakdowns!U:U,Breakdowns!$C:$C,\"=\"&$A67,Breakdowns!$AA:$AA,\"=No\"),SUMIFS(Breakdowns!U:U,Breakdowns!$C:$C,\"=\"&$A67))","v":11109838},{"$f":"IF($P$1,SUMIFS(Breakdowns!W:W,Breakdowns!$C:$C,\"=\"&$A67,Breakdowns!$AA:$AA,\"=No\"),SUMIFS(Breakdowns!W:W,Breakdowns!$C:$C,\"=\"&$A67))","v":0},{"$f":"IF($P$1,SUMIFS(Breakdowns!Y:Y,Breakdowns!$C:$C,\"=\"&$A67,Breakdowns!$AA:$AA,\"=No\"),SUMIFS(Breakdowns!Y:Y,Breakdowns!$C:$C,\"=\"&$A67))","v":0}]
["AR","Arkansas",null,null,null,{"$f":"IF($P$1,SUMIFS(Breakdowns!L:L,Breakdowns!$C:$C,\"=\"&$A68,Breakdowns!$AA:$AA,\"=No\"),SUMIFS(Breakdowns!L:L,Breakdowns!$C:$C,\"=\"&$A68))","v":99},{"$f":"IF($P$1,SUMIFS(Breakdowns!M:M,Breakdowns!$C:$C,\"=\"&$A68,Breakdowns!$AA:$AA,\"=No\"),SUMIFS(Breakdowns!M:M,Breakdowns!$C:$C,\"=\"&$A68))","v":175},{"$f":"IF($P$1,SUMIFS(Breakdowns!O:O,Breakdowns!$C:$C,\"=\"&$A68,Breakdowns!$AA:$AA,\"=No\"),SUMIFS(Breakdowns!O:O,Breakdowns!$C:$C,\"=\"&$A68))","v":342},{"$f":"IF($P$1,SUMIFS(Breakdowns!Q:Q,Breakdowns!$C:$C,\"=\"&$A68,Breakdowns!$AA:$AA,\"=No\"),SUMIFS(Breakdowns!Q:Q,Breakdowns!$C:$C,\"=\"&$A68))","v":517},{"$f":"IF($P$1,SUMIFS(Breakdowns!S:S,Breakdowns!$C:$C,\"=\"&$A68,Breakdowns!$AA:$AA,\"=No\"),SUMIFS(Breakdowns!S:S,Breakdowns!$C:$C,\"=\"&$A68))","v":4704749},{"$f":"IF($P$1,SUMIFS(Breakdowns!U:U,Breakdowns!$C:$C,\"=\"&$A68,Breakdowns!$AA:$AA,\"=No\"),SUMIFS(Breakdowns!U:U,Breakdowns!$C:$C,\"=\"&$A68))","v":4326833},{"$f":"IF($P$1,SUMIFS(Breakdowns!W:W,Breakdowns!$C:$C,\"=\"&$A68,Breakdowns!$AA:$AA,\"=No\"),SUMIFS(Breakdowns!W:W,Breakdowns!$C:$C,\"=\"&$A68))","v":52112},{"$f":"IF($P$1,SUMIFS(Breakdowns!Y:Y,Breakdowns!$C:$C,\"=\"&$A68,Breakdowns!$AA:$AA,\"=No\"),SUMIFS(Breakdowns!Y:Y,Breakdowns!$C:$C,\"=\"&$A68))","v":52112}]
["AS","American Samoa",null,null,null,{"$f":"IF($P$1,SUMIFS(Breakdowns!L:L,Breakdowns!$C:$C,\"=\"&$A69,Breakdowns!$AA:$AA,\"=No\"),SUMIFS(Breakdowns!L:L,Breakdowns!$C:$C,\"=\"&$A69))","v":0},{"$f":"IF($P$1,SUMIFS(Breakdowns!M:M,Breakdowns!$C:$C,\"=\"&$A69,Breakdowns!$AA:$AA,\"=No\"),SUMIFS(Breakdowns!M:M,Breakdowns!$C:$C,\"=\"&$A69))","v":0},{"$f":"IF($P$1,SUMIFS(Breakdowns!O:O,Breakdowns!$C:$C,\"=\"&$A69,Breakdowns!$AA:$AA,\"=No\"),SUMIFS(Breakdowns!O:O,Breakdowns!$C:$C,\"=\"&$A69))","v":0},{"$f":"IF($P$1,SUMIFS(Breakdowns!Q:Q,Breakdowns!$C:$C,\"=\"&$A69,Breakdowns!$AA:$AA,\"=No\"),SUMIFS(Breakdowns!Q:Q,Breakdowns!$C:$C,\"=\"&$A69))","v":0},{"$f":"IF($P$1,SUMIFS(Breakdowns!S:S,Breakdowns!$C:$C,\"=\"&$A69,Breakdowns!$AA:$AA,\"=No\"),SUMIFS(Breakdowns!S:S,Breakdowns!$C:$C,\"=\"&$A69))","v":0},{"$f":"IF($P$1,SUMIFS(Breakdowns!U:U,Breakdowns!$C:$C,\"=\"&$A69,Breakdowns!$AA:$AA,\"=No\"),SUMIFS(Breakdowns!U:U,Breakdowns!$C:$C,\"=\"&$A69))","v":0},{"$f":"IF($P$1,SUMIFS(Breakdowns!W:W,Breakdowns!$C:$C,\"=\"&$A69,Breakdowns!$AA:$AA,\"=No\"),SUMIFS(Breakdowns!W:W,Breakdowns!$C:$C,\"=\"&$A69))","v":0},{"$f":"IF($P$1,SUMIFS(Breakdowns!Y:Y,Breakdowns!$C:$C,\"=\"&$A69,Breakdowns!$AA:$AA,\"=No\"),SUMIFS(Breakdowns!Y:Y,Breakdowns!$C:$C,\"=\"&$A69))","v":0}]
["AZ","Arizona",null,null,null,{"$f":"IF($P$1,SUMIFS(Breakdowns!L:L,Breakdowns!$C:$C,\"=\"&$A70,Breakdowns!$AA:$AA,\"=No\"),SUMIFS(Breakdowns!L:L,Breakdowns!$C:$C,\"=\"&$A70))","v":1762},{"$f":"IF($P$1,SUMIFS(Breakdowns!M:M,Breakdowns!$C:$C,\"=\"&$A70,Breakdowns!$AA:$AA,\"=No\"),SUMIFS(Breakdowns!M:M,Breakdowns!$C:$C,\"=\"&$A70))","v":5822},{"$f":"IF($P$1,SUMIFS(Breakdowns!O:O,Breakdowns!$C:$C,\"=\"&$A70,Breakdowns!$AA:$AA,\"=No\"),SUMIFS(Breakdowns!O:O,Breakdowns!$C:$C,\"=\"&$A70))","v":2409},{"$f":"IF($P$1,SUMIFS(Breakdowns!Q:Q,Breakdowns!$C:$C,\"=\"&$A70,Breakdowns!$AA:$AA,\"=No\"),SUMIFS(Breakdowns!Q:Q,Breakdowns!$C:$C,\"=\"&$A70))","v":8231},{"$f":"IF($P$1,SUMIFS(Breakdowns!S:S,Breakdowns!$C:$C,\"=\"&$A70,Breakdowns!$AA:$AA,\"=No\"),SUMIFS(Breakdowns!S:S,Breakdowns!$C:$C,\"=\"&$A70))","v":67286420},{"$f":"IF($P$1,SUMIFS(Breakdowns!U:U,Breakdowns!$C:$C,\"=\"&$A70,Breakdowns!$AA:$AA,\"=No\"),SUMIFS(Breakdowns!U:U,Breakdowns!$C:$C,\"=\"&$A70))","v":57522915},{"$f":"IF($P$1,SUMIFS(Breakdowns!W:W,Breakdowns!$C:$C,\"=\"&$A70,Breakdowns!$AA:$AA,\"=No\"),SUMIFS(Breakdowns!W:W,Breakdowns!$C:$C,\"=\"&$A70))","v":1676807},{"$f":"IF($P$1,SUMIFS(Breakdowns!Y:Y,Breakdowns!$C:$C,\"=\"&$A70,Breakdowns!$AA:$AA,\"=No\"),SUMIFS(Breakdowns!Y:Y,Breakdowns!$C:$C,\"=\"&$A70))","v":1649876}]
["CA","California",null,null,null,{"$f":"IF($P$1,SUMIFS(Breakdowns!L:L,Breakdowns!$C:$C,\"=\"&$A71,Breakdowns!$AA:$AA,\"=No\"),SUMIFS(Breakdowns!L:L,Breakdowns!$C:$C,\"=\"&$A71))","v":16728},{"$f":"IF($P$1,SUMIFS(Breakdowns!M:M,Breakdowns!$C:$C,\"=\"&$A71,Breakdowns!$AA:$AA,\"=No\"),SUMIFS(Breakdowns!M:M,Breakdowns!$C:$C,\"=\"&$A71))","v":36558},{"$f":"IF($P$1,SUMIFS(Breakdowns!O:O,Breakdowns!$C:$C,\"=\"&$A71,Breakdowns!$AA:$AA,\"=No\"),SUMIFS(Breakdowns!O:O,Breakdowns!$C:$C,\"=\"&$A71))","v":34316},{"$f":"IF($P$1,SUMIFS(Breakdowns!Q:Q,Breakdowns!$C:$C,\"=\"&$A71,Breakdowns!$AA:$AA,\"=No\"),SUMIFS(Breakdowns!Q:Q,Breakdowns!$C:$C,\"=\"&$A71))","v":70874},{"$f":"IF($P$1,SUMIFS(Breakdowns!S:S,Breakdowns!$C:$C,\"=\"&$A71,Breakdowns!$AA:$AA,\"=No\"),SUMIFS(Breakdowns!S:S,Breakdowns!$C:$C,\"=\"&$A71))","v":707921547},{"$f":"IF($P$1,SUMIFS(Breakdowns!U:U,Breakdowns!$C:$C,\"=\"&$A71,Breakdowns!$AA:$AA,\"=No\"),SUMIFS(Breakdowns!U:U,Breakdowns!$C:$C,\"=\"&$A71))","v":629538127},{"$f":"IF($P$1,SUMIFS(Breakdowns!W:W,Breakdowns!$C:$C,\"=\"&$A71,Breakdowns!$AA:$AA,\"=No\"),SUMIFS(Breakdowns!W:W,Breakdowns!$C:$C,\"=\"&$A71))","v":34273500},{"$f":"IF($P$1,SUMIFS(Breakdowns!Y:Y,Breakdowns!$C:$C,\"=\"&$A71,Breakdowns!$AA:$AA,\"=No\"),SUMIFS(Breakdowns!Y:Y,Breakdowns!$C:$C,\"=\"&$A71))","v":33409060}]
["CO","Colorado",null,null,null,{"$f":"IF($P$1,SUMIFS(Breakdowns!L:L,Breakdowns!$C:$C,\"=\"&$A72,Breakdowns!$AA:$AA,\"=No\"),SUMIFS(Breakdowns!L:L,Breakdowns!$C:$C,\"=\"&$A72))","v":1869},{"$f":"IF($P$1,SUMIFS(Breakdowns!M:M,Breakdowns!$C:$C,\"=\"&$A72,Breakdowns!$AA:$AA,\"=No\"),SUMIFS(Breakdowns!M:M,Breakdowns!$C:$C,\"=\"&$A72))","v":1757},{"$f":"IF($P$1,SUMIFS(Breakdowns!O:O,Breakdowns!$C:$C,\"=\"&$A72,Breakdowns!$AA:$AA,\"=No\"),SUMIFS(Breakdowns!O:O,Breakdowns!$C:$C,\"=\"&$A72))","v":1837},{"$f":"IF($P$1,SUMIFS(Breakdowns!Q:Q,Breakdowns!$C:$C,\"=\"&$A72,Breakdowns!$AA:$AA,\"=No\"),SUMIFS(Breakdowns!Q:Q,Breakdowns!$C:$C,\"=\"&$A72))","v":3594},{"$f":"IF($P$1,SUMIFS(Breakdowns!S:S,Breakdowns!$C:$C,\"=\"&$A72,Breakdowns!$AA:$AA,\"=No\"),SUMIFS(Breakdowns!S:S,Breakdowns!$C:$C,\"=\"&$A72))","v":82699684},{"$f":"IF($P$1,SUMIFS(Breakdowns!U:U,Breakdowns!$C:$C,\"=\"&$A72,Breakdowns!$AA:$AA,\"=No\"),SUMIFS(Breakdowns!U:U,Breakdowns!$C:$C,\"=\"&$A72))","v":71513884},{"$f":"IF($P$1,SUMIFS(Breakdowns!W:W,Breakdowns!$C:$C,\"=\"&$A72,Breakdowns!$AA:$AA,\"=No\"),SUMIFS(Breakdowns!W:W,Breakdowns!$C:$C,\"=\"&$A72))","v":5066108},{"$f":"IF($P$1,SUMIFS(Breakdowns!Y:Y,Breakdowns!$C:$C,\"=\"&$A72,Breakdowns!$AA:$AA,\"=No\"),SUMIFS(Breakdowns!Y:Y,Breakdowns!$C:$C,\"=\"&$A72))","v":4820123}]
["CT","Connecticut",null,null,null,{"$f":"IF($P$1,SUMIFS(Breakdowns!L:L,Breakdowns!$C:$C,\"=\"&$A73,Breakdowns!$AA:$AA,\"=No\"),SUMIFS(Breakdowns!L:L,Breakdowns!$C:$C,\"=\"&$A73))","v":1010},{"$f":"IF($P$1,SUMIFS(Breakdowns!M:M,Breakdowns!$C:$C,\"=\"&$A73,Breakdowns!$AA:$AA,\"=No\"),SUMIFS(Breakdowns!M:M,Breakdowns!$C:$C,\"=\"&$A73))","v":2122},{"$f":"IF($P$1,SUMIFS(Breakdowns!O:O,Breakdowns!$C:$C,\"=\"&$A73,Breakdowns!$AA:$AA,\"=No\"),SUMIFS(Breakdowns!O:O,Breakdowns!$C:$C,\"=\"&$A73))","v":10442},{"$f":"IF($P$1,SUMIFS(Breakdowns!Q:Q,Breakdowns!$C:$C,\"=\"&$A73,Breakdowns!$AA:$AA,\"=No\"),SUMIFS(Breakdowns!Q:Q,Breakdowns!$C:$C,\"=\"&$A73))","v":12564},{"$f":"IF($P$1,SUMIFS(Breakdowns!S:S,Breakdowns!$C:$C,\"=\"&$A73,Breakdowns!$AA:$AA,\"=No\"),SUMIFS(Breakdowns!S:S,Breakdowns!$C:$C,\"=\"&$A73))","v":39476491},{"$f":"IF($P$1,SUMIFS(Breakdowns!U:U,Breakdowns!$C:$C,\"=\"&$A73,Breakdowns!$AA:$AA,\"=No\"),SUMIFS(Breakdowns!U:U,Breakdowns!$C:$C,\"=\"&$A73))","v":34222484},{"$f":"IF($P$1,SUMIFS(Breakdowns!W:W,Breakdowns!$C:$C,\"=\"&$A73,Breakdowns!$AA:$AA,\"=No\"),SUMIFS(Breakdowns!W:W,Breakdowns!$C:$C,\"=\"&$A73))","v":613281},{"$f":"IF($P$1,SUMIFS(Breakdowns!Y:Y,Breakdowns!$C:$C,\"=\"&$A73,Breakdowns!$AA:$AA,\"=No\"),SUMIFS(Breakdowns!Y:Y,Breakdowns!$C:$C,\"=\"&$A73))","v":495368}]
["DC","District of Columbia",null,null,null,{"$f":"IF($P$1,SUMIFS(Breakdowns!L:L,Breakdowns!$C:$C,\"=\"&$A74,Breakdowns!$AA:$AA,\"=No\"),SUMIFS(Breakdowns!L:L,Breakdowns!$C:$C,\"=\"&$A74))","v":2954},{"$f":"IF($P$1,SUMIFS(Breakdowns!M:M,Breakdowns!$C:$C,\"=\"&$A74,Breakdowns!$AA:$AA,\"=No\"),SUMIFS(Breakdowns!M:M,Breakdowns!$C:$C,\"=\"&$A74))","v":6897},{"$f":"IF($P$1,SUMIFS(Breakdowns!O:O,Breakdowns!$C:$C,\"=\"&$A74,Breakdowns!$AA:$AA,\"=No\"),SUMIFS(Breakdowns!O:O,Breakdowns!$C:$C,\"=\"&$A74))","v":2640},{"$f":"IF($P$1,SUMIFS(Breakdowns!Q:Q,Breakdowns!$C:$C,\"=\"&$A74,Breakdowns!$AA:$AA,\"=No\"),SUMIFS(Breakdowns!Q:Q,Breakdowns!$C:$C,\"=\"&$A74))","v":9537},{"$f":"IF($P$1,SUMIFS(Breakdowns!S:S,Breakdowns!$C:$C,\"=\"&$A74,Breakdowns!$AA:$AA,\"=No\"),SUMIFS(Breakdowns!S:S,Breakdowns!$C:$C,\"=\"&$A74))","v":155485957},{"$f":"IF($P$1,SUMIFS(Breakdowns!U:U,Breakdowns!$C:$C,\"=\"&$A74,Breakdowns!$AA:$AA,\"=No\"),SUMIFS(Breakdowns!U:U,Breakdowns!$C:$C,\"=\"&$A74))","v":137546203},{"$f":"IF($P$1,SUMIFS(Breakdowns!W:W,Breakdowns!$C:$C,\"=\"&$A74,Breakdowns!$AA:$AA,\"=No\"),SUMIFS(Breakdowns!W:W,Breakdowns!$C:$C,\"=\"&$A74))","v":12903321},{"$f":"IF($P$1,SUMIFS(Breakdowns!Y:Y,Breakdowns!$C:$C,\"=\"&$A74,Breakdowns!$AA:$AA,\"=No\"),SUMIFS(Breakdowns!Y:Y,Breakdowns!$C:$C,\"=\"&$A74))","v":12394629}]
["DE","Delaware",null,null,null,{"$f":"IF($P$1,SUMIFS(Breakdowns!L:L,Breakdowns!$C:$C,\"=\"&$A75,Breakdowns!$AA:$AA,\"=No\"),SUMIFS(Breakdowns!L:L,Breakdowns!$C:$C,\"=\"&$A75))","v":481},{"$f":"IF($P$1,SUMIFS(Breakdowns!M:M,Breakdowns!$C:$C,\"=\"&$A75,Breakdowns!$AA:$AA,\"=No\"),SUMIFS(Breakdowns!M:M,Breakdowns!$C:$C,\"=\"&$A75))","v":1031},{"$f":"IF($P$1,SUMIFS(Breakdowns!O:O,Breakdowns!$C:$C,\"=\"&$A75,Breakdowns!$AA:$AA,\"=No\"),SUMIFS(Breakdowns!O:O,Breakdowns!$C:$C,\"=\"&$A75))","v":579},{"$f":"IF($P$1,SUMIFS(Breakdowns!Q:Q,Breakdowns!$C:$C,\"=\"&$A75,Breakdowns!$AA:$AA,\"=No\"),SUMIFS(Breakdowns!Q:Q,Breakdowns!$C:$C,\"=\"&$A75))","v":1610},{"$f":"IF($P$1,SUMIFS(Breakdowns!S:S,Breakdowns!$C:$C,\"=\"&$A75,Breakdowns!$AA:$AA,\"=No\"),SUMIFS(Breakdowns!S:S,Breakdowns!$C:$C,\"=\"&$A75))","v":18529304},{"$f":"IF($P$1,SUMIFS(Breakdowns!U:U,Breakdowns!$C:$C,\"=\"&$A75,Breakdowns!$AA:$AA,\"=No\"),SUMIFS(Breakdowns!U:U,Breakdowns!$C:$C,\"=\"&$A75))","v":16213215},{"$f":"IF($P$1,SUMIFS(Breakdowns!W:W,Breakdowns!$C:$C,\"=\"&$A75,Breakdowns!$AA:$AA,\"=No\"),SUMIFS(Breakdowns!W:W,Breakdowns!$C:$C,\"=\"&$A75))","v":0},{"$f":"IF($P$1,SUMIFS(Breakdowns!Y:Y,Breakdowns!$C:$C,\"=\"&$A75,Breakdowns!$AA:$AA,\"=No\"),SUMIFS(Breakdowns!Y:Y,Breakdowns!$C:$C,\"=\"&$A75))","v":0}]
["FL","Florida",null,null,null,{"$f":"IF($P$1,SUMIFS(Breakdowns!L:L,Breakdowns!$C:$C,\"=\"&$A76,Breakdowns!$AA:$AA,\"=No\"),SUMIFS(Breakdowns!L:L,Breakdowns!$C:$C,\"=\"&$A76))","v":5056},{"$f":"IF($P$1,SUMIFS(Breakdowns!M:M,Breakdowns!$C:$C,\"=\"&$A76,Breakdowns!$AA:$AA,\"=No\"),SUMIFS(Breakdowns!M:M,Breakdowns!$C:$C,\"=\"&$A76))","v":20804},{"$f":"IF($P$1,SUMIFS(Breakdowns!O:O,Breakdowns!$C:$C,\"=\"&$A76,Breakdowns!$AA:$AA,\"=No\"),SUMIFS(Breakdowns!O:O,Breakdowns!$C:$C,\"=\"&$A76))","v":17740},{"$f":"IF($P$1,SUMIFS(Breakdowns!Q:Q,Breakdowns!$C:$C,\"=\"&$A76,Breakdowns!$AA:$AA,\"=No\"),SUMIFS(Breakdowns!Q:Q,Breakdowns!$C:$C,\"=\"&$A76))","v":38544},{"$f":"IF($P$1,SUMIFS(Breakdowns!S:S,Breakdowns!$C:$C,\"=\"&$A76,Breakdowns!$AA:$AA,\"=No\"),SUMIFS(Breakdowns!S:S,Breakdowns!$C:$C,\"=\"&$A76))","v":234686207},{"$f":"IF($P$1,SUMIFS(Breakdowns!U:U,Breakdowns!$C:$C,\"=\"&$A76,Breakdowns!$AA:$AA,\"=No\"),SUMIFS(Breakdowns!U:U,Breakdowns!$C:$C,\"=\"&$A76))","v":207695412},{"$f":"IF($P$1,SUMIFS(Breakdowns!W:W,Breakdowns!$C:$C,\"=\"&$A76,Breakdowns!$AA:$AA,\"=No\"),SUMIFS(Breakdowns!W:W,Breakdowns!$C:$C,\"=\"&$A76))","v":4659187},{"$f":"IF($P$1,SUMIFS(Breakdowns!Y:Y,Breakdowns!$C:$C,\"=\"&$A76,Breakdowns!$AA:$AA,\"=No\"),SUMIFS(Breakdowns!Y:Y,Breakdowns!$C:$C,\"=\"&$A76))","v":4480821}]
["GA","Georgia",null,null,null,{"$f":"IF($P$1,SUMIFS(Breakdowns!L:L,Breakdowns!$C:$C,\"=\"&$A77,Breakdowns!$AA:$AA,\"=No\"),SUMIFS(Breakdowns!L:L,Breakdowns!$C:$C,\"=\"&$A77))","v":1888},{"$f":"IF($P$1,SUMIFS(Breakdowns!M:M,Breakdowns!$C:$C,\"=\"&$A77,Breakdowns!$AA:$AA,\"=No\"),SUMIFS(Breakdowns!M:M,Breakdowns!$C:$C,\"=\"&$A77))","v":7118},{"$f":"IF($P$1,SUMIFS(Breakdowns!O:O,Breakdowns!$C:$C,\"=\"&$A77,Breakdowns!$AA:$AA,\"=No\"),SUMIFS(Breakdowns!O:O,Breakdowns!$C:$C,\"=\"&$A77))","v":3061},{"$f":"IF($P$1,SUMIFS(Breakdowns!Q:Q,Breakdowns!$C:$C,\"=\"&$A77,Breakdowns!$AA:$AA,\"=No\"),SUMIFS(Breakdowns!Q:Q,Breakdowns!$C:$C,\"=\"&$A77))","v":10179},{"$f":"IF($P$1,SUMIFS(Breakdowns!S:S,Breakdowns!$C:$C,\"=\"&$A77,Breakdowns!$AA:$AA,\"=No\"),SUMIFS(Breakdowns!S:S,Breakdowns!$C:$C,\"=\"&$A77))","v":86334669},{"$f":"IF($P$1,SUMIFS(Breakdowns!U:U,Breakdowns!$C:$C,\"=\"&$A77,Breakdowns!$AA:$AA,\"=No\"),SUMIFS(Breakdowns!U:U,Breakdowns!$C:$C,\"=\"&$A77))","v":76368559},{"$f":"IF($P$1,SUMIFS(Breakdowns!W:W,Breakdowns!$C:$C,\"=\"&$A77,Breakdowns!$AA:$AA,\"=No\"),SUMIFS(Breakdowns!W:W,Breakdowns!$C:$C,\"=\"&$A77))","v":4106228},{"$f":"IF($P$1,SUMIFS(Breakdowns!Y:Y,Breakdowns!$C:$C,\"=\"&$A77,Breakdowns!$AA:$AA,\"=No\"),SUMIFS(Breakdowns!Y:Y,Breakdowns!$C:$C,\"=\"&$A77))","v":3998305}]
["GU","Guam",null,null,null,{"$f":"IF($P$1,SUMIFS(Breakdowns!L:L,Breakdowns!$C:$C,\"=\"&$A78,Breakdowns!$AA:$AA,\"=No\"),SUMIFS(Breakdowns!L:L,Breakdowns!$C:$C,\"=\"&$A78))","v":0},{"$f":"IF($P$1,SUMIFS(Breakdowns!M:M,Breakdowns!$C:$C,\"=\"&$A78,Breakdowns!$AA:$AA,\"=No\"),SUMIFS(Breakdowns!M:M,Breakdowns!$C:$C,\"=\"&$A78))","v":0},{"$f":"IF($P$1,SUMIFS(Breakdowns!O:O,Breakdowns!$C:$C,\"=\"&$A78,Breakdowns!$AA:$AA,\"=No\"),SUMIFS(Breakdowns!O:O,Breakdowns!$C:$C,\"=\"&$A78))","v":0},{"$f":"IF($P$1,SUMIFS(Breakdowns!Q:Q,Breakdowns!$C:$C,\"=\"&$A78,Breakdowns!$AA:$AA,\"=No\"),SUMIFS(Breakdowns!Q:Q,Breakdowns!$C:$C,\"=\"&$A78))","v":0},{"$f":"IF($P$1,SUMIFS(Breakdowns!S:S,Breakdowns!$C:$C,\"=\"&$A78,Breakdowns!$AA:$AA,\"=No\"),SUMIFS(Breakdowns!S:S,Breakdowns!$C:$C,\"=\"&$A78))","v":0},{"$f":"IF($P$1,SUMIFS(Breakdowns!U:U,Breakdowns!$C:$C,\"=\"&$A78,Breakdowns!$AA:$AA,\"=No\"),SUMIFS(Breakdowns!U:U,Breakdowns!$C:$C,\"=\"&$A78))","v":0},{"$f":"IF($P$1,SUMIFS(Breakdowns!W:W,Breakdowns!$C:$C,\"=\"&$A78,Breakdowns!$AA:$AA,\"=No\"),SUMIFS(Breakdowns!W:W,Breakdowns!$C:$C,\"=\"&$A78))","v":0},{"$f":"IF($P$1,SUMIFS(Breakdowns!Y:Y,Breakdowns!$C:$C,\"=\"&$A78,Breakdowns!$AA:$AA,\"=No\"),SUMIFS(Breakdowns!Y:Y,Breakdowns!$C:$C,\"=\"&$A78))","v":0}]
["HI","Hawaii",null,null,null,{"$f":"IF($P$1,SUMIFS(Breakdowns!L:L,Breakdowns!$C:$C,\"=\"&$A79,Breakdowns!$AA:$AA,\"=No\"),SUMIFS(Breakdowns!L:L,Breakdowns!$C:$C,\"=\"&$A79))","v":749},{"$f":"IF($P$1,SUMIFS(Breakdowns!M:M,Breakdowns!$C:$C,\"=\"&$A79,Breakdowns!$AA:$AA,\"=No\"),SUMIFS(Breakdowns!M:M,Breakdowns!$C:$C,\"=\"&$A79))","v":2687},{"$f":"IF($P$1,SUMIFS(Breakdowns!O:O,Breakdowns!$C:$C,\"=\"&$A79,Breakdowns!$AA:$AA,\"=No\"),SUMIFS(Breakdowns!O:O,Breakdowns!$C:$C,\"=\"&$A79))","v":5800},{"$f":"IF($P$1,SUMIFS(Breakdowns!Q:Q,Breakdowns!$C:$C,\"=\"&$A79,Breakdowns!$AA:$AA,\"=No\"),SUMIFS(Breakdowns!Q:Q,Breakdowns!$C:$C,\"=\"&$A79))","v":8487},{"$f":"IF($P$1,SUMIFS(Breakdowns!S:S,Breakdowns!$C:$C,\"=\"&$A79,Breakdowns!$AA:$AA,\"=No\"),SUMIFS(Breakdowns!S:S,Breakdowns!$C:$C,\"=\"&$A79))","v":33189220},{"$f":"IF($P$1,SUMIFS(Breakdowns!U:U,Breakdowns!$C:$C,\"=\"&$A79,Breakdowns!$AA:$AA,\"=No\"),SUMIFS(Breakdowns!U:U,Breakdowns!$C:$C,\"=\"&$A79))","v":27692665},{"$f":"IF($P$1,SUMIFS(Breakdowns!W:W,Breakdowns!$C:$C,\"=\"&$A79,Breakdowns!$AA:$AA,\"=No\"),SUMIFS(Breakdowns!W:W,Breakdowns!$C:$C,\"=\"&$A79))","v":0},{"$f":"IF($P$1,SUMIFS(Breakdowns!Y:Y,Breakdowns!$C:$C,\"=\"&$A79,Breakdowns!$AA:$AA,\"=No\"),SUMIFS(Breakdowns!Y:Y,Breakdowns!$C:$C,\"=\"&$A79))","v":0}]
["IA","Iowa",null,null,null,{"$f":"IF($P$1,SUMIFS(Breakdowns!L:L,Breakdowns!$C:$C,\"=\"&$A80,Breakdowns!$AA:$AA,\"=No\"),SUMIFS(Breakdowns!L:L,Breakdowns!$C:$C,\"=\"&$A80))","v":484},{"$f":"IF($P$1,SUMIFS(Breakdowns!M:M,Breakdowns!$C:$C,\"=\"&$A80,Breakdowns!$AA:$AA,\"=No\"),SUMIFS(Breakdowns!M:M,Breakdowns!$C:$C,\"=\"&$A80))","v":707},{"$f":"IF($P$1,SUMIFS(Breakdowns!O:O,Breakdowns!$C:$C,\"=\"&$A80,Breakdowns!$AA:$AA,\"=No\"),SUMIFS(Breakdowns!O:O,Breakdowns!$C:$C,\"=\"&$A80))","v":1045},{"$f":"IF($P$1,SUMIFS(Breakdowns!Q:Q,Breakdowns!$C:$C,\"=\"&$A80,Breakdowns!$AA:$AA,\"=No\"),SUMIFS(Breakdowns!Q:Q,Breakdowns!$C:$C,\"=\"&$A80))","v":1752},{"$f":"IF($P$1,SUMIFS(Breakdowns!S:S,Breakdowns!$C:$C,\"=\"&$A80,Breakdowns!$AA:$AA,\"=No\"),SUMIFS(Breakdowns!S:S,Breakdowns!$C:$C,\"=\"&$A80))","v":12566699},{"$f":"IF($P$1,SUMIFS(Breakdowns!U:U,Breakdowns!$C:$C,\"=\"&$A80,Breakdowns!$AA:$AA,\"=No\"),SUMIFS(Breakdowns!U:U,Breakdowns!$C:$C,\"=\"&$A80))","v":11507842},{"$f":"IF($P$1,SUMIFS(Breakdowns!W:W,Breakdowns!$C:$C,\"=\"&$A80,Breakdowns!$AA:$AA,\"=No\"),SUMIFS(Breakdowns!W:W,Breakdowns!$C:$C,\"=\"&$A80))","v":0},{"$f":"IF($P$1,SUMIFS(Breakdowns!Y:Y,Breakdowns!$C:$C,\"=\"&$A80,Breakdowns!$AA:$AA,\"=No\"),SUMIFS(Breakdowns!Y:Y,Breakdowns!$C:$C,\"=\"&$A80))","v":0}]
["ID","Idaho",null,null,null,{"$f":"IF($P$1,SUMIFS(Breakdowns!L:L,Breakdowns!$C:$C,\"=\"&$A81,Breakdowns!$AA:$AA,\"=No\"),SUMIFS(Breakdowns!L:L,Breakdowns!$C:$C,\"=\"&$A81))","v":60},{"$f":"IF($P$1,SUMIFS(Breakdowns!M:M,Breakdowns!$C:$C,\"=\"&$A81,Breakdowns!$AA:$AA,\"=No\"),SUMIFS(Breakdowns!M:M,Breakdowns!$C:$C,\"=\"&$A81))","v":118},{"$f":"IF($P$1,SUMIFS(Breakdowns!O:O,Breakdowns!$C:$C,\"=\"&$A81,Breakdowns!$AA:$AA,\"=No\"),SUMIFS(Breakdowns!O:O,Breakdowns!$C:$C,\"=\"&$A81))","v":17},{"$f":"IF($P$1,SUMIFS(Breakdowns!Q:Q,Breakdowns!$C:$C,\"=\"&$A81,Breakdowns!$AA:$AA,\"=No\"),SUMIFS(Breakdowns!Q:Q,Breakdowns!$C:$C,\"=\"&$A81))","v":135},{"$f":"IF($P$1,SUMIFS(Breakdowns!S:S,Breakdowns!$C:$C,\"=\"&$A81,Breakdowns!$AA:$AA,\"=No\"),SUMIFS(Breakdowns!S:S,Breakdowns!$C:$C,\"=\"&$A81))","v":2029631},{"$f":"IF($P$1,SUMIFS(Breakdowns!U:U,Breakdowns!$C:$C,\"=\"&$A81,Breakdowns!$AA:$AA,\"=No\"),SUMIFS(Breakdowns!U:U,Breakdowns!$C:$C,\"=\"&$A81))","v":1774472},{"$f":"IF($P$1,SUMIFS(Breakdowns!W:W,Breakdowns!$C:$C,\"=\"&$A81,Breakdowns!$AA:$AA,\"=No\"),SUMIFS(Breakdowns!W:W,Breakdowns!$C:$C,\"=\"&$A81))","v":0},{"$f":"IF($P$1,SUMIFS(Breakdowns!Y:Y,Breakdowns!$C:$C,\"=\"&$A81,Breakdowns!$AA:$AA,\"=No\"),SUMIFS(Breakdowns!Y:Y,Breakdowns!$C:$C,\"=\"&$A81))","v":0}]
["IL","Illinois",null,null,null,{"$f":"IF($P$1,SUMIFS(Breakdowns!L:L,Breakdowns!$C:$C,\"=\"&$A82,Breakdowns!$AA:$AA,\"=No\"),SUMIFS(Breakdowns!L:L,Breakdowns!$C:$C,\"=\"&$A82))","v":6975},{"$f":"IF($P$1,SUMIFS(Breakdowns!M:M,Breakdowns!$C:$C,\"=\"&$A82,Breakdowns!$AA:$AA,\"=No\"),SUMIFS(Breakdowns!M:M,Breakdowns!$C:$C,\"=\"&$A82))","v":14569},{"$f":"IF($P$1,SUMIFS(Breakdowns!O:O,Breakdowns!$C:$C,\"=\"&$A82,Breakdowns!$AA:$AA,\"=No\"),SUMIFS(Breakdowns!O:O,Breakdowns!$C:$C,\"=\"&$A82))","v":21885},{"$f":"IF($P$1,SUMIFS(Breakdowns!Q:Q,Breakdowns!$C:$C,\"=\"&$A82,Breakdowns!$AA:$AA,\"=No\"),SUMIFS(Breakdowns!Q:Q,Breakdowns!$C:$C,\"=\"&$A82))","v":36454},{"$f":"IF($P$1,SUMIFS(Breakdowns!S:S,Breakdowns!$C:$C,\"=\"&$A82,Breakdowns!$AA:$AA,\"=No\"),SUMIFS(Breakdowns!S:S,Breakdowns!$C:$C,\"=\"&$A82))","v":285412406},{"$f":"IF($P$1,SUMIFS(Breakdowns!U:U,Breakdowns!$C:$C,\"=\"&$A82,Breakdowns!$AA:$AA,\"=No\"),SUMIFS(Breakdowns!U:U,Breakdowns!$C:$C,\"=\"&$A82))","v":262799434},{"$f":"IF($P$1,SUMIFS(Breakdowns!W:W,Breakdowns!$C:$C,\"=\"&$A82,Breakdowns!$AA:$AA,\"=No\"),SUMIFS(Breakdowns!W:W,Breakdowns!$C:$C,\"=\"&$A82))","v":19318703},{"$f":"IF($P$1,SUMIFS(Breakdowns!Y:Y,Breakdowns!$C:$C,\"=\"&$A82,Breakdowns!$AA:$AA,\"=No\"),SUMIFS(Breakdowns!Y:Y,Breakdowns!$C:$C,\"=\"&$A82))","v":18856683}]
["IN","Indiana",null,null,null,{"$f":"IF($P$1,SUMIFS(Breakdowns!L:L,Breakdowns!$C:$C,\"=\"&$A83,Breakdowns!$AA:$AA,\"=No\"),SUMIFS(Breakdowns!L:L,Breakdowns!$C:$C,\"=\"&$A83))","v":664},{"$f":"IF($P$1,SUMIFS(Breakdowns!M:M,Breakdowns!$C:$C,\"=\"&$A83,Breakdowns!$AA:$AA,\"=No\"),SUMIFS(Breakdowns!M:M,Breakdowns!$C:$C,\"=\"&$A83))","v":2338},{"$f":"IF($P$1,SUMIFS(Breakdowns!O:O,Breakdowns!$C:$C,\"=\"&$A83,Breakdowns!$AA:$AA,\"=No\"),SUMIFS(Breakdowns!O:O,Breakdowns!$C:$C,\"=\"&$A83))","v":1358},{"$f":"IF($P$1,SUMIFS(Breakdowns!Q:Q,Breakdowns!$C:$C,\"=\"&$A83,Breakdowns!$AA:$AA,\"=No\"),SUMIFS(Breakdowns!Q:Q,Breakdowns!$C:$C,\"=\"&$A83))","v":3696},{"$f":"IF($P$1,SUMIFS(Breakdowns!S:S,Breakdowns!$C:$C,\"=\"&$A83,Breakdowns!$AA:$AA,\"=No\"),SUMIFS(Breakdowns!S:S,Breakdowns!$C:$C,\"=\"&$A83))","v":30067882},{"$f":"IF($P$1,SUMIFS(Breakdowns!U:U,Breakdowns!$C:$C,\"=\"&$A83,Breakdowns!$AA:$AA,\"=No\"),SUMIFS(Breakdowns!U:U,Breakdowns!$C:$C,\"=\"&$A83))","v":27341428},{"$f":"IF($P$1,SUMIFS(Breakdowns!W:W,Breakdowns!$C:$C,\"=\"&$A83,Breakdowns!$AA:$AA,\"=No\"),SUMIFS(Breakdowns!W:W,Breakdowns!$C:$C,\"=\"&$A83))","v":791662},{"$f":"IF($P$1,SUMIFS(Breakdowns!Y:Y,Breakdowns!$C:$C,\"=\"&$A83,Breakdowns!$AA:$AA,\"=No\"),SUMIFS(Breakdowns!Y:Y,Breakdowns!$C:$C,\"=\"&$A83))","v":776475}]
["KS","Kansas",null,null,null,{"$f":"IF($P$1,SUMIFS(Breakdowns!L:L,Breakdowns!$C:$C,\"=\"&$A84,Breakdowns!$AA:$AA,\"=No\"),SUMIFS(Breakdowns!L:L,Breakdowns!$C:$C,\"=\"&$A84))","v":324},{"$f":"IF($P$1,SUMIFS(Breakdowns!M:M,Breakdowns!$C:$C,\"=\"&$A84,Breakdowns!$AA:$AA,\"=No\"),SUMIFS(Breakdowns!M:M,Breakdowns!$C:$C,\"=\"&$A84))","v":417},{"$f":"IF($P$1,SUMIFS(Breakdowns!O:O,Breakdowns!$C:$C,\"=\"&$A84,Breakdowns!$AA:$AA,\"=No\"),SUMIFS(Breakdowns!O:O,Breakdowns!$C:$C,\"=\"&$A84))","v":527},{"$f":"IF($P$1,SUMIFS(Breakdowns!Q:Q,Breakdowns!$C:$C,\"=\"&$A84,Breakdowns!$AA:$AA,\"=No\"),SUMIFS(Breakdowns!Q:Q,Breakdowns!$C:$C,\"=\"&$A84))","v":944},{"$f":"IF($P$1,SUMIFS(Breakdowns!S:S,Breakdowns!$C:$C,\"=\"&$A84,Breakdowns!$AA:$AA,\"=No\"),SUMIFS(Breakdowns!S:S,Breakdowns!$C:$C,\"=\"&$A84))","v":7951662},{"$f":"IF($P$1,SUMIFS(Breakdowns!U:U,Breakdowns!$C:$C,\"=\"&$A84,Breakdowns!$AA:$AA,\"=No\"),SUMIFS(Breakdowns!U:U,Breakdowns!$C:$C,\"=\"&$A84))","v":6637347},{"$f":"IF($P$1,SUMIFS(Breakdowns!W:W,Breakdowns!$C:$C,\"=\"&$A84,Breakdowns!$AA:$AA,\"=No\"),SUMIFS(Breakdowns!W:W,Breakdowns!$C:$C,\"=\"&$A84))","v":0},{"$f":"IF($P$1,SUMIFS(Breakdowns!Y:Y,Breakdowns!$C:$C,\"=\"&$A84,Breakdowns!$AA:$AA,\"=No\"),SUMIFS(Breakdowns!Y:Y,Breakdowns!$C:$C,\"=\"&$A84))","v":0}]
["KY","Kentucky",null,null,null,{"$f":"IF($P$1,SUMIFS(Breakdowns!L:L,Breakdowns!$C:$C,\"=\"&$A85,Breakdowns!$AA:$AA,\"=No\"),SUMIFS(Breakdowns!L:L,Breakdowns!$C:$C,\"=\"&$A85))","v":703},{"$f":"IF($P$1,SUMIFS(Breakdowns!M:M,Breakdowns!$C:$C,\"=\"&$A85,Breakdowns!$AA:$AA,\"=No\"),SUMIFS(Breakdowns!M:M,Breakdowns!$C:$C,\"=\"&$A85))","v":2316},{"$f":"IF($P$1,SUMIFS(Breakdowns!O:O,Breakdowns!$C:$C,\"=\"&$A85,Breakdowns!$AA:$AA,\"=No\"),SUMIFS(Breakdowns!O:O,Breakdowns!$C:$C,\"=\"&$A85))","v":4464},{"$f":"IF($P$1,SUMIFS(Breakdowns!Q:Q,Breakdowns!$C:$C,\"=\"&$A85,Breakdowns!$AA:$AA,\"=No\"),SUMIFS(Breakdowns!Q:Q,Breakdowns!$C:$C,\"=\"&$A85))","v":6780},{"$f":"IF($P$1,SUMIFS(Breakdowns!S:S,Breakdowns!$C:$C,\"=\"&$A85,Breakdowns!$AA:$AA,\"=No\"),SUMIFS(Breakdowns!S:S,Breakdowns!$C:$C,\"=\"&$A85))","v":25675660},{"$f":"IF($P$1,SUMIFS(Breakdowns!U:U,Breakdowns!$C:$C,\"=\"&$A85,Breakdowns!$AA:$AA,\"=No\"),SUMIFS(Breakdowns!U:U,Breakdowns!$C:$C,\"=\"&$A85))","v":22829094},{"$f":"IF($P$1,SUMIFS(Breakdowns!W:W,Breakdowns!$C:$C,\"=\"&$A85,Breakdowns!$AA:$AA,\"=No\"),SUMIFS(Breakdowns!W:W,Breakdowns!$C:$C,\"=\"&$A85))","v":0},{"$f":"IF($P$1,SUMIFS(Breakdowns!Y:Y,Breakdowns!$C:$C,\"=\"&$A85,Breakdowns!$AA:$AA,\"=No\"),SUMIFS(Breakdowns!Y:Y,Breakdowns!$C:$C,\"=\"&$A85))","v":0}]
["LA","Lousiana",null,null,null,{"$f":"IF($P$1,SUMIFS(Breakdowns!L:L,Breakdowns!$C:$C,\"=\"&$A86,Breakdowns!$AA:$AA,\"=No\"),SUMIFS(Breakdowns!L:L,Breakdowns!$C:$C,\"=\"&$A86))","v":364},{"$f":"IF($P$1,SUMIFS(Breakdowns!M:M,Breakdowns!$C:$C,\"=\"&$A86,Breakdowns!$AA:$AA,\"=No\"),SUMIFS(Breakdowns!M:M,Breakdowns!$C:$C,\"=\"&$A86))","v":1740},{"$f":"IF($P$1,SUMIFS(Breakdowns!O:O,Breakdowns!$C:$C,\"=\"&$A86,Breakdowns!$AA:$AA,\"=No\"),SUMIFS(Breakdowns!O:O,Breakdowns!$C:$C,\"=\"&$A86))","v":2988},{"$f":"IF($P$1,SUMIFS(Breakdowns!Q:Q,Breakdowns!$C:$C,\"=\"&$A86,Breakdowns!$AA:$AA,\"=No\"),SUMIFS(Breakdowns!Q:Q,Breakdowns!$C:$C,\"=\"&$A86))","v":4728},{"$f":"IF($P$1,SUMIFS(Breakdowns!S:S,Breakdowns!$C:$C,\"=\"&$A86,Breakdowns!$AA:$AA,\"=No\"),SUMIFS(Breakdowns!S:S,Breakdowns!$C:$C,\"=\"&$A86))","v":18437389},{"$f":"IF($P$1,SUMIFS(Breakdowns!U:U,Breakdowns!$C:$C,\"=\"&$A86,Breakdowns!$AA:$AA,\"=No\"),SUMIFS(Breakdowns!U:U,Breakdowns!$C:$C,\"=\"&$A86))","v":17260089},{"$f":"IF($P$1,SUMIFS(Breakdowns!W:W,Breakdowns!$C:$C,\"=\"&$A86,Breakdowns!$AA:$AA,\"=No\"),SUMIFS(Breakdowns!W:W,Breakdowns!$C:$C,\"=\"&$A86))","v":1201611},{"$f":"IF($P$1,SUMIFS(Breakdowns!Y:Y,Breakdowns!$C:$C,\"=\"&$A86,Breakdowns!$AA:$AA,\"=No\"),SUMIFS(Breakdowns!Y:Y,Breakdowns!$C:$C,\"=\"&$A86))","v":1192948}]
["MA","Massachusetts",null,null,null,{"$f":"IF($P$1,SUMIFS(Breakdowns!L:L,Breakdowns!$C:$C,\"=\"&$A87,Breakdowns!$AA:$AA,\"=No\"),SUMIFS(Breakdowns!L:L,Breakdowns!$C:$C,\"=\"&$A87))","v":3810},{"$f":"IF($P$1,SUMIFS(Breakdowns!M:M,Breakdowns!$C:$C,\"=\"&$A87,Breakdowns!$AA:$AA,\"=No\"),SUMIFS(Breakdowns!M:M,Breakdowns!$C:$C,\"=\"&$A87))","v":4977},{"$f":"IF($P$1,SUMIFS(Breakdowns!O:O,Breakdowns!$C:$C,\"=\"&$A87,Breakdowns!$AA:$AA,\"=No\"),SUMIFS(Breakdowns!O:O,Breakdowns!$C:$C,\"=\"&$A87))","v":6692},{"$f":"IF($P$1,SUMIFS(Breakdowns!Q:Q,Breakdowns!$C:$C,\"=\"&$A87,Breakdowns!$AA:$AA,\"=No\"),SUMIFS(Breakdowns!Q:Q,Breakdowns!$C:$C,\"=\"&$A87))","v":11669},{"$f":"IF($P$1,SUMIFS(Breakdowns!S:S,Breakdowns!$C:$C,\"=\"&$A87,Breakdowns!$AA:$AA,\"=No\"),SUMIFS(Breakdowns!S:S,Breakdowns!$C:$C,\"=\"&$A87))","v":144060414},{"$f":"IF($P$1,SUMIFS(Breakdowns!U:U,Breakdowns!$C:$C,\"=\"&$A87,Breakdowns!$AA:$AA,\"=No\"),SUMIFS(Breakdowns!U:U,Breakdowns!$C:$C,\"=\"&$A87))","v":132385998},{"$f":"IF($P$1,SUMIFS(Breakdowns!W:W,Breakdowns!$C:$C,\"=\"&$A87,Breakdowns!$AA:$AA,\"=No\"),SUMIFS(Breakdowns!W:W,Breakdowns!$C:$C,\"=\"&$A87))","v":12321849},{"$f":"IF($P$1,SUMIFS(Breakdowns!Y:Y,Breakdowns!$C:$C,\"=\"&$A87,Breakdowns!$AA:$AA,\"=No\"),SUMIFS(Breakdowns!Y:Y,Breakdowns!$C:$C,\"=\"&$A87))","v":12105846}]
["MD","Maryland",null,null,null,{"$f":"IF($P$1,SUMIFS(Breakdowns!L:L,Breakdowns!$C:$C,\"=\"&$A88,Breakdowns!$AA:$AA,\"=No\"),SUMIFS(Breakdowns!L:L,Breakdowns!$C:$C,\"=\"&$A88))","v":2209},{"$f":"IF($P$1,SUMIFS(Breakdowns!M:M,Breakdowns!$C:$C,\"=\"&$A88,Breakdowns!$AA:$AA,\"=No\"),SUMIFS(Breakdowns!M:M,Breakdowns!$C:$C,\"=\"&$A88))","v":6967},{"$f":"IF($P$1,SUMIFS(Breakdowns!O:O,Breakdowns!$C:$C,\"=\"&$A88,Breakdowns!$AA:$AA,\"=No\"),SUMIFS(Breakdowns!O:O,Breakdowns!$C:$C,\"=\"&$A88))","v":10937},{"$f":"IF($P$1,SUMIFS(Breakdowns!Q:Q,Breakdowns!$C:$C,\"=\"&$A88,Breakdowns!$AA:$AA,\"=No\"),SUMIFS(Breakdowns!Q:Q,Breakdowns!$C:$C,\"=\"&$A88))","v":17904},{"$f":"IF($P$1,SUMIFS(Breakdowns!S:S,Breakdowns!$C:$C,\"=\"&$A88,Breakdowns!$AA:$AA,\"=No\"),SUMIFS(Breakdowns!S:S,Breakdowns!$C:$C,\"=\"&$A88))","v":92949264},{"$f":"IF($P$1,SUMIFS(Breakdowns!U:U,Breakdowns!$C:$C,\"=\"&$A88,Breakdowns!$AA:$AA,\"=No\"),SUMIFS(Breakdowns!U:U,Breakdowns!$C:$C,\"=\"&$A88))","v":82302880},{"$f":"IF($P$1,SUMIFS(Breakdowns!W:W,Breakdowns!$C:$C,\"=\"&$A88,Breakdowns!$AA:$AA,\"=No\"),SUMIFS(Breakdowns!W:W,Breakdowns!$C:$C,\"=\"&$A88))","v":4132660},{"$f":"IF($P$1,SUMIFS(Breakdowns!Y:Y,Breakdowns!$C:$C,\"=\"&$A88,Breakdowns!$AA:$AA,\"=No\"),SUMIFS(Breakdowns!Y:Y,Breakdowns!$C:$C,\"=\"&$A88))","v":4007595}]
["ME","Maine",null,null,null,{"$f":"IF($P$1,SUMIFS(Breakdowns!L:L,Breakdowns!$C:$C,\"=\"&$A89,Breakdowns!$AA:$AA,\"=No\"),SUMIFS(Breakdowns!L:L,Breakdowns!$C:$C,\"=\"&$A89))","v":82},{"$f":"IF($P$1,SUMIFS(Breakdowns!M:M,Breakdowns!$C:$C,\"=\"&$A89,Breakdowns!$AA:$AA,\"=No\"),SUMIFS(Breakdowns!M:M,Breakdowns!$C:$C,\"=\"&$A89))","v":248},{"$f":"IF($P$1,SUMIFS(Breakdowns!O:O,Breakdowns!$C:$C,\"=\"&$A89,Breakdowns!$AA:$AA,\"=No\"),SUMIFS(Breakdowns!O:O,Breakdowns!$C:$C,\"=\"&$A89))","v":840},{"$f":"IF($P$1,SUMIFS(Breakdowns!Q:Q,Breakdowns!$C:$C,\"=\"&$A89,Breakdowns!$AA:$AA,\"=No\"),SUMIFS(Breakdowns!Q:Q,Breakdowns!$C:$C,\"=\"&$A89))","v":1088},{"$f":"IF($P$1,SUMIFS(Breakdowns!S:S,Breakdowns!$C:$C,\"=\"&$A89,Breakdowns!$AA:$AA,\"=No\"),SUMIFS(Breakdowns!S:S,Breakdowns!$C:$C,\"=\"&$A89))","v":3965691},{"$f":"IF($P$1,SUMIFS(Breakdowns!U:U,Breakdowns!$C:$C,\"=\"&$A89,Breakdowns!$AA:$AA,\"=No\"),SUMIFS(Breakdowns!U:U,Breakdowns!$C:$C,\"=\"&$A89))","v":3631056},{"$f":"IF($P$1,SUMIFS(Breakdowns!W:W,Breakdowns!$C:$C,\"=\"&$A89,Breakdowns!$AA:$AA,\"=No\"),SUMIFS(Breakdowns!W:W,Breakdowns!$C:$C,\"=\"&$A89))","v":481468},{"$f":"IF($P$1,SUMIFS(Breakdowns!Y:Y,Breakdowns!$C:$C,\"=\"&$A89,Breakdowns!$AA:$AA,\"=No\"),SUMIFS(Breakdowns!Y:Y,Breakdowns!$C:$C,\"=\"&$A89))","v":459627}]
["MI","Michigan",null,null,null,{"$f":"IF($P$1,SUMIFS(Breakdowns!L:L,Breakdowns!$C:$C,\"=\"&$A90,Breakdowns!$AA:$AA,\"=No\"),SUMIFS(Breakdowns!L:L,Breakdowns!$C:$C,\"=\"&$A90))","v":2301},{"$f":"IF($P$1,SUMIFS(Breakdowns!M:M,Breakdowns!$C:$C,\"=\"&$A90,Breakdowns!$AA:$AA,\"=No\"),SUMIFS(Breakdowns!M:M,Breakdowns!$C:$C,\"=\"&$A90))","v":5085},{"$f":"IF($P$1,SUMIFS(Breakdowns!O:O,Breakdowns!$C:$C,\"=\"&$A90,Breakdowns!$AA:$AA,\"=No\"),SUMIFS(Breakdowns!O:O,Breakdowns!$C:$C,\"=\"&$A90))","v":4978},{"$f":"IF($P$1,SUMIFS(Breakdowns!Q:Q,Breakdowns!$C:$C,\"=\"&$A90,Breakdowns!$AA:$AA,\"=No\"),SUMIFS(Breakdowns!Q:Q,Breakdowns!$C:$C,\"=\"&$A90))","v":10063},{"$f":"IF($P$1,SUMIFS(Breakdowns!S:S,Breakdowns!$C:$C,\"=\"&$A90,Breakdowns!$AA:$AA,\"=No\"),SUMIFS(Breakdowns!S:S,Breakdowns!$C:$C,\"=\"&$A90))","v":77033059},{"$f":"IF($P$1,SUMIFS(Breakdowns!U:U,Breakdowns!$C:$C,\"=\"&$A90,Breakdowns!$AA:$AA,\"=No\"),SUMIFS(Breakdowns!U:U,Breakdowns!$C:$C,\"=\"&$A90))","v":69164826},{"$f":"IF($P$1,SUMIFS(Breakdowns!W:W,Breakdowns!$C:$C,\"=\"&$A90,Breakdowns!$AA:$AA,\"=No\"),SUMIFS(Breakdowns!W:W,Breakdowns!$C:$C,\"=\"&$A90))","v":273967},{"$f":"IF($P$1,SUMIFS(Breakdowns!Y:Y,Breakdowns!$C:$C,\"=\"&$A90,Breakdowns!$AA:$AA,\"=No\"),SUMIFS(Breakdowns!Y:Y,Breakdowns!$C:$C,\"=\"&$A90))","v":271763}]
["MN","Minnesota",null,null,null,{"$f":"IF($P$1,SUMIFS(Breakdowns!L:L,Breakdowns!$C:$C,\"=\"&$A91,Breakdowns!$AA:$AA,\"=No\"),SUMIFS(Breakdowns!L:L,Breakdowns!$C:$C,\"=\"&$A91))","v":1961},{"$f":"IF($P$1,SUMIFS(Breakdowns!M:M,Breakdowns!$C:$C,\"=\"&$A91,Breakdowns!$AA:$AA,\"=No\"),SUMIFS(Breakdowns!M:M,Breakdowns!$C:$C,\"=\"&$A91))","v":1918},{"$f":"IF($P$1,SUMIFS(Breakdowns!O:O,Breakdowns!$C:$C,\"=\"&$A91,Breakdowns!$AA:$AA,\"=No\"),SUMIFS(Breakdowns!O:O,Breakdowns!$C:$C,\"=\"&$A91))","v":7246},{"$f":"IF($P$1,SUMIFS(Breakdowns!Q:Q,Breakdowns!$C:$C,\"=\"&$A91,Breakdowns!$AA:$AA,\"=No\"),SUMIFS(Breakdowns!Q:Q,Breakdowns!$C:$C,\"=\"&$A91))","v":9164},{"$f":"IF($P$1,SUMIFS(Breakdowns!S:S,Breakdowns!$C:$C,\"=\"&$A91,Breakdowns!$AA:$AA,\"=No\"),SUMIFS(Breakdowns!S:S,Breakdowns!$C:$C,\"=\"&$A91))","v":85769097},{"$f":"IF($P$1,SUMIFS(Breakdowns!U:U,Breakdowns!$C:$C,\"=\"&$A91,Breakdowns!$AA:$AA,\"=No\"),SUMIFS(Breakdowns!U:U,Breakdowns!$C:$C,\"=\"&$A91))","v":70112371},{"$f":"IF($P$1,SUMIFS(Breakdowns!W:W,Breakdowns!$C:$C,\"=\"&$A91,Breakdowns!$AA:$AA,\"=No\"),SUMIFS(Breakdowns!W:W,Breakdowns!$C:$C,\"=\"&$A91))","v":2076884},{"$f":"IF($P$1,SUMIFS(Breakdowns!Y:Y,Breakdowns!$C:$C,\"=\"&$A91,Breakdowns!$AA:$AA,\"=No\"),SUMIFS(Breakdowns!Y:Y,Breakdowns!$C:$C,\"=\"&$A91))","v":2028724}]
["MO","Missouri",null,null,null,{"$f":"IF($P$1,SUMIFS(Breakdowns!L:L,Breakdowns!$C:$C,\"=\"&$A92,Breakdowns!$AA:$AA,\"=No\"),SUMIFS(Breakdowns!L:L,Breakdowns!$C:$C,\"=\"&$A92))","v":824},{"$f":"IF($P$1,SUMIFS(Breakdowns!M:M,Breakdowns!$C:$C,\"=\"&$A92,Breakdowns!$AA:$AA,\"=No\"),SUMIFS(Breakdowns!M:M,Breakdowns!$C:$C,\"=\"&$A92))","v":1716},{"$f":"IF($P$1,SUMIFS(Breakdowns!O:O,Breakdowns!$C:$C,\"=\"&$A92,Breakdowns!$AA:$AA,\"=No\"),SUMIFS(Breakdowns!O:O,Breakdowns!$C:$C,\"=\"&$A92))","v":807},{"$f":"IF($P$1,SUMIFS(Breakdowns!Q:Q,Breakdowns!$C:$C,\"=\"&$A92,Breakdowns!$AA:$AA,\"=No\"),SUMIFS(Breakdowns!Q:Q,Breakdowns!$C:$C,\"=\"&$A92))","v":2523},{"$f":"IF($P$1,SUMIFS(Breakdowns!S:S,Breakdowns!$C:$C,\"=\"&$A92,Breakdowns!$AA:$AA,\"=No\"),SUMIFS(Breakdowns!S:S,Breakdowns!$C:$C,\"=\"&$A92))","v":48333823},{"$f":"IF($P$1,SUMIFS(Breakdowns!U:U,Breakdowns!$C:$C,\"=\"&$A92,Breakdowns!$AA:$AA,\"=No\"),SUMIFS(Breakdowns!U:U,Breakdowns!$C:$C,\"=\"&$A92))","v":43632147},{"$f":"IF($P$1,SUMIFS(Breakdowns!W:W,Breakdowns!$C:$C,\"=\"&$A92,Breakdowns!$AA:$AA,\"=No\"),SUMIFS(Breakdowns!W:W,Breakdowns!$C:$C,\"=\"&$A92))","v":3151333},{"$f":"IF($P$1,SUMIFS(Breakdowns!Y:Y,Breakdowns!$C:$C,\"=\"&$A92,Breakdowns!$AA:$AA,\"=No\"),SUMIFS(Breakdowns!Y:Y,Breakdowns!$C:$C,\"=\"&$A92))","v":3125069}]
["MP","Northern Marianas",null,null,null,{"$f":"IF($P$1,SUMIFS(Breakdowns!L:L,Breakdowns!$C:$C,\"=\"&$A93,Breakdowns!$AA:$AA,\"=No\"),SUMIFS(Breakdowns!L:L,Breakdowns!$C:$C,\"=\"&$A93))","v":0},{"$f":"IF($P$1,SUMIFS(Breakdowns!M:M,Breakdowns!$C:$C,\"=\"&$A93,Breakdowns!$AA:$AA,\"=No\"),SUMIFS(Breakdowns!M:M,Breakdowns!$C:$C,\"=\"&$A93))","v":0},{"$f":"IF($P$1,SUMIFS(Breakdowns!O:O,Breakdowns!$C:$C,\"=\"&$A93,Breakdowns!$AA:$AA,\"=No\"),SUMIFS(Breakdowns!O:O,Breakdowns!$C:$C,\"=\"&$A93))","v":0},{"$f":"IF($P$1,SUMIFS(Breakdowns!Q:Q,Breakdowns!$C:$C,\"=\"&$A93,Breakdowns!$AA:$AA,\"=No\"),SUMIFS(Breakdowns!Q:Q,Breakdowns!$C:$C,\"=\"&$A93))","v":0},{"$f":"IF($P$1,SUMIFS(Breakdowns!S:S,Breakdowns!$C:$C,\"=\"&$A93,Breakdowns!$AA:$AA,\"=No\"),SUMIFS(Breakdowns!S:S,Breakdowns!$C:$C,\"=\"&$A93))","v":0},{"$f":"IF($P$1,SUMIFS(Breakdowns!U:U,Breakdowns!$C:$C,\"=\"&$A93,Breakdowns!$AA:$AA,\"=No\"),SUMIFS(Breakdowns!U:U,Breakdowns!$C:$C,\"=\"&$A93))","v":0},{"$f":"IF($P$1,SUMIFS(Breakdowns!W:W,Breakdowns!$C:$C,\"=\"&$A93,Breakdowns!$AA:$AA,\"=No\"),SUMIFS(Breakdowns!W:W,Breakdowns!$C:$C,\"=\"&$A93))","v":0},{"$f":"IF($P$1,SUMIFS(Breakdowns!Y:Y,Breakdowns!$C:$C,\"=\"&$A93,Breakdowns!$AA:$AA,\"=No\"),SUMIFS(Breakdowns!Y:Y,Breakdowns!$C:$C,\"=\"&$A93))","v":0}]
["MS","Mississippi",null,null,null,{"$f":"IF($P$1,SUMIFS(Breakdowns!L:L,Breakdowns!$C:$C,\"=\"&$A94,Breakdowns!$AA:$AA,\"=No\"),SUMIFS(Breakdowns!L:L,Breakdowns!$C:$C,\"=\"&$A94))","v":99},{"$f":"IF($P$1,SUMIFS(Breakdowns!M:M,Breakdowns!$C:$C,\"=\"&$A94,Breakdowns!$AA:$AA,\"=No\"),SUMIFS(Breakdowns!M:M,Breakdowns!$C:$C,\"=\"&$A94))","v":256},{"$f":"IF($P$1,SUMIFS(Breakdowns!O:O,Breakdowns!$C:$C,\"=\"&$A94,Breakdowns!$AA:$AA,\"=No\"),SUMIFS(Breakdowns!O:O,Breakdowns!$C:$C,\"=\"&$A94))","v":1688},{"$f":"IF($P$1,SUMIFS(Breakdowns!Q:Q,Breakdowns!$C:$C,\"=\"&$A94,Breakdowns!$AA:$AA,\"=No\"),SUMIFS(Breakdowns!Q:Q,Breakdowns!$C:$C,\"=\"&$A94))","v":1944},{"$f":"IF($P$1,SUMIFS(Breakdowns!S:S,Breakdowns!$C:$C,\"=\"&$A94,Breakdowns!$AA:$AA,\"=No\"),SUMIFS(Breakdowns!S:S,Breakdowns!$C:$C,\"=\"&$A94))","v":3272533},{"$f":"IF($P$1,SUMIFS(Breakdowns!U:U,Breakdowns!$C:$C,\"=\"&$A94,Breakdowns!$AA:$AA,\"=No\"),SUMIFS(Breakdowns!U:U,Breakdowns!$C:$C,\"=\"&$A94))","v":3080166},{"$f":"IF($P$1,SUMIFS(Breakdowns!W:W,Breakdowns!$C:$C,\"=\"&$A94,Breakdowns!$AA:$AA,\"=No\"),SUMIFS(Breakdowns!W:W,Breakdowns!$C:$C,\"=\"&$A94))","v":0},{"$f":"IF($P$1,SUMIFS(Breakdowns!Y:Y,Breakdowns!$C:$C,\"=\"&$A94,Breakdowns!$AA:$AA,\"=No\"),SUMIFS(Breakdowns!Y:Y,Breakdowns!$C:$C,\"=\"&$A94))","v":0}]
["MT","Montana",null,null,null,{"$f":"IF($P$1,SUMIFS(Breakdowns!L:L,Breakdowns!$C:$C,\"=\"&$A95,Breakdowns!$AA:$AA,\"=No\"),SUMIFS(Breakdowns!L:L,Breakdowns!$C:$C,\"=\"&$A95))","v":89},{"$f":"IF($P$1,SUMIFS(Breakdowns!M:M,Breakdowns!$C:$C,\"=\"&$A95,Breakdowns!$AA:$AA,\"=No\"),SUMIFS(Breakdowns!M:M,Breakdowns!$C:$C,\"=\"&$A95))","v":456},{"$f":"IF($P$1,SUMIFS(Breakdowns!O:O,Breakdowns!$C:$C,\"=\"&$A95,Breakdowns!$AA:$AA,\"=No\"),SUMIFS(Breakdowns!O:O,Breakdowns!$C:$C,\"=\"&$A95))","v":438},{"$f":"IF($P$1,SUMIFS(Breakdowns!Q:Q,Breakdowns!$C:$C,\"=\"&$A95,Breakdowns!$AA:$AA,\"=No\"),SUMIFS(Breakdowns!Q:Q,Breakdowns!$C:$C,\"=\"&$A95))","v":894},{"$f":"IF($P$1,SUMIFS(Breakdowns!S:S,Breakdowns!$C:$C,\"=\"&$A95,Breakdowns!$AA:$AA,\"=No\"),SUMIFS(Breakdowns!S:S,Breakdowns!$C:$C,\"=\"&$A95))","v":2472034},{"$f":"IF($P$1,SUMIFS(Breakdowns!U:U,Breakdowns!$C:$C,\"=\"&$A95,Breakdowns!$AA:$AA,\"=No\"),SUMIFS(Breakdowns!U:U,Breakdowns!$C:$C,\"=\"&$A95))","v":2275955},{"$f":"IF($P$1,SUMIFS(Breakdowns!W:W,Breakdowns!$C:$C,\"=\"&$A95,Breakdowns!$AA:$AA,\"=No\"),SUMIFS(Breakdowns!W:W,Breakdowns!$C:$C,\"=\"&$A95))","v":0},{"$f":"IF($P$1,SUMIFS(Breakdowns!Y:Y,Breakdowns!$C:$C,\"=\"&$A95,Breakdowns!$AA:$AA,\"=No\"),SUMIFS(Breakdowns!Y:Y,Breakdowns!$C:$C,\"=\"&$A95))","v":0}]
["NC","North Carolina",null,null,null,{"$f":"IF($P$1,SUMIFS(Breakdowns!L:L,Breakdowns!$C:$C,\"=\"&$A96,Breakdowns!$AA:$AA,\"=No\"),SUMIFS(Breakdowns!L:L,Breakdowns!$C:$C,\"=\"&$A96))","v":1320},{"$f":"IF($P$1,SUMIFS(Breakdowns!M:M,Breakdowns!$C:$C,\"=\"&$A96,Breakdowns!$AA:$AA,\"=No\"),SUMIFS(Breakdowns!M:M,Breakdowns!$C:$C,\"=\"&$A96))","v":3190},{"$f":"IF($P$1,SUMIFS(Breakdowns!O:O,Breakdowns!$C:$C,\"=\"&$A96,Breakdowns!$AA:$AA,\"=No\"),SUMIFS(Breakdowns!O:O,Breakdowns!$C:$C,\"=\"&$A96))","v":3894},{"$f":"IF($P$1,SUMIFS(Breakdowns!Q:Q,Breakdowns!$C:$C,\"=\"&$A96,Breakdowns!$AA:$AA,\"=No\"),SUMIFS(Breakdowns!Q:Q,Breakdowns!$C:$C,\"=\"&$A96))","v":7084},{"$f":"IF($P$1,SUMIFS(Breakdowns!S:S,Breakdowns!$C:$C,\"=\"&$A96,Breakdowns!$AA:$AA,\"=No\"),SUMIFS(Breakdowns!S:S,Breakdowns!$C:$C,\"=\"&$A96))","v":54533124},{"$f":"IF($P$1,SUMIFS(Breakdowns!U:U,Breakdowns!$C:$C,\"=\"&$A96,Breakdowns!$AA:$AA,\"=No\"),SUMIFS(Breakdowns!U:U,Breakdowns!$C:$C,\"=\"&$A96))","v":48925121},{"$f":"IF($P$1,SUMIFS(Breakdowns!W:W,Breakdowns!$C:$C,\"=\"&$A96,Breakdowns!$AA:$AA,\"=No\"),SUMIFS(Breakdowns!W:W,Breakdowns!$C:$C,\"=\"&$A96))","v":577598},{"$f":"IF($P$1,SUMIFS(Breakdowns!Y:Y,Breakdowns!$C:$C,\"=\"&$A96,Breakdowns!$AA:$AA,\"=No\"),SUMIFS(Breakdowns!Y:Y,Breakdowns!$C:$C,\"=\"&$A96))","v":555279}]
["ND","North Dakota",null,null,null,{"$f":"IF($P$1,SUMIFS(Breakdowns!L:L,Breakdowns!$C:$C,\"=\"&$A97,Breakdowns!$AA:$AA,\"=No\"),SUMIFS(Breakdowns!L:L,Breakdowns!$C:$C,\"=\"&$A97))","v":53},{"$f":"IF($P$1,SUMIFS(Breakdowns!M:M,Breakdowns!$C:$C,\"=\"&$A97,Breakdowns!$AA:$AA,\"=No\"),SUMIFS(Breakdowns!M:M,Breakdowns!$C:$C,\"=\"&$A97))","v":46},{"$f":"IF($P$1,SUMIFS(Breakdowns!O:O,Breakdowns!$C:$C,\"=\"&$A97,Breakdowns!$AA:$AA,\"=No\"),SUMIFS(Breakdowns!O:O,Breakdowns!$C:$C,\"=\"&$A97))","v":176},{"$f":"IF($P$1,SUMIFS(Breakdowns!Q:Q,Breakdowns!$C:$C,\"=\"&$A97,Breakdowns!$AA:$AA,\"=No\"),SUMIFS(Breakdowns!Q:Q,Breakdowns!$C:$C,\"=\"&$A97))","v":222},{"$f":"IF($P$1,SUMIFS(Breakdowns!S:S,Breakdowns!$C:$C,\"=\"&$A97,Breakdowns!$AA:$AA,\"=No\"),SUMIFS(Breakdowns!S:S,Breakdowns!$C:$C,\"=\"&$A97))","v":1938858},{"$f":"IF($P$1,SUMIFS(Breakdowns!U:U,Breakdowns!$C:$C,\"=\"&$A97,Breakdowns!$AA:$AA,\"=No\"),SUMIFS(Breakdowns!U:U,Breakdowns!$C:$C,\"=\"&$A97))","v":1857305},{"$f":"IF($P$1,SUMIFS(Breakdowns!W:W,Breakdowns!$C:$C,\"=\"&$A97,Breakdowns!$AA:$AA,\"=No\"),SUMIFS(Breakdowns!W:W,Breakdowns!$C:$C,\"=\"&$A97))","v":0},{"$f":"IF($P$1,SUMIFS(Breakdowns!Y:Y,Breakdowns!$C:$C,\"=\"&$A97,Breakdowns!$AA:$AA,\"=No\"),SUMIFS(Breakdowns!Y:Y,Breakdowns!$C:$C,\"=\"&$A97))","v":0}]
["NE","Nebraska",null,null,null,{"$f":"IF($P$1,SUMIFS(Breakdowns!L:L,Breakdowns!$C:$C,\"=\"&$A98,Breakdowns!$AA:$AA,\"=No\"),SUMIFS(Breakdowns!L:L,Breakdowns!$C:$C,\"=\"&$A98))","v":177},{"$f":"IF($P$1,SUMIFS(Breakdowns!M:M,Breakdowns!$C:$C,\"=\"&$A98,Breakdowns!$AA:$AA,\"=No\"),SUMIFS(Breakdowns!M:M,Breakdowns!$C:$C,\"=\"&$A98))","v":450},{"$f":"IF($P$1,SUMIFS(Breakdowns!O:O,Breakdowns!$C:$C,\"=\"&$A98,Breakdowns!$AA:$AA,\"=No\"),SUMIFS(Breakdowns!O:O,Breakdowns!$C:$C,\"=\"&$A98))","v":2869},{"$f":"IF($P$1,SUMIFS(Breakdowns!Q:Q,Breakdowns!$C:$C,\"=\"&$A98,Breakdowns!$AA:$AA,\"=No\"),SUMIFS(Breakdowns!Q:Q,Breakdowns!$C:$C,\"=\"&$A98))","v":3319},{"$f":"IF($P$1,SUMIFS(Breakdowns!S:S,Breakdowns!$C:$C,\"=\"&$A98,Breakdowns!$AA:$AA,\"=No\"),SUMIFS(Breakdowns!S:S,Breakdowns!$C:$C,\"=\"&$A98))","v":6789317},{"$f":"IF($P$1,SUMIFS(Breakdowns!U:U,Breakdowns!$C:$C,\"=\"&$A98,Breakdowns!$AA:$AA,\"=No\"),SUMIFS(Breakdowns!U:U,Breakdowns!$C:$C,\"=\"&$A98))","v":6653157},{"$f":"IF($P$1,SUMIFS(Breakdowns!W:W,Breakdowns!$C:$C,\"=\"&$A98,Breakdowns!$AA:$AA,\"=No\"),SUMIFS(Breakdowns!W:W,Breakdowns!$C:$C,\"=\"&$A98))","v":0},{"$f":"IF($P$1,SUMIFS(Breakdowns!Y:Y,Breakdowns!$C:$C,\"=\"&$A98,Breakdowns!$AA:$AA,\"=No\"),SUMIFS(Breakdowns!Y:Y,Breakdowns!$C:$C,\"=\"&$A98))","v":0}]
["NH","New Hampshire",null,null,null,{"$f":"IF($P$1,SUMIFS(Breakdowns!L:L,Breakdowns!$C:$C,\"=\"&$A99,Breakdowns!$AA:$AA,\"=No\"),SUMIFS(Breakdowns!L:L,Breakdowns!$C:$C,\"=\"&$A99))","v":58},{"$f":"IF($P$1,SUMIFS(Breakdowns!M:M,Breakdowns!$C:$C,\"=\"&$A99,Breakdowns!$AA:$AA,\"=No\"),SUMIFS(Breakdowns!M:M,Breakdowns!$C:$C,\"=\"&$A99))","v":128},{"$f":"IF($P$1,SUMIFS(Breakdowns!O:O,Breakdowns!$C:$C,\"=\"&$A99,Breakdowns!$AA:$AA,\"=No\"),SUMIFS(Breakdowns!O:O,Breakdowns!$C:$C,\"=\"&$A99))","v":442},{"$f":"IF($P$1,SUMIFS(Breakdowns!Q:Q,Breakdowns!$C:$C,\"=\"&$A99,Breakdowns!$AA:$AA,\"=No\"),SUMIFS(Breakdowns!Q:Q,Breakdowns!$C:$C,\"=\"&$A99))","v":570},{"$f":"IF($P$1,SUMIFS(Breakdowns!S:S,Breakdowns!$C:$C,\"=\"&$A99,Breakdowns!$AA:$AA,\"=No\"),SUMIFS(Breakdowns!S:S,Breakdowns!$C:$C,\"=\"&$A99))","v":2175195},{"$f":"IF($P$1,SUMIFS(Breakdowns!U:U,Breakdowns!$C:$C,\"=\"&$A99,Breakdowns!$AA:$AA,\"=No\"),SUMIFS(Breakdowns!U:U,Breakdowns!$C:$C,\"=\"&$A99))","v":1948189},{"$f":"IF($P$1,SUMIFS(Breakdowns!W:W,Breakdowns!$C:$C,\"=\"&$A99,Breakdowns!$AA:$AA,\"=No\"),SUMIFS(Breakdowns!W:W,Breakdowns!$C:$C,\"=\"&$A99))","v":0},{"$f":"IF($P$1,SUMIFS(Breakdowns!Y:Y,Breakdowns!$C:$C,\"=\"&$A99,Breakdowns!$AA:$AA,\"=No\"),SUMIFS(Breakdowns!Y:Y,Breakdowns!$C:$C,\"=\"&$A99))","v":0}]
["NJ","New Jersey",null,null,null,{"$f":"IF($P$1,SUMIFS(Breakdowns!L:L,Breakdowns!$C:$C,\"=\"&$A100,Breakdowns!$AA:$AA,\"=No\"),SUMIFS(Breakdowns!L:L,Breakdowns!$C:$C,\"=\"&$A100))","v":5581},{"$f":"IF($P$1,SUMIFS(Breakdowns!M:M,Breakdowns!$C:$C,\"=\"&$A100,Breakdowns!$AA:$AA,\"=No\"),SUMIFS(Breakdowns!M:M,Breakdowns!$C:$C,\"=\"&$A100))","v":8765},{"$f":"IF($P$1,SUMIFS(Breakdowns!O:O,Breakdowns!$C:$C,\"=\"&$A100,Breakdowns!$AA:$AA,\"=No\"),SUMIFS(Breakdowns!O:O,Breakdowns!$C:$C,\"=\"&$A100))","v":6866},{"$f":"IF($P$1,SUMIFS(Breakdowns!Q:Q,Breakdowns!$C:$C,\"=\"&$A100,Breakdowns!$AA:$AA,\"=No\"),SUMIFS(Breakdowns!Q:Q,Breakdowns!$C:$C,\"=\"&$A100))","v":15631},{"$f":"IF($P$1,SUMIFS(Breakdowns!S:S,Breakdowns!$C:$C,\"=\"&$A100,Breakdowns!$AA:$AA,\"=No\"),SUMIFS(Breakdowns!S:S,Breakdowns!$C:$C,\"=\"&$A100))","v":255710318},{"$f":"IF($P$1,SUMIFS(Breakdowns!U:U,Breakdowns!$C:$C,\"=\"&$A100,Breakdowns!$AA:$AA,\"=No\"),SUMIFS(Breakdowns!U:U,Breakdowns!$C:$C,\"=\"&$A100))","v":218880619},{"$f":"IF($P$1,SUMIFS(Breakdowns!W:W,Breakdowns!$C:$C,\"=\"&$A100,Breakdowns!$AA:$AA,\"=No\"),SUMIFS(Breakdowns!W:W,Breakdowns!$C:$C,\"=\"&$A100))","v":15167738},{"$f":"IF($P$1,SUMIFS(Breakdowns!Y:Y,Breakdowns!$C:$C,\"=\"&$A100,Breakdowns!$AA:$AA,\"=No\"),SUMIFS(Breakdowns!Y:Y,Breakdowns!$C:$C,\"=\"&$A100))","v":14515542}]
["NM","New Mexico",null,null,null,{"$f":"IF($P$1,SUMIFS(Breakdowns!L:L,Breakdowns!$C:$C,\"=\"&$A101,Breakdowns!$AA:$AA,\"=No\"),SUMIFS(Breakdowns!L:L,Breakdowns!$C:$C,\"=\"&$A101))","v":287},{"$f":"IF($P$1,SUMIFS(Breakdowns!M:M,Breakdowns!$C:$C,\"=\"&$A101,Breakdowns!$AA:$AA,\"=No\"),SUMIFS(Breakdowns!M:M,Breakdowns!$C:$C,\"=\"&$A101))","v":210},{"$f":"IF($P$1,SUMIFS(Breakdowns!O:O,Breakdowns!$C:$C,\"=\"&$A101,Breakdowns!$AA:$AA,\"=No\"),SUMIFS(Breakdowns!O:O,Breakdowns!$C:$C,\"=\"&$A101))","v":394},{"$f":"IF($P$1,SUMIFS(Breakdowns!Q:Q,Breakdowns!$C:$C,\"=\"&$A101,Breakdowns!$AA:$AA,\"=No\"),SUMIFS(Breakdowns!Q:Q,Breakdowns!$C:$C,\"=\"&$A101))","v":604},{"$f":"IF($P$1,SUMIFS(Breakdowns!S:S,Breakdowns!$C:$C,\"=\"&$A101,Breakdowns!$AA:$AA,\"=No\"),SUMIFS(Breakdowns!S:S,Breakdowns!$C:$C,\"=\"&$A101))","v":12361989},{"$f":"IF($P$1,SUMIFS(Breakdowns!U:U,Breakdowns!$C:$C,\"=\"&$A101,Breakdowns!$AA:$AA,\"=No\"),SUMIFS(Breakdowns!U:U,Breakdowns!$C:$C,\"=\"&$A101))","v":10719650},{"$f":"IF($P$1,SUMIFS(Breakdowns!W:W,Breakdowns!$C:$C,\"=\"&$A101,Breakdowns!$AA:$AA,\"=No\"),SUMIFS(Breakdowns!W:W,Breakdowns!$C:$C,\"=\"&$A101))","v":529477},{"$f":"IF($P$1,SUMIFS(Breakdowns!Y:Y,Breakdowns!$C:$C,\"=\"&$A101,Breakdowns!$AA:$AA,\"=No\"),SUMIFS(Breakdowns!Y:Y,Breakdowns!$C:$C,\"=\"&$A101))","v":520766}]
["NV","Nevada",null,null,null,{"$f":"IF($P$1,SUMIFS(Breakdowns!L:L,Breakdowns!$C:$C,\"=\"&$A102,Breakdowns!$AA:$AA,\"=No\"),SUMIFS(Breakdowns!L:L,Breakdowns!$C:$C,\"=\"&$A102))","v":867},{"$f":"IF($P$1,SUMIFS(Breakdowns!M:M,Breakdowns!$C:$C,\"=\"&$A102,Breakdowns!$AA:$AA,\"=No\"),SUMIFS(Breakdowns!M:M,Breakdowns!$C:$C,\"=\"&$A102))","v":1824},{"$f":"IF($P$1,SUMIFS(Breakdowns!O:O,Breakdowns!$C:$C,\"=\"&$A102,Breakdowns!$AA:$AA,\"=No\"),SUMIFS(Breakdowns!O:O,Breakdowns!$C:$C,\"=\"&$A102))","v":746},{"$f":"IF($P$1,SUMIFS(Breakdowns!Q:Q,Breakdowns!$C:$C,\"=\"&$A102,Breakdowns!$AA:$AA,\"=No\"),SUMIFS(Breakdowns!Q:Q,Breakdowns!$C:$C,\"=\"&$A102))","v":2570},{"$f":"IF($P$1,SUMIFS(Breakdowns!S:S,Breakdowns!$C:$C,\"=\"&$A102,Breakdowns!$AA:$AA,\"=No\"),SUMIFS(Breakdowns!S:S,Breakdowns!$C:$C,\"=\"&$A102))","v":39266171},{"$f":"IF($P$1,SUMIFS(Breakdowns!U:U,Breakdowns!$C:$C,\"=\"&$A102,Breakdowns!$AA:$AA,\"=No\"),SUMIFS(Breakdowns!U:U,Breakdowns!$C:$C,\"=\"&$A102))","v":35552894},{"$f":"IF($P$1,SUMIFS(Breakdowns!W:W,Breakdowns!$C:$C,\"=\"&$A102,Breakdowns!$AA:$AA,\"=No\"),SUMIFS(Breakdowns!W:W,Breakdowns!$C:$C,\"=\"&$A102))","v":469793},{"$f":"IF($P$1,SUMIFS(Breakdowns!Y:Y,Breakdowns!$C:$C,\"=\"&$A102,Breakdowns!$AA:$AA,\"=No\"),SUMIFS(Breakdowns!Y:Y,Breakdowns!$C:$C,\"=\"&$A102))","v":466806}]
["NY","New York",null,null,null,{"$f":"IF($P$1,SUMIFS(Breakdowns!L:L,Breakdowns!$C:$C,\"=\"&$A103,Breakdowns!$AA:$AA,\"=No\"),SUMIFS(Breakdowns!L:L,Breakdowns!$C:$C,\"=\"&$A103))","v":16881},{"$f":"IF($P$1,SUMIFS(Breakdowns!M:M,Breakdowns!$C:$C,\"=\"&$A103,Breakdowns!$AA:$AA,\"=No\"),SUMIFS(Breakdowns!M:M,Breakdowns!$C:$C,\"=\"&$A103))","v":29694},{"$f":"IF($P$1,SUMIFS(Breakdowns!O:O,Breakdowns!$C:$C,\"=\"&$A103,Breakdowns!$AA:$AA,\"=No\"),SUMIFS(Breakdowns!O:O,Breakdowns!$C:$C,\"=\"&$A103))","v":29582},{"$f":"IF($P$1,SUMIFS(Breakdowns!Q:Q,Breakdowns!$C:$C,\"=\"&$A103,Breakdowns!$AA:$AA,\"=No\"),SUMIFS(Breakdowns!Q:Q,Breakdowns!$C:$C,\"=\"&$A103))","v":59276},{"$f":"IF($P$1,SUMIFS(Breakdowns!S:S,Breakdowns!$C:$C,\"=\"&$A103,Breakdowns!$AA:$AA,\"=No\"),SUMIFS(Breakdowns!S:S,Breakdowns!$C:$C,\"=\"&$A103))","v":835706649},{"$f":"IF($P$1,SUMIFS(Breakdowns!U:U,Breakdowns!$C:$C,\"=\"&$A103,Breakdowns!$AA:$AA,\"=No\"),SUMIFS(Breakdowns!U:U,Breakdowns!$C:$C,\"=\"&$A103))","v":752151098},{"$f":"IF($P$1,SUMIFS(Breakdowns!W:W,Breakdowns!$C:$C,\"=\"&$A103,Breakdowns!$AA:$AA,\"=No\"),SUMIFS(Breakdowns!W:W,Breakdowns!$C:$C,\"=\"&$A103))","v":59863658},{"$f":"IF($P$1,SUMIFS(Breakdowns!Y:Y,Breakdowns!$C:$C,\"=\"&$A103,Breakdowns!$AA:$AA,\"=No\"),SUMIFS(Breakdowns!Y:Y,Breakdowns!$C:$C,\"=\"&$A103))","v":56387182}]
["OH","Ohio",null,null,null,{"$f":"IF($P$1,SUMIFS(Breakdowns!L:L,Breakdowns!$C:$C,\"=\"&$A104,Breakdowns!$AA:$AA,\"=No\"),SUMIFS(Breakdowns!L:L,Breakdowns!$C:$C,\"=\"&$A104))","v":2432},{"$f":"IF($P$1,SUMIFS(Breakdowns!M:M,Breakdowns!$C:$C,\"=\"&$A104,Breakdowns!$AA:$AA,\"=No\"),SUMIFS(Breakdowns!M:M,Breakdowns!$C:$C,\"=\"&$A104))","v":12611},{"$f":"IF($P$1,SUMIFS(Breakdowns!O:O,Breakdowns!$C:$C,\"=\"&$A104,Breakdowns!$AA:$AA,\"=No\"),SUMIFS(Breakdowns!O:O,Breakdowns!$C:$C,\"=\"&$A104))","v":9794},{"$f":"IF($P$1,SUMIFS(Breakdowns!Q:Q,Breakdowns!$C:$C,\"=\"&$A104,Breakdowns!$AA:$AA,\"=No\"),SUMIFS(Breakdowns!Q:Q,Breakdowns!$C:$C,\"=\"&$A104))","v":22405},{"$f":"IF($P$1,SUMIFS(Breakdowns!S:S,Breakdowns!$C:$C,\"=\"&$A104,Breakdowns!$AA:$AA,\"=No\"),SUMIFS(Breakdowns!S:S,Breakdowns!$C:$C,\"=\"&$A104))","v":100702575},{"$f":"IF($P$1,SUMIFS(Breakdowns!U:U,Breakdowns!$C:$C,\"=\"&$A104,Breakdowns!$AA:$AA,\"=No\"),SUMIFS(Breakdowns!U:U,Breakdowns!$C:$C,\"=\"&$A104))","v":86842641},{"$f":"IF($P$1,SUMIFS(Breakdowns!W:W,Breakdowns!$C:$C,\"=\"&$A104,Breakdowns!$AA:$AA,\"=No\"),SUMIFS(Breakdowns!W:W,Breakdowns!$C:$C,\"=\"&$A104))","v":2140902},{"$f":"IF($P$1,SUMIFS(Breakdowns!Y:Y,Breakdowns!$C:$C,\"=\"&$A104,Breakdowns!$AA:$AA,\"=No\"),SUMIFS(Breakdowns!Y:Y,Breakdowns!$C:$C,\"=\"&$A104))","v":2128137}]
["OK","Oklahoma",null,null,null,{"$f":"IF($P$1,SUMIFS(Breakdowns!L:L,Breakdowns!$C:$C,\"=\"&$A105,Breakdowns!$AA:$AA,\"=No\"),SUMIFS(Breakdowns!L:L,Breakdowns!$C:$C,\"=\"&$A105))","v":164},{"$f":"IF($P$1,SUMIFS(Breakdowns!M:M,Breakdowns!$C:$C,\"=\"&$A105,Breakdowns!$AA:$AA,\"=No\"),SUMIFS(Breakdowns!M:M,Breakdowns!$C:$C,\"=\"&$A105))","v":451},{"$f":"IF($P$1,SUMIFS(Breakdowns!O:O,Breakdowns!$C:$C,\"=\"&$A105,Breakdowns!$AA:$AA,\"=No\"),SUMIFS(Breakdowns!O:O,Breakdowns!$C:$C,\"=\"&$A105))","v":154},{"$f":"IF($P$1,SUMIFS(Breakdowns!Q:Q,Breakdowns!$C:$C,\"=\"&$A105,Breakdowns!$AA:$AA,\"=No\"),SUMIFS(Breakdowns!Q:Q,Breakdowns!$C:$C,\"=\"&$A105))","v":605},{"$f":"IF($P$1,SUMIFS(Breakdowns!S:S,Breakdowns!$C:$C,\"=\"&$A105,Breakdowns!$AA:$AA,\"=No\"),SUMIFS(Breakdowns!S:S,Breakdowns!$C:$C,\"=\"&$A105))","v":7764250},{"$f":"IF($P$1,SUMIFS(Breakdowns!U:U,Breakdowns!$C:$C,\"=\"&$A105,Breakdowns!$AA:$AA,\"=No\"),SUMIFS(Breakdowns!U:U,Breakdowns!$C:$C,\"=\"&$A105))","v":7339795},{"$f":"IF($P$1,SUMIFS(Breakdowns!W:W,Breakdowns!$C:$C,\"=\"&$A105,Breakdowns!$AA:$AA,\"=No\"),SUMIFS(Breakdowns!W:W,Breakdowns!$C:$C,\"=\"&$A105))","v":0},{"$f":"IF($P$1,SUMIFS(Breakdowns!Y:Y,Breakdowns!$C:$C,\"=\"&$A105,Breakdowns!$AA:$AA,\"=No\"),SUMIFS(Breakdowns!Y:Y,Breakdowns!$C:$C,\"=\"&$A105))","v":0}]
["OR","Oregon",null,null,null,{"$f":"IF($P$1,SUMIFS(Breakdowns!L:L,Breakdowns!$C:$C,\"=\"&$A106,Breakdowns!$AA:$AA,\"=No\"),SUMIFS(Breakdowns!L:L,Breakdowns!$C:$C,\"=\"&$A106))","v":1421},{"$f":"IF($P$1,SUMIFS(Breakdowns!M:M,Breakdowns!$C:$C,\"=\"&$A106,Breakdowns!$AA:$AA,\"=No\"),SUMIFS(Breakdowns!M:M,Breakdowns!$C:$C,\"=\"&$A106))","v":2678},{"$f":"IF($P$1,SUMIFS(Breakdowns!O:O,Breakdowns!$C:$C,\"=\"&$A106,Breakdowns!$AA:$AA,\"=No\"),SUMIFS(Breakdowns!O:O,Breakdowns!$C:$C,\"=\"&$A106))","v":6149},{"$f":"IF($P$1,SUMIFS(Breakdowns!Q:Q,Breakdowns!$C:$C,\"=\"&$A106,Breakdowns!$AA:$AA,\"=No\"),SUMIFS(Breakdowns!Q:Q,Breakdowns!$C:$C,\"=\"&$A106))","v":8827},{"$f":"IF($P$1,SUMIFS(Breakdowns!S:S,Breakdowns!$C:$C,\"=\"&$A106,Breakdowns!$AA:$AA,\"=No\"),SUMIFS(Breakdowns!S:S,Breakdowns!$C:$C,\"=\"&$A106))","v":58546134},{"$f":"IF($P$1,SUMIFS(Breakdowns!U:U,Breakdowns!$C:$C,\"=\"&$A106,Breakdowns!$AA:$AA,\"=No\"),SUMIFS(Breakdowns!U:U,Breakdowns!$C:$C,\"=\"&$A106))","v":52282088},{"$f":"IF($P$1,SUMIFS(Breakdowns!W:W,Breakdowns!$C:$C,\"=\"&$A106,Breakdowns!$AA:$AA,\"=No\"),SUMIFS(Breakdowns!W:W,Breakdowns!$C:$C,\"=\"&$A106))","v":5029302},{"$f":"IF($P$1,SUMIFS(Breakdowns!Y:Y,Breakdowns!$C:$C,\"=\"&$A106,Breakdowns!$AA:$AA,\"=No\"),SUMIFS(Breakdowns!Y:Y,Breakdowns!$C:$C,\"=\"&$A106))","v":4952641}]
["PA","Pennsylvania",null,null,null,{"$f":"IF($P$1,SUMIFS(Breakdowns!L:L,Breakdowns!$C:$C,\"=\"&$A107,Breakdowns!$AA:$AA,\"=No\"),SUMIFS(Breakdowns!L:L,Breakdowns!$C:$C,\"=\"&$A107))","v":4874},{"$f":"IF($P$1,SUMIFS(Breakdowns!M:M,Breakdowns!$C:$C,\"=\"&$A107,Breakdowns!$AA:$AA,\"=No\"),SUMIFS(Breakdowns!M:M,Breakdowns!$C:$C,\"=\"&$A107))","v":11231},{"$f":"IF($P$1,SUMIFS(Breakdowns!O:O,Breakdowns!$C:$C,\"=\"&$A107,Breakdowns!$AA:$AA,\"=No\"),SUMIFS(Breakdowns!O:O,Breakdowns!$C:$C,\"=\"&$A107))","v":12318},{"$f":"IF($P$1,SUMIFS(Breakdowns!Q:Q,Breakdowns!$C:$C,\"=\"&$A107,Breakdowns!$AA:$AA,\"=No\"),SUMIFS(Breakdowns!Q:Q,Breakdowns!$C:$C,\"=\"&$A107))","v":23549},{"$f":"IF($P$1,SUMIFS(Breakdowns!S:S,Breakdowns!$C:$C,\"=\"&$A107,Breakdowns!$AA:$AA,\"=No\"),SUMIFS(Breakdowns!S:S,Breakdowns!$C:$C,\"=\"&$A107))","v":201050544},{"$f":"IF($P$1,SUMIFS(Breakdowns!U:U,Breakdowns!$C:$C,\"=\"&$A107,Breakdowns!$AA:$AA,\"=No\"),SUMIFS(Breakdowns!U:U,Breakdowns!$C:$C,\"=\"&$A107))","v":177696394},{"$f":"IF($P$1,SUMIFS(Breakdowns!W:W,Breakdowns!$C:$C,\"=\"&$A107,Breakdowns!$AA:$AA,\"=No\"),SUMIFS(Breakdowns!W:W,Breakdowns!$C:$C,\"=\"&$A107))","v":14480539},{"$f":"IF($P$1,SUMIFS(Breakdowns!Y:Y,Breakdowns!$C:$C,\"=\"&$A107,Breakdowns!$AA:$AA,\"=No\"),SUMIFS(Breakdowns!Y:Y,Breakdowns!$C:$C,\"=\"&$A107))","v":13958243}]
["PR","Puerto Rico",null,null,null,{"$f":"IF($P$1,SUMIFS(Breakdowns!L:L,Breakdowns!$C:$C,\"=\"&$A108,Breakdowns!$AA:$AA,\"=No\"),SUMIFS(Breakdowns!L:L,Breakdowns!$C:$C,\"=\"&$A108))","v":186},{"$f":"IF($P$1,SUMIFS(Breakdowns!M:M,Breakdowns!$C:$C,\"=\"&$A108,Breakdowns!$AA:$AA,\"=No\"),SUMIFS(Breakdowns!M:M,Breakdowns!$C:$C,\"=\"&$A108))","v":3901},{"$f":"IF($P$1,SUMIFS(Breakdowns!O:O,Breakdowns!$C:$C,\"=\"&$A108,Breakdowns!$AA:$AA,\"=No\"),SUMIFS(Breakdowns!O:O,Breakdowns!$C:$C,\"=\"&$A108))","v":4520},{"$f":"IF($P$1,SUMIFS(Breakdowns!Q:Q,Breakdowns!$C:$C,\"=\"&$A108,Breakdowns!$AA:$AA,\"=No\"),SUMIFS(Breakdowns!Q:Q,Breakdowns!$C:$C,\"=\"&$A108))","v":8421},{"$f":"IF($P$1,SUMIFS(Breakdowns!S:S,Breakdowns!$C:$C,\"=\"&$A108,Breakdowns!$AA:$AA,\"=No\"),SUMIFS(Breakdowns!S:S,Breakdowns!$C:$C,\"=\"&$A108))","v":6502449},{"$f":"IF($P$1,SUMIFS(Breakdowns!U:U,Breakdowns!$C:$C,\"=\"&$A108,Breakdowns!$AA:$AA,\"=No\"),SUMIFS(Breakdowns!U:U,Breakdowns!$C:$C,\"=\"&$A108))","v":5827421},{"$f":"IF($P$1,SUMIFS(Breakdowns!W:W,Breakdowns!$C:$C,\"=\"&$A108,Breakdowns!$AA:$AA,\"=No\"),SUMIFS(Breakdowns!W:W,Breakdowns!$C:$C,\"=\"&$A108))","v":625384},{"$f":"IF($P$1,SUMIFS(Breakdowns!Y:Y,Breakdowns!$C:$C,\"=\"&$A108,Breakdowns!$AA:$AA,\"=No\"),SUMIFS(Breakdowns!Y:Y,Breakdowns!$C:$C,\"=\"&$A108))","v":592614}]
["RI","Rhode Island",null,null,null,{"$f":"IF($P$1,SUMIFS(Breakdowns!L:L,Breakdowns!$C:$C,\"=\"&$A109,Breakdowns!$AA:$AA,\"=No\"),SUMIFS(Breakdowns!L:L,Breakdowns!$C:$C,\"=\"&$A109))","v":283},{"$f":"IF($P$1,SUMIFS(Breakdowns!M:M,Breakdowns!$C:$C,\"=\"&$A109,Breakdowns!$AA:$AA,\"=No\"),SUMIFS(Breakdowns!M:M,Breakdowns!$C:$C,\"=\"&$A109))","v":774},{"$f":"IF($P$1,SUMIFS(Breakdowns!O:O,Breakdowns!$C:$C,\"=\"&$A109,Breakdowns!$AA:$AA,\"=No\"),SUMIFS(Breakdowns!O:O,Breakdowns!$C:$C,\"=\"&$A109))","v":1412},{"$f":"IF($P$1,SUMIFS(Breakdowns!Q:Q,Breakdowns!$C:$C,\"=\"&$A109,Breakdowns!$AA:$AA,\"=No\"),SUMIFS(Breakdowns!Q:Q,Breakdowns!$C:$C,\"=\"&$A109))","v":2186},{"$f":"IF($P$1,SUMIFS(Breakdowns!S:S,Breakdowns!$C:$C,\"=\"&$A109,Breakdowns!$AA:$AA,\"=No\"),SUMIFS(Breakdowns!S:S,Breakdowns!$C:$C,\"=\"&$A109))","v":13052039},{"$f":"IF($P$1,SUMIFS(Breakdowns!U:U,Breakdowns!$C:$C,\"=\"&$A109,Breakdowns!$AA:$AA,\"=No\"),SUMIFS(Breakdowns!U:U,Breakdowns!$C:$C,\"=\"&$A109))","v":11029508},{"$f":"IF($P$1,SUMIFS(Breakdowns!W:W,Breakdowns!$C:$C,\"=\"&$A109,Breakdowns!$AA:$AA,\"=No\"),SUMIFS(Breakdowns!W:W,Breakdowns!$C:$C,\"=\"&$A109))","v":0},{"$f":"IF($P$1,SUMIFS(Breakdowns!Y:Y,Breakdowns!$C:$C,\"=\"&$A109,Breakdowns!$AA:$AA,\"=No\"),SUMIFS(Breakdowns!Y:Y,Breakdowns!$C:$C,\"=\"&$A109))","v":0}]
["SC","South Carolina",null,null,null,{"$f":"IF($P$1,SUMIFS(Breakdowns!L:L,Breakdowns!$C:$C,\"=\"&$A110,Breakdowns!$AA:$AA,\"=No\"),SUMIFS(Breakdowns!L:L,Breakdowns!$C:$C,\"=\"&$A110))","v":273},{"$f":"IF($P$1,SUMIFS(Breakdowns!M:M,Breakdowns!$C:$C,\"=\"&$A110,Breakdowns!$AA:$AA,\"=No\"),SUMIFS(Breakdowns!M:M,Breakdowns!$C:$C,\"=\"&$A110))","v":1538},{"$f":"IF($P$1,SUMIFS(Breakdowns!O:O,Breakdowns!$C:$C,\"=\"&$A110,Breakdowns!$AA:$AA,\"=No\"),SUMIFS(Breakdowns!O:O,Breakdowns!$C:$C,\"=\"&$A110))","v":1107},{"$f":"IF($P$1,SUMIFS(Breakdowns!Q:Q,Breakdowns!$C:$C,\"=\"&$A110,Breakdowns!$AA:$AA,\"=No\"),SUMIFS(Breakdowns!Q:Q,Breakdowns!$C:$C,\"=\"&$A110))","v":2645},{"$f":"IF($P$1,SUMIFS(Breakdowns!S:S,Breakdowns!$C:$C,\"=\"&$A110,Breakdowns!$AA:$AA,\"=No\"),SUMIFS(Breakdowns!S:S,Breakdowns!$C:$C,\"=\"&$A110))","v":10938967},{"$f":"IF($P$1,SUMIFS(Breakdowns!U:U,Breakdowns!$C:$C,\"=\"&$A110,Breakdowns!$AA:$AA,\"=No\"),SUMIFS(Breakdowns!U:U,Breakdowns!$C:$C,\"=\"&$A110))","v":10183042},{"$f":"IF($P$1,SUMIFS(Breakdowns!W:W,Breakdowns!$C:$C,\"=\"&$A110,Breakdowns!$AA:$AA,\"=No\"),SUMIFS(Breakdowns!W:W,Breakdowns!$C:$C,\"=\"&$A110))","v":0},{"$f":"IF($P$1,SUMIFS(Breakdowns!Y:Y,Breakdowns!$C:$C,\"=\"&$A110,Breakdowns!$AA:$AA,\"=No\"),SUMIFS(Breakdowns!Y:Y,Breakdowns!$C:$C,\"=\"&$A110))","v":0}]
["SD","South Dakota",null,null,null,{"$f":"IF($P$1,SUMIFS(Breakdowns!L:L,Breakdowns!$C:$C,\"=\"&$A111,Breakdowns!$AA:$AA,\"=No\"),SUMIFS(Breakdowns!L:L,Breakdowns!$C:$C,\"=\"&$A111))","v":42},{"$f":"IF($P$1,SUMIFS(Breakdowns!M:M,Breakdowns!$C:$C,\"=\"&$A111,Breakdowns!$AA:$AA,\"=No\"),SUMIFS(Breakdowns!M:M,Breakdowns!$C:$C,\"=\"&$A111))","v":47},{"$f":"IF($P$1,SUMIFS(Breakdowns!O:O,Breakdowns!$C:$C,\"=\"&$A111,Breakdowns!$AA:$AA,\"=No\"),SUMIFS(Breakdowns!O:O,Breakdowns!$C:$C,\"=\"&$A111))","v":56},{"$f":"IF($P$1,SUMIFS(Breakdowns!Q:Q,Breakdowns!$C:$C,\"=\"&$A111,Breakdowns!$AA:$AA,\"=No\"),SUMIFS(Breakdowns!Q:Q,Breakdowns!$C:$C,\"=\"&$A111))","v":103},{"$f":"IF($P$1,SUMIFS(Breakdowns!S:S,Breakdowns!$C:$C,\"=\"&$A111,Breakdowns!$AA:$AA,\"=No\"),SUMIFS(Breakdowns!S:S,Breakdowns!$C:$C,\"=\"&$A111))","v":1342102},{"$f":"IF($P$1,SUMIFS(Breakdowns!U:U,Breakdowns!$C:$C,\"=\"&$A111,Breakdowns!$AA:$AA,\"=No\"),SUMIFS(Breakdowns!U:U,Breakdowns!$C:$C,\"=\"&$A111))","v":1323018},{"$f":"IF($P$1,SUMIFS(Breakdowns!W:W,Breakdowns!$C:$C,\"=\"&$A111,Breakdowns!$AA:$AA,\"=No\"),SUMIFS(Breakdowns!W:W,Breakdowns!$C:$C,\"=\"&$A111))","v":0},{"$f":"IF($P$1,SUMIFS(Breakdowns!Y:Y,Breakdowns!$C:$C,\"=\"&$A111,Breakdowns!$AA:$AA,\"=No\"),SUMIFS(Breakdowns!Y:Y,Breakdowns!$C:$C,\"=\"&$A111))","v":0}]
["TN","Tennessee",null,null,null,{"$f":"IF($P$1,SUMIFS(Breakdowns!L:L,Breakdowns!$C:$C,\"=\"&$A112,Breakdowns!$AA:$AA,\"=No\"),SUMIFS(Breakdowns!L:L,Breakdowns!$C:$C,\"=\"&$A112))","v":658},{"$f":"IF($P$1,SUMIFS(Breakdowns!M:M,Breakdowns!$C:$C,\"=\"&$A112,Breakdowns!$AA:$AA,\"=No\"),SUMIFS(Breakdowns!M:M,Breakdowns!$C:$C,\"=\"&$A112))","v":1830},{"$f":"IF($P$1,SUMIFS(Breakdowns!O:O,Breakdowns!$C:$C,\"=\"&$A112,Breakdowns!$AA:$AA,\"=No\"),SUMIFS(Breakdowns!O:O,Breakdowns!$C:$C,\"=\"&$A112))","v":2696},{"$f":"IF($P$1,SUMIFS(Breakdowns!Q:Q,Breakdowns!$C:$C,\"=\"&$A112,Breakdowns!$AA:$AA,\"=No\"),SUMIFS(Breakdowns!Q:Q,Breakdowns!$C:$C,\"=\"&$A112))","v":4526},{"$f":"IF($P$1,SUMIFS(Breakdowns!S:S,Breakdowns!$C:$C,\"=\"&$A112,Breakdowns!$AA:$AA,\"=No\"),SUMIFS(Breakdowns!S:S,Breakdowns!$C:$C,\"=\"&$A112))","v":27830918},{"$f":"IF($P$1,SUMIFS(Breakdowns!U:U,Breakdowns!$C:$C,\"=\"&$A112,Breakdowns!$AA:$AA,\"=No\"),SUMIFS(Breakdowns!U:U,Breakdowns!$C:$C,\"=\"&$A112))","v":24503900},{"$f":"IF($P$1,SUMIFS(Breakdowns!W:W,Breakdowns!$C:$C,\"=\"&$A112,Breakdowns!$AA:$AA,\"=No\"),SUMIFS(Breakdowns!W:W,Breakdowns!$C:$C,\"=\"&$A112))","v":108793},{"$f":"IF($P$1,SUMIFS(Breakdowns!Y:Y,Breakdowns!$C:$C,\"=\"&$A112,Breakdowns!$AA:$AA,\"=No\"),SUMIFS(Breakdowns!Y:Y,Breakdowns!$C:$C,\"=\"&$A112))","v":103811}]
["TX","Texas",null,null,null,{"$f":"IF($P$1,SUMIFS(Breakdowns!L:L,Breakdowns!$C:$C,\"=\"&$A113,Breakdowns!$AA:$AA,\"=No\"),SUMIFS(Breakdowns!L:L,Breakdowns!$C:$C,\"=\"&$A113))","v":6037},{"$f":"IF($P$1,SUMIFS(Breakdowns!M:M,Breakdowns!$C:$C,\"=\"&$A113,Breakdowns!$AA:$AA,\"=No\"),SUMIFS(Breakdowns!M:M,Breakdowns!$C:$C,\"=\"&$A113))","v":15770},{"$f":"IF($P$1,SUMIFS(Breakdowns!O:O,Breakdowns!$C:$C,\"=\"&$A113,Breakdowns!$AA:$AA,\"=No\"),SUMIFS(Breakdowns!O:O,Breakdowns!$C:$C,\"=\"&$A113))","v":13745},{"$f":"IF($P$1,SUMIFS(Breakdowns!Q:Q,Breakdowns!$C:$C,\"=\"&$A113,Breakdowns!$AA:$AA,\"=No\"),SUMIFS(Breakdowns!Q:Q,Breakdowns!$C:$C,\"=\"&$A113))","v":29515},{"$f":"IF($P$1,SUMIFS(Breakdowns!S:S,Breakdowns!$C:$C,\"=\"&$A113,Breakdowns!$AA:$AA,\"=No\"),SUMIFS(Breakdowns!S:S,Breakdowns!$C:$C,\"=\"&$A113))","v":257378607},{"$f":"IF($P$1,SUMIFS(Breakdowns!U:U,Breakdowns!$C:$C,\"=\"&$A113,Breakdowns!$AA:$AA,\"=No\"),SUMIFS(Breakdowns!U:U,Breakdowns!$C:$C,\"=\"&$A113))","v":226568329},{"$f":"IF($P$1,SUMIFS(Breakdowns!W:W,Breakdowns!$C:$C,\"=\"&$A113,Breakdowns!$AA:$AA,\"=No\"),SUMIFS(Breakdowns!W:W,Breakdowns!$C:$C,\"=\"&$A113))","v":8770142},{"$f":"IF($P$1,SUMIFS(Breakdowns!Y:Y,Breakdowns!$C:$C,\"=\"&$A113,Breakdowns!$AA:$AA,\"=No\"),SUMIFS(Breakdowns!Y:Y,Breakdowns!$C:$C,\"=\"&$A113))","v":8586635}]
["UT","Utah",null,null,null,{"$f":"IF($P$1,SUMIFS(Breakdowns!L:L,Breakdowns!$C:$C,\"=\"&$A114,Breakdowns!$AA:$AA,\"=No\"),SUMIFS(Breakdowns!L:L,Breakdowns!$C:$C,\"=\"&$A114))","v":1109},{"$f":"IF($P$1,SUMIFS(Breakdowns!M:M,Breakdowns!$C:$C,\"=\"&$A114,Breakdowns!$AA:$AA,\"=No\"),SUMIFS(Breakdowns!M:M,Breakdowns!$C:$C,\"=\"&$A114))","v":1429},{"$f":"IF($P$1,SUMIFS(Breakdowns!O:O,Breakdowns!$C:$C,\"=\"&$A114,Breakdowns!$AA:$AA,\"=No\"),SUMIFS(Breakdowns!O:O,Breakdowns!$C:$C,\"=\"&$A114))","v":902},{"$f":"IF($P$1,SUMIFS(Breakdowns!Q:Q,Breakdowns!$C:$C,\"=\"&$A114,Breakdowns!$AA:$AA,\"=No\"),SUMIFS(Breakdowns!Q:Q,Breakdowns!$C:$C,\"=\"&$A114))","v":2331},{"$f":"IF($P$1,SUMIFS(Breakdowns!S:S,Breakdowns!$C:$C,\"=\"&$A114,Breakdowns!$AA:$AA,\"=No\"),SUMIFS(Breakdowns!S:S,Breakdowns!$C:$C,\"=\"&$A114))","v":42108434},{"$f":"IF($P$1,SUMIFS(Breakdowns!U:U,Breakdowns!$C:$C,\"=\"&$A114,Breakdowns!$AA:$AA,\"=No\"),SUMIFS(Breakdowns!U:U,Breakdowns!$C:$C,\"=\"&$A114))","v":38899486},{"$f":"IF($P$1,SUMIFS(Breakdowns!W:W,Breakdowns!$C:$C,\"=\"&$A114,Breakdowns!$AA:$AA,\"=No\"),SUMIFS(Breakdowns!W:W,Breakdowns!$C:$C,\"=\"&$A114))","v":4328385},{"$f":"IF($P$1,SUMIFS(Breakdowns!Y:Y,Breakdowns!$C:$C,\"=\"&$A114,Breakdowns!$AA:$AA,\"=No\"),SUMIFS(Breakdowns!Y:Y,Breakdowns!$C:$C,\"=\"&$A114))","v":4278468}]
["VA","Virginia",null,null,null,{"$f":"IF($P$1,SUMIFS(Breakdowns!L:L,Breakdowns!$C:$C,\"=\"&$A115,Breakdowns!$AA:$AA,\"=No\"),SUMIFS(Breakdowns!L:L,Breakdowns!$C:$C,\"=\"&$A115))","v":2058},{"$f":"IF($P$1,SUMIFS(Breakdowns!M:M,Breakdowns!$C:$C,\"=\"&$A115,Breakdowns!$AA:$AA,\"=No\"),SUMIFS(Breakdowns!M:M,Breakdowns!$C:$C,\"=\"&$A115))","v":4723},{"$f":"IF($P$1,SUMIFS(Breakdowns!O:O,Breakdowns!$C:$C,\"=\"&$A115,Breakdowns!$AA:$AA,\"=No\"),SUMIFS(Breakdowns!O:O,Breakdowns!$C:$C,\"=\"&$A115))","v":4704},{"$f":"IF($P$1,SUMIFS(Breakdowns!Q:Q,Breakdowns!$C:$C,\"=\"&$A115,Breakdowns!$AA:$AA,\"=No\"),SUMIFS(Breakdowns!Q:Q,Breakdowns!$C:$C,\"=\"&$A115))","v":9427},{"$f":"IF($P$1,SUMIFS(Breakdowns!S:S,Breakdowns!$C:$C,\"=\"&$A115,Breakdowns!$AA:$AA,\"=No\"),SUMIFS(Breakdowns!S:S,Breakdowns!$C:$C,\"=\"&$A115))","v":74383789},{"$f":"IF($P$1,SUMIFS(Breakdowns!U:U,Breakdowns!$C:$C,\"=\"&$A115,Breakdowns!$AA:$AA,\"=No\"),SUMIFS(Breakdowns!U:U,Breakdowns!$C:$C,\"=\"&$A115))","v":66073383},{"$f":"IF($P$1,SUMIFS(Breakdowns!W:W,Breakdowns!$C:$C,\"=\"&$A115,Breakdowns!$AA:$AA,\"=No\"),SUMIFS(Breakdowns!W:W,Breakdowns!$C:$C,\"=\"&$A115))","v":785089},{"$f":"IF($P$1,SUMIFS(Breakdowns!Y:Y,Breakdowns!$C:$C,\"=\"&$A115,Breakdowns!$AA:$AA,\"=No\"),SUMIFS(Breakdowns!Y:Y,Breakdowns!$C:$C,\"=\"&$A115))","v":746400}]
["VI","Virgin Islands",null,null,null,{"$f":"IF($P$1,SUMIFS(Breakdowns!L:L,Breakdowns!$C:$C,\"=\"&$A116,Breakdowns!$AA:$AA,\"=No\"),SUMIFS(Breakdowns!L:L,Breakdowns!$C:$C,\"=\"&$A116))","v":0},{"$f":"IF($P$1,SUMIFS(Breakdowns!M:M,Breakdowns!$C:$C,\"=\"&$A116,Breakdowns!$AA:$AA,\"=No\"),SUMIFS(Breakdowns!M:M,Breakdowns!$C:$C,\"=\"&$A116))","v":0},{"$f":"IF($P$1,SUMIFS(Breakdowns!O:O,Breakdowns!$C:$C,\"=\"&$A116,Breakdowns!$AA:$AA,\"=No\"),SUMIFS(Breakdowns!O:O,Breakdowns!$C:$C,\"=\"&$A116))","v":0},{"$f":"IF($P$1,SUMIFS(Breakdowns!Q:Q,Breakdowns!$C:$C,\"=\"&$A116,Breakdowns!$AA:$AA,\"=No\"),SUMIFS(Breakdowns!Q:Q,Breakdowns!$C:$C,\"=\"&$A116))","v":0},{"$f":"IF($P$1,SUMIFS(Breakdowns!S:S,Breakdowns!$C:$C,\"=\"&$A116,Breakdowns!$AA:$AA,\"=No\"),SUMIFS(Breakdowns!S:S,Breakdowns!$C:$C,\"=\"&$A116))","v":0},{"$f":"IF($P$1,SUMIFS(Breakdowns!U:U,Breakdowns!$C:$C,\"=\"&$A116,Breakdowns!$AA:$AA,\"=No\"),SUMIFS(Breakdowns!U:U,Breakdowns!$C:$C,\"=\"&$A116))","v":0},{"$f":"IF($P$1,SUMIFS(Breakdowns!W:W,Breakdowns!$C:$C,\"=\"&$A116,Breakdowns!$AA:$AA,\"=No\"),SUMIFS(Breakdowns!W:W,Breakdowns!$C:$C,\"=\"&$A116))","v":0},{"$f":"IF($P$1,SUMIFS(Breakdowns!Y:Y,Breakdowns!$C:$C,\"=\"&$A116,Breakdowns!$AA:$AA,\"=No\"),SUMIFS(Breakdowns!Y:Y,Breakdowns!$C:$C,\"=\"&$A116))","v":0}]
["VT","Vermont",null,null,null,{"$f":"IF($P$1,SUMIFS(Breakdowns!L:L,Breakdowns!$C:$C,\"=\"&$A117,Breakdowns!$AA:$AA,\"=No\"),SUMIFS(Breakdowns!L:L,Breakdowns!$C:$C,\"=\"&$A117))","v":74},{"$f":"IF($P$1,SUMIFS(Breakdowns!M:M,Breakdowns!$C:$C,\"=\"&$A117,Breakdowns!$AA:$AA,\"=No\"),SUMIFS(Breakdowns!M:M,Breakdowns!$C:$C,\"=\"&$A117))","v":106},{"$f":"IF($P$1,SUMIFS(Breakdowns!O:O,Breakdowns!$C:$C,\"=\"&$A117,Breakdowns!$AA:$AA,\"=No\"),SUMIFS(Breakdowns!O:O,Breakdowns!$C:$C,\"=\"&$A117))","v":109},{"$f":"IF($P$1,SUMIFS(Breakdowns!Q:Q,Breakdowns!$C:$C,\"=\"&$A117,Breakdowns!$AA:$AA,\"=No\"),SUMIFS(Breakdowns!Q:Q,Breakdowns!$C:$C,\"=\"&$A117))","v":215},{"$f":"IF($P$1,SUMIFS(Breakdowns!S:S,Breakdowns!$C:$C,\"=\"&$A117,Breakdowns!$AA:$AA,\"=No\"),SUMIFS(Breakdowns!S:S,Breakdowns!$C:$C,\"=\"&$A117))","v":2205158},{"$f":"IF($P$1,SUMIFS(Breakdowns!U:U,Breakdowns!$C:$C,\"=\"&$A117,Breakdowns!$AA:$AA,\"=No\"),SUMIFS(Breakdowns!U:U,Breakdowns!$C:$C,\"=\"&$A117))","v":1966632},{"$f":"IF($P$1,SUMIFS(Breakdowns!W:W,Breakdowns!$C:$C,\"=\"&$A117,Breakdowns!$AA:$AA,\"=No\"),SUMIFS(Breakdowns!W:W,Breakdowns!$C:$C,\"=\"&$A117))","v":0},{"$f":"IF($P$1,SUMIFS(Breakdowns!Y:Y,Breakdowns!$C:$C,\"=\"&$A117,Breakdowns!$AA:$AA,\"=No\"),SUMIFS(Breakdowns!Y:Y,Breakdowns!$C:$C,\"=\"&$A117))","v":0}]
["WA","Washington",null,null,null,{"$f":"IF($P$1,SUMIFS(Breakdowns!L:L,Breakdowns!$C:$C,\"=\"&$A118,Breakdowns!$AA:$AA,\"=No\"),SUMIFS(Breakdowns!L:L,Breakdowns!$C:$C,\"=\"&$A118))","v":6125},{"$f":"IF($P$1,SUMIFS(Breakdowns!M:M,Breakdowns!$C:$C,\"=\"&$A118,Breakdowns!$AA:$AA,\"=No\"),SUMIFS(Breakdowns!M:M,Breakdowns!$C:$C,\"=\"&$A118))","v":15183},{"$f":"IF($P$1,SUMIFS(Breakdowns!O:O,Breakdowns!$C:$C,\"=\"&$A118,Breakdowns!$AA:$AA,\"=No\"),SUMIFS(Breakdowns!O:O,Breakdowns!$C:$C,\"=\"&$A118))","v":13343},{"$f":"IF($P$1,SUMIFS(Breakdowns!Q:Q,Breakdowns!$C:$C,\"=\"&$A118,Breakdowns!$AA:$AA,\"=No\"),SUMIFS(Breakdowns!Q:Q,Breakdowns!$C:$C,\"=\"&$A118))","v":28526},{"$f":"IF($P$1,SUMIFS(Breakdowns!S:S,Breakdowns!$C:$C,\"=\"&$A118,Breakdowns!$AA:$AA,\"=No\"),SUMIFS(Breakdowns!S:S,Breakdowns!$C:$C,\"=\"&$A118))","v":172128973},{"$f":"IF($P$1,SUMIFS(Breakdowns!U:U,Breakdowns!$C:$C,\"=\"&$A118,Breakdowns!$AA:$AA,\"=No\"),SUMIFS(Breakdowns!U:U,Breakdowns!$C:$C,\"=\"&$A118))","v":148717194},{"$f":"IF($P$1,SUMIFS(Breakdowns!W:W,Breakdowns!$C:$C,\"=\"&$A118,Breakdowns!$AA:$AA,\"=No\"),SUMIFS(Breakdowns!W:W,Breakdowns!$C:$C,\"=\"&$A118))","v":2567069},{"$f":"IF($P$1,SUMIFS(Breakdowns!Y:Y,Breakdowns!$C:$C,\"=\"&$A118,Breakdowns!$AA:$AA,\"=No\"),SUMIFS(Breakdowns!Y:Y,Breakdowns!$C:$C,\"=\"&$A118))","v":2440099}]
["WI","Wisconsin",null,null,null,{"$f":"IF($P$1,SUMIFS(Breakdowns!L:L,Breakdowns!$C:$C,\"=\"&$A119,Breakdowns!$AA:$AA,\"=No\"),SUMIFS(Breakdowns!L:L,Breakdowns!$C:$C,\"=\"&$A119))","v":1095},{"$f":"IF($P$1,SUMIFS(Breakdowns!M:M,Breakdowns!$C:$C,\"=\"&$A119,Breakdowns!$AA:$AA,\"=No\"),SUMIFS(Breakdowns!M:M,Breakdowns!$C:$C,\"=\"&$A119))","v":1329},{"$f":"IF($P$1,SUMIFS(Breakdowns!O:O,Breakdowns!$C:$C,\"=\"&$A119,Breakdowns!$AA:$AA,\"=No\"),SUMIFS(Breakdowns!O:O,Breakdowns!$C:$C,\"=\"&$A119))","v":2283},{"$f":"IF($P$1,SUMIFS(Breakdowns!Q:Q,Breakdowns!$C:$C,\"=\"&$A119,Breakdowns!$AA:$AA,\"=No\"),SUMIFS(Breakdowns!Q:Q,Breakdowns!$C:$C,\"=\"&$A119))","v":3612},{"$f":"IF($P$1,SUMIFS(Breakdowns!S:S,Breakdowns!$C:$C,\"=\"&$A119,Breakdowns!$AA:$AA,\"=No\"),SUMIFS(Breakdowns!S:S,Breakdowns!$C:$C,\"=\"&$A119))","v":44088326},{"$f":"IF($P$1,SUMIFS(Breakdowns!U:U,Breakdowns!$C:$C,\"=\"&$A119,Breakdowns!$AA:$AA,\"=No\"),SUMIFS(Breakdowns!U:U,Breakdowns!$C:$C,\"=\"&$A119))","v":39293753},{"$f":"IF($P$1,SUMIFS(Breakdowns!W:W,Breakdowns!$C:$C,\"=\"&$A119,Breakdowns!$AA:$AA,\"=No\"),SUMIFS(Breakdowns!W:W,Breakdowns!$C:$C,\"=\"&$A119))","v":17594},{"$f":"IF($P$1,SUMIFS(Breakdowns!Y:Y,Breakdowns!$C:$C,\"=\"&$A119,Breakdowns!$AA:$AA,\"=No\"),SUMIFS(Breakdowns!Y:Y,Breakdowns!$C:$C,\"=\"&$A119))","v":17523}]
["WV","West Virginia",null,null,null,{"$f":"IF($P$1,SUMIFS(Breakdowns!L:L,Breakdowns!$C:$C,\"=\"&$A120,Breakdowns!$AA:$AA,\"=No\"),SUMIFS(Breakdowns!L:L,Breakdowns!$C:$C,\"=\"&$A120))","v":155},{"$f":"IF($P$1,SUMIFS(Breakdowns!M:M,Breakdowns!$C:$C,\"=\"&$A120,Breakdowns!$AA:$AA,\"=No\"),SUMIFS(Breakdowns!M:M,Breakdowns!$C:$C,\"=\"&$A120))","v":587},{"$f":"IF($P$1,SUMIFS(Breakdowns!O:O,Breakdowns!$C:$C,\"=\"&$A120,Breakdowns!$AA:$AA,\"=No\"),SUMIFS(Breakdowns!O:O,Breakdowns!$C:$C,\"=\"&$A120))","v":1515},{"$f":"IF($P$1,SUMIFS(Breakdowns!Q:Q,Breakdowns!$C:$C,\"=\"&$A120,Breakdowns!$AA:$AA,\"=No\"),SUMIFS(Breakdowns!Q:Q,Breakdowns!$C:$C,\"=\"&$A120))","v":2102},{"$f":"IF($P$1,SUMIFS(Breakdowns!S:S,Breakdowns!$C:$C,\"=\"&$A120,Breakdowns!$AA:$AA,\"=No\"),SUMIFS(Breakdowns!S:S,Breakdowns!$C:$C,\"=\"&$A120))","v":5359579},{"$f":"IF($P$1,SUMIFS(Breakdowns!U:U,Breakdowns!$C:$C,\"=\"&$A120,Breakdowns!$AA:$AA,\"=No\"),SUMIFS(Breakdowns!U:U,Breakdowns!$C:$C,\"=\"&$A120))","v":5184351},{"$f":"IF($P$1,SUMIFS(Breakdowns!W:W,Breakdowns!$C:$C,\"=\"&$A120,Breakdowns!$AA:$AA,\"=No\"),SUMIFS(Breakdowns!W:W,Breakdowns!$C:$C,\"=\"&$A120))","v":676717},{"$f":"IF($P$1,SUMIFS(Breakdowns!Y:Y,Breakdowns!$C:$C,\"=\"&$A120,Breakdowns!$AA:$AA,\"=No\"),SUMIFS(Breakdowns!Y:Y,Breakdowns!$C:$C,\"=\"&$A120))","v":668979}]
["WY","Wyoming",null,null,null,{"$f":"IF($P$1,SUMIFS(Breakdowns!L:L,Breakdowns!$C:$C,\"=\"&$A121,Breakdowns!$AA:$AA,\"=No\"),SUMIFS(Breakdowns!L:L,Breakdowns!$C:$C,\"=\"&$A121))","v":0},{"$f":"IF($P$1,SUMIFS(Breakdowns!M:M,Breakdowns!$C:$C,\"=\"&$A121,Breakdowns!$AA:$AA,\"=No\"),SUMIFS(Breakdowns!M:M,Breakdowns!$C:$C,\"=\"&$A121))","v":0},{"$f":"IF($P$1,SUMIFS(Breakdowns!O:O,Breakdowns!$C:$C,\"=\"&$A121,Breakdowns!$AA:$AA,\"=No\"),SUMIFS(Breakdowns!O:O,Breakdowns!$C:$C,\"=\"&$A121))","v":0},{"$f":"IF($P$1,SUMIFS(Breakdowns!Q:Q,Breakdowns!$C:$C,\"=\"&$A121,Breakdowns!$AA:$AA,\"=No\"),SUMIFS(Breakdowns!Q:Q,Breakdowns!$C:$C,\"=\"&$A121))","v":0},{"$f":"IF($P$1,SUMIFS(Breakdowns!S:S,Breakdowns!$C:$C,\"=\"&$A121,Breakdowns!$AA:$AA,\"=No\"),SUMIFS(Breakdowns!S:S,Breakdowns!$C:$C,\"=\"&$A121))","v":0},{"$f":"IF($P$1,SUMIFS(Breakdowns!U:U,Breakdowns!$C:$C,\"=\"&$A121,Breakdowns!$AA:$AA,\"=No\"),SUMIFS(Breakdowns!U:U,Breakdowns!$C:$C,\"=\"&$A121))","v":0},{"$f":"IF($P$1,SUMIFS(Breakdowns!W:W,Breakdowns!$C:$C,\"=\"&$A121,Breakdowns!$AA:$AA,\"=No\"),SUMIFS(Breakdowns!W:W,Breakdowns!$C:$C,\"=\"&$A121))","v":0},{"$f":"IF($P$1,SUMIFS(Breakdowns!Y:Y,Breakdowns!$C:$C,\"=\"&$A121,Breakdowns!$AA:$AA,\"=No\"),SUMIFS(Breakdowns!Y:Y,Breakdowns!$C:$C,\"=\"&$A121))","v":0}]